tamaya-commits mailing list archives

Site index · List index
Message view « Date » · « Thread »
Top « Date » · « Thread »
From Apache Jenkins Server <jenk...@builds.apache.org>
Subject Build failed in Jenkins: Tamaya-Sandbox-Master #459
Date Mon, 13 Mar 2017 00:22:52 GMT
See <https://builds.apache.org/job/Tamaya-Sandbox-Master/459/display/redirect>

------------------------------------------
[...truncated 3.53 KB...]
Executing Maven:  -B -f <https://builds.apache.org/job/Tamaya-Sandbox-Master/ws/pom.xml>
-Dmaven.repo.local=/home/jenkins/jenkins-slave/maven-repositories/1 clean install deploy -Dweld.version=2.3.2.Final
[INFO] Scanning for projects...
[WARNING] 
[WARNING] Some problems were encountered while building the effective model for org.apache.tamaya.ext:tamaya-osgi_alpha:jar:0.3-incubating-SNAPSHOT
[WARNING] 'dependencies.dependency.(groupId:artifactId:type:classifier)' must be unique: org.ops4j.pax.exam:pax-exam-junit4:jar
-> duplicate declaration of version (?) @ org.apache.tamaya.ext:tamaya-osgi_alpha:[unknown-version],
<https://builds.apache.org/job/Tamaya-Sandbox-Master/ws/osgi/common/pom.xml,> line 120,
column 21
[WARNING] 
[WARNING] It is highly recommended to fix these problems because they threaten the stability
of your build.
[WARNING] 
[WARNING] For this reason, future Maven versions might no longer support building such malformed
projects.
[WARNING] 
[INFO] ------------------------------------------------------------------------
[INFO] Reactor Build Order:
[INFO] 
[INFO] Apache Tamaya Sandbox
[INFO] Apache Tamaya Modules - Hazelcast PropertySource
[INFO] Apache Tamaya Modules - Apache Commons
[INFO] Apache Tamaya Modules - Joda-Time Support
[INFO] Apache Tamaya Modules - Usage tracker
[INFO] Apache Tamaya Modules - Validation
[INFO] Apache Tamaya Modules - Remote PropertySource
[INFO] Apache Tamaya Modules - Configured System Properties
[INFO] Apache Tamaya Modules - etcd PropertySource
[INFO] Apache Tamaya Modules - Consul
[INFO] Apache Tamaya Modules - Apache Camel Support
[INFO] Apache Tamaya Modules - PropertySources
[INFO] Apache Tamaya :: OSGi Integration :: ALL
[INFO] Apache Tamaya :: OSGi Integration :: ConfigAdmin
[INFO] Apache Tamaya Modules - JMX Support
[INFO] Apache Tamaya Modules - Metamodel
[INFO] Apache Tamaya Modules - Units of Measurement Support
[INFO]                                                                         
[INFO] ------------------------------------------------------------------------
[INFO] Building Apache Tamaya Sandbox 0.3-incubating-SNAPSHOT
[INFO] ------------------------------------------------------------------------
[INFO] 
[INFO] --- maven-clean-plugin:3.0.0:clean (default-clean) @ tamaya-sandbox ---
[INFO] Deleting <https://builds.apache.org/job/Tamaya-Sandbox-Master/ws/target>
[INFO] 
[INFO] --- maven-enforcer-plugin:1.4.1:enforce (enforce-versions) @ tamaya-sandbox ---
[INFO] 
[INFO] --- apache-rat-plugin:0.12:check (default) @ tamaya-sandbox ---
[INFO] Enabled default license matchers.
[INFO] Will parse SCM ignores for exclusions...
[INFO] Parsing exclusions from <https://builds.apache.org/job/Tamaya-Sandbox-Master/ws/.gitignore>
[INFO] Finished adding exclusions from SCM ignore files.
[INFO] 89 implicit excludes (use -debug for more details).
[INFO] Exclude: **/*banner.txt
[INFO] Exclude: banner.txt
[INFO] Exclude: .git
[INFO] Exclude: derby.log
[INFO] Exclude: **/bootstrap-*
[INFO] Exclude: **/js/jquery-*
[INFO] Exclude: **/*.json
[INFO] Exclude: **/*.md
[INFO] Exclude: **/*.md.vm
[INFO] Exclude: src/site/asciidoc/temp-properties-files-for-site/attributes.adoc
[INFO] Exclude: readme/**
[INFO] 1 resources included (use -debug for more details)
[INFO] Rat check: Summary over all files. Unapproved: 0, unknown: 0, generated: 0, approved:
1 licenses.
[INFO] 
[INFO] --- maven-remote-resources-plugin:1.5:process (process-resource-bundles) @ tamaya-sandbox
---
[INFO] 
[INFO] --- karaf-maven-plugin:4.0.5:features-generate-descriptor (generate) @ tamaya-sandbox
---
[INFO] Generating feature descriptor file <https://builds.apache.org/job/Tamaya-Sandbox-Master/ws/target/feature/feature.xml>
[INFO] ...done!
[INFO] 
[INFO] --- bnd-maven-plugin:3.3.0:bnd-process (default) @ tamaya-sandbox ---
[INFO] skip project with packaging=pom
[INFO] 
[INFO] --- maven-site-plugin:3.4:attach-descriptor (attach-descriptor) @ tamaya-sandbox ---
[INFO] 
[INFO] --- maven-javadoc-plugin:2.10.4:jar (attach-javadocs) @ tamaya-sandbox ---
[INFO] Not executing Javadoc as the project is not a Java classpath-capable package
[INFO] 
[INFO] >>> maven-source-plugin:3.0.1:jar (source-jar) > generate-sources @ tamaya-sandbox
>>>
[INFO] 
[INFO] --- maven-enforcer-plugin:1.4.1:enforce (enforce-versions) @ tamaya-sandbox ---
[INFO] 
[INFO] --- apache-rat-plugin:0.12:check (default) @ tamaya-sandbox ---
[INFO] Enabled default license matchers.
[INFO] Will parse SCM ignores for exclusions...
[INFO] Parsing exclusions from <https://builds.apache.org/job/Tamaya-Sandbox-Master/ws/.gitignore>
[INFO] Finished adding exclusions from SCM ignore files.
[INFO] 89 implicit excludes (use -debug for more details).
[INFO] Exclude: **/*banner.txt
[INFO] Exclude: banner.txt
[INFO] Exclude: .git
[INFO] Exclude: derby.log
[INFO] Exclude: **/bootstrap-*
[INFO] Exclude: **/js/jquery-*
[INFO] Exclude: **/*.json
[INFO] Exclude: **/*.md
[INFO] Exclude: **/*.md.vm
[INFO] Exclude: src/site/asciidoc/temp-properties-files-for-site/attributes.adoc
[INFO] Exclude: readme/**
[INFO] 1 resources included (use -debug for more details)
[INFO] Rat check: Summary over all files. Unapproved: 0, unknown: 0, generated: 0, approved:
1 licenses.
[WARNING] Failed to getClass for org.apache.maven.plugins.source.SourceJarMojo
[INFO] 
[INFO] <<< maven-source-plugin:3.0.1:jar (source-jar) < generate-sources @ tamaya-sandbox
<<<
[INFO] 
[INFO] --- maven-source-plugin:3.0.1:jar (source-jar) @ tamaya-sandbox ---
[INFO] 
[INFO] --- maven-failsafe-plugin:2.19.1:integration-test (default) @ tamaya-sandbox ---
[INFO] No tests to run.
[JENKINS] Recording test results
[INFO] 
[INFO] --- maven-failsafe-plugin:2.19.1:verify (default) @ tamaya-sandbox ---
[JENKINS] Recording test results
[INFO] 
[INFO] --- maven-install-plugin:2.5.2:install (default-install) @ tamaya-sandbox ---
[INFO] Installing <https://builds.apache.org/job/Tamaya-Sandbox-Master/ws/pom.xml> to
/home/jenkins/jenkins-slave/maven-repositories/1/org/apache/tamaya/ext/tamaya-sandbox/0.3-incubating-SNAPSHOT/tamaya-sandbox-0.3-incubating-SNAPSHOT.pom
[INFO] Installing <https://builds.apache.org/job/Tamaya-Sandbox-Master/ws/target/feature/feature.xml>
to /home/jenkins/jenkins-slave/maven-repositories/1/org/apache/tamaya/ext/tamaya-sandbox/0.3-incubating-SNAPSHOT/tamaya-sandbox-0.3-incubating-SNAPSHOT-features.xml
[INFO] 
[INFO] --- maven-enforcer-plugin:1.4.1:enforce (enforce-versions) @ tamaya-sandbox ---
[INFO] 
[INFO] --- apache-rat-plugin:0.12:check (default) @ tamaya-sandbox ---
[INFO] Enabled default license matchers.
[INFO] Will parse SCM ignores for exclusions...
[INFO] Parsing exclusions from <https://builds.apache.org/job/Tamaya-Sandbox-Master/ws/.gitignore>
[INFO] Finished adding exclusions from SCM ignore files.
[INFO] 89 implicit excludes (use -debug for more details).
[INFO] Exclude: **/*banner.txt
[INFO] Exclude: banner.txt
[INFO] Exclude: .git
[INFO] Exclude: derby.log
[INFO] Exclude: **/bootstrap-*
[INFO] Exclude: **/js/jquery-*
[INFO] Exclude: **/*.json
[INFO] Exclude: **/*.md
[INFO] Exclude: **/*.md.vm
[INFO] Exclude: src/site/asciidoc/temp-properties-files-for-site/attributes.adoc
[INFO] Exclude: readme/**
[INFO] 1 resources included (use -debug for more details)
[INFO] Rat check: Summary over all files. Unapproved: 0, unknown: 0, generated: 0, approved:
1 licenses.
[INFO] 
[INFO] --- maven-remote-resources-plugin:1.5:process (process-resource-bundles) @ tamaya-sandbox
---
[INFO] 
[INFO] --- karaf-maven-plugin:4.0.5:features-generate-descriptor (generate) @ tamaya-sandbox
---
[INFO] Generating feature descriptor file <https://builds.apache.org/job/Tamaya-Sandbox-Master/ws/target/feature/feature.xml>
[INFO] ...done!
[INFO] 
[INFO] --- bnd-maven-plugin:3.3.0:bnd-process (default) @ tamaya-sandbox ---
[INFO] skip project with packaging=pom
[INFO] 
[INFO] --- maven-site-plugin:3.4:attach-descriptor (attach-descriptor) @ tamaya-sandbox ---
[INFO] 
[INFO] --- maven-javadoc-plugin:2.10.4:jar (attach-javadocs) @ tamaya-sandbox ---
[INFO] Not executing Javadoc as the project is not a Java classpath-capable package
[INFO] 
[INFO] >>> maven-source-plugin:3.0.1:jar (source-jar) > generate-sources @ tamaya-sandbox
>>>
[INFO] 
[INFO] --- maven-enforcer-plugin:1.4.1:enforce (enforce-versions) @ tamaya-sandbox ---
[INFO] 
[INFO] --- apache-rat-plugin:0.12:check (default) @ tamaya-sandbox ---
[INFO] Enabled default license matchers.
[INFO] Will parse SCM ignores for exclusions...
[INFO] Parsing exclusions from <https://builds.apache.org/job/Tamaya-Sandbox-Master/ws/.gitignore>
[INFO] Finished adding exclusions from SCM ignore files.
[INFO] 89 implicit excludes (use -debug for more details).
[INFO] Exclude: **/*banner.txt
[INFO] Exclude: banner.txt
[INFO] Exclude: .git
[INFO] Exclude: derby.log
[INFO] Exclude: **/bootstrap-*
[INFO] Exclude: **/js/jquery-*
[INFO] Exclude: **/*.json
[INFO] Exclude: **/*.md
[INFO] Exclude: **/*.md.vm
[INFO] Exclude: src/site/asciidoc/temp-properties-files-for-site/attributes.adoc
[INFO] Exclude: readme/**
[INFO] 1 resources included (use -debug for more details)
[INFO] Rat check: Summary over all files. Unapproved: 0, unknown: 0, generated: 0, approved:
1 licenses.
[WARNING] Failed to getClass for org.apache.maven.plugins.source.SourceJarMojo
[INFO] 
[INFO] <<< maven-source-plugin:3.0.1:jar (source-jar) < generate-sources @ tamaya-sandbox
<<<
[INFO] 
[INFO] --- maven-source-plugin:3.0.1:jar (source-jar) @ tamaya-sandbox ---
[INFO] 
[INFO] --- maven-failsafe-plugin:2.19.1:integration-test (default) @ tamaya-sandbox ---
[INFO] No tests to run.
[INFO] Skipping execution of surefire because it has already been run for this configuration
[INFO] 
[JENKINS] Recording test results[INFO] --- maven-failsafe-plugin:2.19.1:verify (default) @
tamaya-sandbox ---

[JENKINS] Recording test results
[INFO] 
[INFO] --- maven-install-plugin:2.5.2:install (default-install) @ tamaya-sandbox ---
[INFO] Installing <https://builds.apache.org/job/Tamaya-Sandbox-Master/ws/pom.xml> to
/home/jenkins/jenkins-slave/maven-repositories/1/org/apache/tamaya/ext/tamaya-sandbox/0.3-incubating-SNAPSHOT/tamaya-sandbox-0.3-incubating-SNAPSHOT.pom
[INFO] Installing <https://builds.apache.org/job/Tamaya-Sandbox-Master/ws/target/feature/feature.xml>
to /home/jenkins/jenkins-slave/maven-repositories/1/org/apache/tamaya/ext/tamaya-sandbox/0.3-incubating-SNAPSHOT/tamaya-sandbox-0.3-incubating-SNAPSHOT-features.xml
[INFO] Installing <https://builds.apache.org/job/Tamaya-Sandbox-Master/ws/target/feature/feature.xml>
to /home/jenkins/jenkins-slave/maven-repositories/1/org/apache/tamaya/ext/tamaya-sandbox/0.3-incubating-SNAPSHOT/tamaya-sandbox-0.3-incubating-SNAPSHOT-features.xml
[INFO] 
[INFO] --- maven-deploy-plugin:2.8.2:deploy (default-deploy) @ tamaya-sandbox ---
[INFO] Downloading: https://repository.apache.org/content/repositories/snapshots/org/apache/tamaya/ext/tamaya-sandbox/0.3-incubating-SNAPSHOT/maven-metadata.xml
[WARNING] Could not transfer metadata org.apache.tamaya.ext:tamaya-sandbox:0.3-incubating-SNAPSHOT/maven-metadata.xml
from/to apache.snapshots.https (https://repository.apache.org/content/repositories/snapshots):
Connect to repository.apache.org:443 [repository.apache.org/207.244.88.143] failed: Connection
timed out
[INFO] ------------------------------------------------------------------------
[INFO] Reactor Summary:
[INFO] 
[INFO] Apache Tamaya Sandbox .............................. FAILURE [02:56 min]
[INFO] Apache Tamaya Modules - Hazelcast PropertySource ... SKIPPED
[INFO] Apache Tamaya Modules - Apache Commons ............. SKIPPED
[INFO] Apache Tamaya Modules - Joda-Time Support .......... SKIPPED
[INFO] Apache Tamaya Modules - Usage tracker .............. SKIPPED
[INFO] Apache Tamaya Modules - Validation ................. SKIPPED
[INFO] Apache Tamaya Modules - Remote PropertySource ...... SKIPPED
[INFO] Apache Tamaya Modules - Configured System Properties SKIPPED
[INFO] Apache Tamaya Modules - etcd PropertySource ........ SKIPPED
[INFO] Apache Tamaya Modules - Consul ..................... SKIPPED
[INFO] Apache Tamaya Modules - Apache Camel Support ....... SKIPPED
[INFO] Apache Tamaya Modules - PropertySources ............ SKIPPED
[INFO] Apache Tamaya :: OSGi Integration :: ALL ........... SKIPPED
[INFO] Apache Tamaya :: OSGi Integration :: ConfigAdmin ... SKIPPED
[INFO] Apache Tamaya Modules - JMX Support ................ SKIPPED
[INFO] Apache Tamaya Modules - Metamodel .................. SKIPPED
[INFO] Apache Tamaya Modules - Units of Measurement Support SKIPPED
[INFO] ------------------------------------------------------------------------
[INFO] BUILD FAILURE
[INFO] ------------------------------------------------------------------------
[INFO] Total time: 03:10 min
[INFO] Finished at: 2017-03-13T00:22:42+00:00
[INFO] Final Memory: 50M/712M
[INFO] ------------------------------------------------------------------------
[ERROR] Failed to execute goal org.apache.maven.plugins:maven-deploy-plugin:2.8.2:deploy (default-deploy)
on project tamaya-sandbox: Failed to retrieve remote metadata org.apache.tamaya.ext:tamaya-sandbox:0.3-incubating-SNAPSHOT/maven-metadata.xml:
Could not transfer metadata org.apache.tamaya.ext:tamaya-sandbox:0.3-incubating-SNAPSHOT/maven-metadata.xml
from/to apache.snapshots.https (https://repository.apache.org/content/repositories/snapshots):
Connect to repository.apache.org:443 [repository.apache.org/207.244.88.143] failed: Connection
timed out -> [Help 1]
[ERROR] 
[ERROR] To see the full stack trace of the errors, re-run Maven with the -e switch.
[ERROR] Re-run Maven using the -X switch to enable full debug logging.
[ERROR] 
[ERROR] For more information about the errors and possible solutions, please read the following
articles:
[ERROR] [Help 1] http://cwiki.apache.org/confluence/display/MAVEN/MojoExecutionException
[JENKINS] Archiving <https://builds.apache.org/job/Tamaya-Sandbox-Master/ws/validation/pom.xml>
to org.apache.tamaya.ext/tamaya-validation_alpha/0.3-incubating-SNAPSHOT/tamaya-validation_alpha-0.3-incubating-SNAPSHOT.pom
[JENKINS] Archiving <https://builds.apache.org/job/Tamaya-Sandbox-Master/ws/apache-commons/pom.xml>
to org.apache.tamaya.ext/tamaya-commons-config_beta/0.3-incubating-SNAPSHOT/tamaya-commons-config_beta-0.3-incubating-SNAPSHOT.pom
[JENKINS] Archiving <https://builds.apache.org/job/Tamaya-Sandbox-Master/ws/osgi/pom.xml>
to org.apache.tamaya.ext/tamaya-osgi-all/0.3-incubating-SNAPSHOT/tamaya-osgi-all-0.3-incubating-SNAPSHOT.pom
[JENKINS] Archiving <https://builds.apache.org/job/Tamaya-Sandbox-Master/ws/pom.xml>
to org.apache.tamaya.ext/tamaya-sandbox/0.3-incubating-SNAPSHOT/tamaya-sandbox-0.3-incubating-SNAPSHOT.pom
[JENKINS] Archiving <https://builds.apache.org/job/Tamaya-Sandbox-Master/ws/target/feature/feature.xml>
to org.apache.tamaya.ext/tamaya-sandbox/0.3-incubating-SNAPSHOT/tamaya-sandbox-0.3-incubating-SNAPSHOT-features.xml
[JENKINS] Archiving <https://builds.apache.org/job/Tamaya-Sandbox-Master/ws/hazelcast/pom.xml>
to org.apache.tamaya.ext/tamaya-hazelcast_beta/0.3-incubating-SNAPSHOT/tamaya-hazelcast_beta-0.3-incubating-SNAPSHOT.pom
[JENKINS] Archiving <https://builds.apache.org/job/Tamaya-Sandbox-Master/ws/uom/pom.xml>
to org.apache.tamaya.ext/tamaya-uom_beta/0.3-incubating-SNAPSHOT/tamaya-uom_beta-0.3-incubating-SNAPSHOT.pom
[JENKINS] Archiving <https://builds.apache.org/job/Tamaya-Sandbox-Master/ws/jodatime/pom.xml>
to org.apache.tamaya.ext/tamaya-jodatime_beta/0.3-incubating-SNAPSHOT/tamaya-jodatime_beta-0.3-incubating-SNAPSHOT.pom
[JENKINS] Archiving <https://builds.apache.org/job/Tamaya-Sandbox-Master/ws/configured-sysprops/pom.xml>
to org.apache.tamaya.ext/tamaya-sysprops_beta/0.3-incubating-SNAPSHOT/tamaya-sysprops_beta-0.3-incubating-SNAPSHOT.pom
[JENKINS] Archiving <https://builds.apache.org/job/Tamaya-Sandbox-Master/ws/metamodel/pom.xml>
to org.apache.tamaya.ext/tamaya-metamodel_alpha/0.3-incubating-SNAPSHOT/tamaya-metamodel_alpha-0.3-incubating-SNAPSHOT.pom
[JENKINS] Archiving <https://builds.apache.org/job/Tamaya-Sandbox-Master/ws/usagetracker/pom.xml>
to org.apache.tamaya.ext/tamaya-usagetracker_beta/0.3-incubating-SNAPSHOT/tamaya-usagetracker_beta-0.3-incubating-SNAPSHOT.pom
[JENKINS] Archiving <https://builds.apache.org/job/Tamaya-Sandbox-Master/ws/osgi/common/pom.xml>
to org.apache.tamaya.ext/tamaya-osgi_alpha/0.3-incubating-SNAPSHOT/tamaya-osgi_alpha-0.3-incubating-SNAPSHOT.pom
[JENKINS] Archiving <https://builds.apache.org/job/Tamaya-Sandbox-Master/ws/camel/pom.xml>
to org.apache.tamaya.ext/tamaya-camel_beta/0.3-incubating-SNAPSHOT/tamaya-camel_beta-0.3-incubating-SNAPSHOT.pom
[JENKINS] Archiving <https://builds.apache.org/job/Tamaya-Sandbox-Master/ws/remote/pom.xml>
to org.apache.tamaya.ext/tamaya-remote_alpha/0.3-incubating-SNAPSHOT/tamaya-remote_alpha-0.3-incubating-SNAPSHOT.pom
[JENKINS] Archiving <https://builds.apache.org/job/Tamaya-Sandbox-Master/ws/management/pom.xml>
to org.apache.tamaya.ext/tamaya-management_alpha/0.3-incubating-SNAPSHOT/tamaya-management_alpha-0.3-incubating-SNAPSHOT.pom
[JENKINS] Archiving <https://builds.apache.org/job/Tamaya-Sandbox-Master/ws/consul/pom.xml>
to org.apache.tamaya.ext/tamaya-consul_beta/0.3-incubating-SNAPSHOT/tamaya-consul_beta-0.3-incubating-SNAPSHOT.pom
[JENKINS] Archiving <https://builds.apache.org/job/Tamaya-Sandbox-Master/ws/etcd/pom.xml>
to org.apache.tamaya.ext/tamaya-etcd_beta/0.3-incubating-SNAPSHOT/tamaya-etcd_beta-0.3-incubating-SNAPSHOT.pom
[JENKINS] Archiving <https://builds.apache.org/job/Tamaya-Sandbox-Master/ws/propertysources/pom.xml>
to org.apache.tamaya.ext/tamaya-propertysources_alpha/0.3-incubating-SNAPSHOT/tamaya-propertysources_alpha-0.3-incubating-SNAPSHOT.pom
Sending e-mails to: commits@tamaya.incubator.apache.org
channel stopped

Mime
View raw message