tamaya-commits mailing list archives

Site index · List index
Message view « Date » · « Thread »
Top « Date » · « Thread »
From Apache Jenkins Server <jenk...@builds.apache.org>
Subject Build failed in Jenkins: Tamaya-Master-branch #855
Date Mon, 12 Dec 2016 16:53:42 GMT
See <https://builds.apache.org/job/Tamaya-Master-branch/855/changes>

Changes:

[anatole] Added tests and bugfixes for Tamaya OSGI support.

[anatole] Fixed registration issue with converters. Improved toString formatting.

------------------------------------------
[...truncated 882 lines...]
[INFO] --- maven-compiler-plugin:3.6.0:compile (default-compile) @ tamaya-api ---
[INFO] Nothing to compile - all classes are up to date
[INFO] 
[INFO] >>> findbugs-maven-plugin:3.0.4:check (findbugs-analyze) > :findbugs @
tamaya-api >>>
[INFO] 
[INFO] --- findbugs-maven-plugin:3.0.4:findbugs (findbugs) @ tamaya-api ---
[INFO] Fork Value is true
[INFO] Done FindBugs Analysis....
[INFO] 
[INFO] <<< findbugs-maven-plugin:3.0.4:check (findbugs-analyze) < :findbugs @
tamaya-api <<<
[INFO] 
[INFO] --- findbugs-maven-plugin:3.0.4:check (findbugs-analyze) @ tamaya-api ---
[INFO] BugInstance size is 0
[INFO] Error size is 0
[INFO] No errors/warnings found
[INFO] 
[INFO] --- bnd-maven-plugin:3.3.0:bnd-process (default) @ tamaya-api ---
[INFO] 
[INFO] --- maven-resources-plugin:2.7:testResources (default-testResources) @ tamaya-api ---
[INFO] Using 'UTF-8' encoding to copy filtered resources.
[INFO] Copying 2 resources
[INFO] Copying 3 resources
[INFO] Copying 3 resources
[INFO] 
[INFO] --- maven-compiler-plugin:3.6.0:testCompile (default-testCompile) @ tamaya-api ---
[INFO] Nothing to compile - all classes are up to date
[INFO] 
[INFO] --- maven-surefire-plugin:2.19.1:test (default-test) @ tamaya-api ---
[INFO] Skipping execution of surefire because it has already been run for this configuration
[JENKINS] Recording test results
[INFO] 
[INFO] --- maven-jar-plugin:3.0.0:jar (default-jar) @ tamaya-api ---
[INFO] Building jar: <https://builds.apache.org/job/Tamaya-Master-branch/ws/code/api/target/tamaya-api-0.3-incubating-SNAPSHOT.jar>
[INFO] 
[INFO] --- maven-site-plugin:3.4:attach-descriptor (attach-descriptor) @ tamaya-api ---
[INFO] 
[INFO] --- maven-javadoc-plugin:2.10.4:jar (attach-javadocs) @ tamaya-api ---
[INFO] Building jar: <https://builds.apache.org/job/Tamaya-Master-branch/ws/code/api/target/tamaya-api-0.3-incubating-SNAPSHOT-javadoc.jar>
[INFO] 
[INFO] >>> maven-source-plugin:3.0.1:jar (source-jar) > generate-sources @ tamaya-api
>>>
[INFO] 
[INFO] --- maven-enforcer-plugin:1.4.1:enforce (enforce-versions) @ tamaya-api ---
[INFO] 
[INFO] --- apache-rat-plugin:0.12:check (default) @ tamaya-api ---
[INFO] Enabled default license matchers.
[INFO] Will parse SCM ignores for exclusions...
[INFO] Finished adding exclusions from SCM ignore files.
[INFO] 61 implicit excludes (use -debug for more details).
[INFO] Exclude: **/*banner.txt
[INFO] Exclude: banner.txt
[INFO] Exclude: .git
[INFO] Exclude: derby.log
[INFO] Exclude: **/bootstrap-*
[INFO] Exclude: **/js/jquery-*
[INFO] Exclude: **/*.json
[INFO] Exclude: **/*.md
[INFO] Exclude: **/*.md.vm
[INFO] Exclude: **/*.policy
[INFO] Exclude: src/site/asciidoc/temp-properties-files-for-site/attributes.adoc
[INFO] Exclude: readme/**
[INFO] 36 resources included (use -debug for more details)
[INFO] Rat check: Summary over all files. Unapproved: 0, unknown: 0, generated: 0, approved:
36 licenses.
[WARNING] Failed to getClass for org.apache.maven.plugins.source.SourceJarMojo
[INFO] 
[INFO] <<< maven-source-plugin:3.0.1:jar (source-jar) < generate-sources @ tamaya-api
<<<
[INFO] 
[INFO] --- maven-source-plugin:3.0.1:jar (source-jar) @ tamaya-api ---
[INFO] Building jar: <https://builds.apache.org/job/Tamaya-Master-branch/ws/code/api/target/tamaya-api-0.3-incubating-SNAPSHOT-sources.jar>
[INFO] 
[INFO] --- maven-failsafe-plugin:2.19.1:integration-test (default) @ tamaya-api ---
[INFO] Skipping execution of surefire because it has already been run for this configuration
[JENKINS] Recording test results[INFO] 
[INFO] --- maven-failsafe-plugin:2.19.1:verify (default) @ tamaya-api ---

[JENKINS] Recording test results[INFO] 
[INFO] --- maven-install-plugin:2.5.2:install (default-install) @ tamaya-api ---
[INFO] Installing <https://builds.apache.org/job/Tamaya-Master-branch/ws/code/api/target/tamaya-api-0.3-incubating-SNAPSHOT.jar>
to /home/jenkins/jenkins-slave/maven-repositories/0/org/apache/tamaya/tamaya-api/0.3-incubating-SNAPSHOT/tamaya-api-0.3-incubating-SNAPSHOT.jar
[INFO] Installing <https://builds.apache.org/job/Tamaya-Master-branch/ws/code/api/pom.xml>
to /home/jenkins/jenkins-slave/maven-repositories/0/org/apache/tamaya/tamaya-api/0.3-incubating-SNAPSHOT/tamaya-api-0.3-incubating-SNAPSHOT.pom
[INFO] Installing <https://builds.apache.org/job/Tamaya-Master-branch/ws/code/api/target/feature/feature.xml>
to /home/jenkins/jenkins-slave/maven-repositories/0/org/apache/tamaya/tamaya-api/0.3-incubating-SNAPSHOT/tamaya-api-0.3-incubating-SNAPSHOT-features.xml
[INFO] Installing <https://builds.apache.org/job/Tamaya-Master-branch/ws/code/api/target/tamaya-api-0.3-incubating-SNAPSHOT-javadoc.jar>
to /home/jenkins/jenkins-slave/maven-repositories/0/org/apache/tamaya/tamaya-api/0.3-incubating-SNAPSHOT/tamaya-api-0.3-incubating-SNAPSHOT-javadoc.jar
[INFO] Installing <https://builds.apache.org/job/Tamaya-Master-branch/ws/code/api/target/tamaya-api-0.3-incubating-SNAPSHOT-sources.jar>
to /home/jenkins/jenkins-slave/maven-repositories/0/org/apache/tamaya/tamaya-api/0.3-incubating-SNAPSHOT/tamaya-api-0.3-incubating-SNAPSHOT-sources.jar
[INFO] Installing <https://builds.apache.org/job/Tamaya-Master-branch/ws/code/api/target/feature/feature.xml>
to /home/jenkins/jenkins-slave/maven-repositories/0/org/apache/tamaya/tamaya-api/0.3-incubating-SNAPSHOT/tamaya-api-0.3-incubating-SNAPSHOT-features.xml
[INFO] Installing <https://builds.apache.org/job/Tamaya-Master-branch/ws/code/api/target/tamaya-api-0.3-incubating-SNAPSHOT-javadoc.jar>
to /home/jenkins/jenkins-slave/maven-repositories/0/org/apache/tamaya/tamaya-api/0.3-incubating-SNAPSHOT/tamaya-api-0.3-incubating-SNAPSHOT-javadoc.jar

[INFO] Installing <https://builds.apache.org/job/Tamaya-Master-branch/ws/code/api/target/tamaya-api-0.3-incubating-SNAPSHOT-sources.jar>
to /home/jenkins/jenkins-slave/maven-repositories/0/org/apache/tamaya/tamaya-api/0.3-incubating-SNAPSHOT/tamaya-api-0.3-incubating-SNAPSHOT-sources.jar
[INFO] 
[INFO] --- maven-deploy-plugin:2.8.2:deploy (default-deploy) @ tamaya-api ---
[INFO] Downloading: https://repository.apache.org/content/repositories/snapshots/org/apache/tamaya/tamaya-api/0.3-incubating-SNAPSHOT/maven-metadata.xml
[INFO] Downloaded: https://repository.apache.org/content/repositories/snapshots/org/apache/tamaya/tamaya-api/0.3-incubating-SNAPSHOT/maven-metadata.xml
(2 KB at 2.6 KB/sec)
[INFO] Uploading: https://repository.apache.org/content/repositories/snapshots/org/apache/tamaya/tamaya-api/0.3-incubating-SNAPSHOT/tamaya-api-0.3-incubating-20161212.165056-291.jar
[INFO] Uploaded: https://repository.apache.org/content/repositories/snapshots/org/apache/tamaya/tamaya-api/0.3-incubating-SNAPSHOT/tamaya-api-0.3-incubating-20161212.165056-291.jar
(28 KB at 29.6 KB/sec)
[INFO] Uploading: https://repository.apache.org/content/repositories/snapshots/org/apache/tamaya/tamaya-api/0.3-incubating-SNAPSHOT/tamaya-api-0.3-incubating-20161212.165056-291.pom
[INFO] Uploaded: https://repository.apache.org/content/repositories/snapshots/org/apache/tamaya/tamaya-api/0.3-incubating-SNAPSHOT/tamaya-api-0.3-incubating-20161212.165056-291.pom
(2 KB at 2.3 KB/sec)
[INFO] Downloading: https://repository.apache.org/content/repositories/snapshots/org/apache/tamaya/tamaya-api/maven-metadata.xml
[INFO] Downloaded: https://repository.apache.org/content/repositories/snapshots/org/apache/tamaya/tamaya-api/maven-metadata.xml
(441 B at 0.8 KB/sec)
[INFO] Uploading: https://repository.apache.org/content/repositories/snapshots/org/apache/tamaya/tamaya-api/0.3-incubating-SNAPSHOT/maven-metadata.xml
[INFO] Uploaded: https://repository.apache.org/content/repositories/snapshots/org/apache/tamaya/tamaya-api/0.3-incubating-SNAPSHOT/maven-metadata.xml
(2 KB at 1.7 KB/sec)
[INFO] Uploading: https://repository.apache.org/content/repositories/snapshots/org/apache/tamaya/tamaya-api/maven-metadata.xml
[INFO] Uploaded: https://repository.apache.org/content/repositories/snapshots/org/apache/tamaya/tamaya-api/maven-metadata.xml
(441 B at 0.5 KB/sec)
[INFO] Uploading: https://repository.apache.org/content/repositories/snapshots/org/apache/tamaya/tamaya-api/0.3-incubating-SNAPSHOT/tamaya-api-0.3-incubating-20161212.165056-291-features.xml
[INFO] Uploaded: https://repository.apache.org/content/repositories/snapshots/org/apache/tamaya/tamaya-api/0.3-incubating-SNAPSHOT/tamaya-api-0.3-incubating-20161212.165056-291-features.xml
(448 B at 0.5 KB/sec)
[INFO] Uploading: https://repository.apache.org/content/repositories/snapshots/org/apache/tamaya/tamaya-api/0.3-incubating-SNAPSHOT/maven-metadata.xml
[INFO] Uploaded: https://repository.apache.org/content/repositories/snapshots/org/apache/tamaya/tamaya-api/0.3-incubating-SNAPSHOT/maven-metadata.xml
(2 KB at 1.8 KB/sec)
[INFO] Uploading: https://repository.apache.org/content/repositories/snapshots/org/apache/tamaya/tamaya-api/0.3-incubating-SNAPSHOT/tamaya-api-0.3-incubating-20161212.165056-291-javadoc.jar
[INFO] Uploaded: https://repository.apache.org/content/repositories/snapshots/org/apache/tamaya/tamaya-api/0.3-incubating-SNAPSHOT/tamaya-api-0.3-incubating-20161212.165056-291-javadoc.jar
(172 KB at 161.7 KB/sec)
[INFO] Uploading: https://repository.apache.org/content/repositories/snapshots/org/apache/tamaya/tamaya-api/0.3-incubating-SNAPSHOT/maven-metadata.xml
[INFO] Uploaded: https://repository.apache.org/content/repositories/snapshots/org/apache/tamaya/tamaya-api/0.3-incubating-SNAPSHOT/maven-metadata.xml
(2 KB at 1.8 KB/sec)
[INFO] Uploading: https://repository.apache.org/content/repositories/snapshots/org/apache/tamaya/tamaya-api/0.3-incubating-SNAPSHOT/tamaya-api-0.3-incubating-20161212.165056-291-sources.jar
[INFO] Uploaded: https://repository.apache.org/content/repositories/snapshots/org/apache/tamaya/tamaya-api/0.3-incubating-SNAPSHOT/tamaya-api-0.3-incubating-20161212.165056-291-sources.jar
(41 KB at 41.4 KB/sec)
[INFO] Uploading: https://repository.apache.org/content/repositories/snapshots/org/apache/tamaya/tamaya-api/0.3-incubating-SNAPSHOT/maven-metadata.xml
[INFO] Uploaded: https://repository.apache.org/content/repositories/snapshots/org/apache/tamaya/tamaya-api/0.3-incubating-SNAPSHOT/maven-metadata.xml
(2 KB at 1.8 KB/sec)
[INFO] Uploading: https://repository.apache.org/content/repositories/snapshots/org/apache/tamaya/tamaya-api/0.3-incubating-SNAPSHOT/tamaya-api-0.3-incubating-20161212.165056-291-features.xml
[INFO] Uploaded: https://repository.apache.org/content/repositories/snapshots/org/apache/tamaya/tamaya-api/0.3-incubating-SNAPSHOT/tamaya-api-0.3-incubating-20161212.165056-291-features.xml
(448 B at 0.5 KB/sec)
[INFO] Uploading: https://repository.apache.org/content/repositories/snapshots/org/apache/tamaya/tamaya-api/0.3-incubating-SNAPSHOT/maven-metadata.xml
[INFO] Uploaded: https://repository.apache.org/content/repositories/snapshots/org/apache/tamaya/tamaya-api/0.3-incubating-SNAPSHOT/maven-metadata.xml
(2 KB at 1.8 KB/sec)
[INFO] Uploading: https://repository.apache.org/content/repositories/snapshots/org/apache/tamaya/tamaya-api/0.3-incubating-SNAPSHOT/tamaya-api-0.3-incubating-20161212.165056-291-javadoc.jar
[INFO] Uploaded: https://repository.apache.org/content/repositories/snapshots/org/apache/tamaya/tamaya-api/0.3-incubating-SNAPSHOT/tamaya-api-0.3-incubating-20161212.165056-291-javadoc.jar
(172 KB at 159.6 KB/sec)
[INFO] Uploading: https://repository.apache.org/content/repositories/snapshots/org/apache/tamaya/tamaya-api/0.3-incubating-SNAPSHOT/maven-metadata.xml
[INFO] Uploaded: https://repository.apache.org/content/repositories/snapshots/org/apache/tamaya/tamaya-api/0.3-incubating-SNAPSHOT/maven-metadata.xml
(2 KB at 1.8 KB/sec)
[INFO] Uploading: https://repository.apache.org/content/repositories/snapshots/org/apache/tamaya/tamaya-api/0.3-incubating-SNAPSHOT/tamaya-api-0.3-incubating-20161212.165056-291-sources.jar
[INFO] Uploaded: https://repository.apache.org/content/repositories/snapshots/org/apache/tamaya/tamaya-api/0.3-incubating-SNAPSHOT/tamaya-api-0.3-incubating-20161212.165056-291-sources.jar
(41 KB at 41.3 KB/sec)
[INFO] Uploading: https://repository.apache.org/content/repositories/snapshots/org/apache/tamaya/tamaya-api/0.3-incubating-SNAPSHOT/maven-metadata.xml
[INFO] Uploaded: https://repository.apache.org/content/repositories/snapshots/org/apache/tamaya/tamaya-api/0.3-incubating-SNAPSHOT/maven-metadata.xml
(2 KB at 1.8 KB/sec)
[INFO]                                                                         
[INFO] ------------------------------------------------------------------------
[INFO] Building Apache Tamaya Core Implementation 0.3-incubating-SNAPSHOT
[INFO] ------------------------------------------------------------------------
[INFO] 
[INFO] --- maven-clean-plugin:3.0.0:clean (default-clean) @ tamaya-core ---
[INFO] Deleting <https://builds.apache.org/job/Tamaya-Master-branch/ws/code/core/target>
[INFO] 
[INFO] --- maven-enforcer-plugin:1.4.1:enforce (enforce-versions) @ tamaya-core ---
[INFO] 
[INFO] --- apache-rat-plugin:0.12:check (default) @ tamaya-core ---
[INFO] Enabled default license matchers.
[INFO] Will parse SCM ignores for exclusions...
[INFO] Finished adding exclusions from SCM ignore files.
[INFO] 61 implicit excludes (use -debug for more details).
[INFO] Exclude: **/*banner.txt
[INFO] Exclude: banner.txt
[INFO] Exclude: .git
[INFO] Exclude: derby.log
[INFO] Exclude: **/bootstrap-*
[INFO] Exclude: **/js/jquery-*
[INFO] Exclude: **/*.json
[INFO] Exclude: **/*.md
[INFO] Exclude: **/*.md.vm
[INFO] Exclude: **/*.policy
[INFO] Exclude: src/site/asciidoc/temp-properties-files-for-site/attributes.adoc
[INFO] Exclude: readme/**
[INFO] 104 resources included (use -debug for more details)
[INFO] Rat check: Summary over all files. Unapproved: 0, unknown: 0, generated: 0, approved:
104 licenses.
[INFO] 
[INFO] --- maven-remote-resources-plugin:1.5:process (process-resource-bundles) @ tamaya-core
---
[INFO] 
[INFO] --- karaf-maven-plugin:4.0.5:features-generate-descriptor (generate) @ tamaya-core
---
[INFO] Downloading: http://repository.apache.org/snapshots/org/apache/tamaya/tamaya-core/0.3-incubating-SNAPSHOT/maven-metadata.xml
[INFO] Downloaded: http://repository.apache.org/snapshots/org/apache/tamaya/tamaya-core/0.3-incubating-SNAPSHOT/maven-metadata.xml
(2 KB at 4.0 KB/sec)
[INFO] Generating feature descriptor file <https://builds.apache.org/job/Tamaya-Master-branch/ws/code/core/target/feature/feature.xml>
[INFO] ...done!
[INFO] 
[INFO] --- maven-resources-plugin:2.7:resources (default-resources) @ tamaya-core ---
[INFO] Using 'UTF-8' encoding to copy filtered resources.
[INFO] Copying 7 resources
[INFO] Copying 3 resources
[INFO] 
[INFO] --- maven-compiler-plugin:3.6.0:compile (default-compile) @ tamaya-core ---
[INFO] Changes detected - recompiling the module!
[INFO] Compiling 41 source files to <https://builds.apache.org/job/Tamaya-Master-branch/ws/code/core/target/classes>
[INFO] <https://builds.apache.org/job/Tamaya-Master-branch/ws/code/core/src/main/java/org/apache/tamaya/core/internal/DefaultConfigurationContextBuilder.java>:
Some input files use unchecked or unsafe operations.
[INFO] <https://builds.apache.org/job/Tamaya-Master-branch/ws/code/core/src/main/java/org/apache/tamaya/core/internal/DefaultConfigurationContextBuilder.java>:
Recompile with -Xlint:unchecked for details.
[INFO] -------------------------------------------------------------
[WARNING] COMPILATION WARNING : 
[INFO] -------------------------------------------------------------
[WARNING] <https://builds.apache.org/job/Tamaya-Master-branch/ws/code/core/src/main/java/org/apache/tamaya/core/propertysource/CLIPropertySource.java>:[47,14]
non-varargs call of varargs method with inexact argument type for last parameter;
  cast to java.lang.String for a varargs call
  cast to java.lang.String[] for a non-varargs call and to suppress this warning
[WARNING] <https://builds.apache.org/job/Tamaya-Master-branch/ws/code/core/src/main/java/org/apache/tamaya/core/internal/DefaultConfigurationContext.java>:[305,21]
<T>addPropertyConverter(org.apache.tamaya.TypeLiteral<T>,org.apache.tamaya.spi.PropertyConverter<T>)
in org.apache.tamaya.spi.ConfigurationContext has been deprecated
[INFO] 2 warnings 
[INFO] -------------------------------------------------------------
[INFO] -------------------------------------------------------------
[ERROR] COMPILATION ERROR : 
[INFO] -------------------------------------------------------------
[ERROR] <https://builds.apache.org/job/Tamaya-Master-branch/ws/code/core/src/main/java/org/apache/tamaya/core/internal/DefaultConfigurationContext.java>:[164,17]
cannot find symbol
  symbol:   class PropertyValue
  location: class org.apache.tamaya.core.internal.DefaultConfigurationContext
[ERROR] <https://builds.apache.org/job/Tamaya-Master-branch/ws/code/core/src/main/java/org/apache/tamaya/core/internal/DefaultConfigurationContext.java>:[170,25]
cannot find symbol
  symbol:   class PropertyValue
  location: class org.apache.tamaya.core.internal.DefaultConfigurationContext
[INFO] 2 errors 
[INFO] -------------------------------------------------------------
[INFO] ------------------------------------------------------------------------
[INFO] Reactor Summary:
[INFO] 
[INFO] Apache Tamaya Base ................................. SUCCESS [01:08 min]
[INFO] Apache Tamaya Build Configuration .................. SUCCESS [ 25.380 s]
[INFO] Apache Tamaya Code - all ........................... SUCCESS [ 27.545 s]
[INFO] Apache Tamaya API .................................. SUCCESS [02:21 min]
[INFO] Apache Tamaya Core Implementation .................. FAILURE [  3.958 s]
[INFO] Apache Tamaya Documentation ........................ SKIPPED
[INFO] Apache Tamaya Core Examples ........................ SKIPPED
[INFO] Apache Tamaya Minimal Examples ..................... SKIPPED
[INFO] Apache Tamaya Distribution ......................... SKIPPED
[INFO] ------------------------------------------------------------------------
[INFO] BUILD FAILURE
[INFO] ------------------------------------------------------------------------
[INFO] Total time: 05:08 min
[INFO] Finished at: 2016-12-12T16:51:31+00:00
[INFO] Final Memory: 59M/963M
[INFO] ------------------------------------------------------------------------
Waiting for Jenkins to finish collecting data
[ERROR] Failed to execute goal org.apache.maven.plugins:maven-compiler-plugin:3.6.0:compile
(default-compile) on project tamaya-core: Compilation failure: Compilation failure:
[ERROR] <https://builds.apache.org/job/Tamaya-Master-branch/ws/code/core/src/main/java/org/apache/tamaya/core/internal/DefaultConfigurationContext.java>:[164,17]
cannot find symbol
[ERROR] symbol:   class PropertyValue
[ERROR] location: class org.apache.tamaya.core.internal.DefaultConfigurationContext
[ERROR] <https://builds.apache.org/job/Tamaya-Master-branch/ws/code/core/src/main/java/org/apache/tamaya/core/internal/DefaultConfigurationContext.java>:[170,25]
cannot find symbol
[ERROR] symbol:   class PropertyValue
[ERROR] location: class org.apache.tamaya.core.internal.DefaultConfigurationContext
[ERROR] -> [Help 1]
[ERROR] 
[ERROR] To see the full stack trace of the errors, re-run Maven with the -e switch.
[ERROR] Re-run Maven using the -X switch to enable full debug logging.
[ERROR] 
[ERROR] For more information about the errors and possible solutions, please read the following
articles:
[ERROR] [Help 1] http://cwiki.apache.org/confluence/display/MAVEN/MojoFailureException
[ERROR] 
[ERROR] After correcting the problems, you can resume the build with the command
[ERROR]   mvn <goals> -rf :tamaya-core
[JENKINS] Archiving <https://builds.apache.org/job/Tamaya-Master-branch/ws/pom.xml>
to org.apache.tamaya/tamaya-all/0.3-incubating-SNAPSHOT/tamaya-all-0.3-incubating-SNAPSHOT.pom
[JENKINS] Archiving <https://builds.apache.org/job/Tamaya-Master-branch/ws/target/feature/feature.xml>
to org.apache.tamaya/tamaya-all/0.3-incubating-20161212.164723-293/tamaya-all-0.3-incubating-20161212.164723-293-features.xml
[JENKINS] Archiving <https://builds.apache.org/job/Tamaya-Master-branch/ws/target/tamaya-all-0.3-incubating-SNAPSHOT-site.xml>
to org.apache.tamaya/tamaya-all/0.3-incubating-20161212.164723-293/tamaya-all-0.3-incubating-20161212.164723-293-site.xml
[JENKINS] Archiving <https://builds.apache.org/job/Tamaya-Master-branch/ws/buildconfigurations/pom.xml>
to org.apache.tamaya/buildconfigurations/0.3-incubating-SNAPSHOT/buildconfigurations-0.3-incubating-SNAPSHOT.pom
[JENKINS] Archiving <https://builds.apache.org/job/Tamaya-Master-branch/ws/buildconfigurations/target/buildconfigurations-0.3-incubating-SNAPSHOT.jar>
to org.apache.tamaya/buildconfigurations/0.3-incubating-20161212.164754-292/buildconfigurations-0.3-incubating-20161212.164754-292.jar
[JENKINS] Archiving <https://builds.apache.org/job/Tamaya-Master-branch/ws/buildconfigurations/target/feature/feature.xml>
to org.apache.tamaya/buildconfigurations/0.3-incubating-20161212.164754-292/buildconfigurations-0.3-incubating-20161212.164754-292-features.xml
[JENKINS] Archiving <https://builds.apache.org/job/Tamaya-Master-branch/ws/buildconfigurations/target/buildconfigurations-0.3-incubating-SNAPSHOT-sources.jar>
to org.apache.tamaya/buildconfigurations/0.3-incubating-20161212.164754-292/buildconfigurations-0.3-incubating-20161212.164754-292-sources.jar
[JENKINS] Archiving <https://builds.apache.org/job/Tamaya-Master-branch/ws/code/core/pom.xml>
to org.apache.tamaya/tamaya-core/0.3-incubating-SNAPSHOT/tamaya-core-0.3-incubating-SNAPSHOT.pom
[JENKINS] Archiving <https://builds.apache.org/job/Tamaya-Master-branch/ws/code/core/target/feature/feature.xml>
to org.apache.tamaya/tamaya-core/0.3-incubating-SNAPSHOT/tamaya-core-0.3-incubating-SNAPSHOT-features.xml
[JENKINS] Archiving <https://builds.apache.org/job/Tamaya-Master-branch/ws/code/api/pom.xml>
to org.apache.tamaya/tamaya-api/0.3-incubating-SNAPSHOT/tamaya-api-0.3-incubating-SNAPSHOT.pom
[JENKINS] Archiving <https://builds.apache.org/job/Tamaya-Master-branch/ws/code/api/target/tamaya-api-0.3-incubating-SNAPSHOT.jar>
to org.apache.tamaya/tamaya-api/0.3-incubating-20161212.165056-291/tamaya-api-0.3-incubating-20161212.165056-291.jar
[JENKINS] Archiving <https://builds.apache.org/job/Tamaya-Master-branch/ws/code/api/target/feature/feature.xml>
to org.apache.tamaya/tamaya-api/0.3-incubating-20161212.165056-291/tamaya-api-0.3-incubating-20161212.165056-291-features.xml
[JENKINS] Archiving <https://builds.apache.org/job/Tamaya-Master-branch/ws/code/api/target/tamaya-api-0.3-incubating-SNAPSHOT-javadoc.jar>
to org.apache.tamaya/tamaya-api/0.3-incubating-20161212.165056-291/tamaya-api-0.3-incubating-20161212.165056-291-javadoc.jar
[JENKINS] Archiving <https://builds.apache.org/job/Tamaya-Master-branch/ws/code/api/target/tamaya-api-0.3-incubating-SNAPSHOT-sources.jar>
to org.apache.tamaya/tamaya-api/0.3-incubating-20161212.165056-291/tamaya-api-0.3-incubating-20161212.165056-291-sources.jar
[JENKINS] Archiving <https://builds.apache.org/job/Tamaya-Master-branch/ws/examples/01-minimal/pom.xml>
to org.apache.tamaya.examples/01-minimal/0.3-incubating-SNAPSHOT/01-minimal-0.3-incubating-SNAPSHOT.pom
[JENKINS] Archiving <https://builds.apache.org/job/Tamaya-Master-branch/ws/distribution/pom.xml>
to org.apache.tamaya/tamaya-distribution/0.3-incubating-SNAPSHOT/tamaya-distribution-0.3-incubating-SNAPSHOT.pom
[JENKINS] Archiving <https://builds.apache.org/job/Tamaya-Master-branch/ws/examples/pom.xml>
to org.apache.tamaya.examples/examples/0.3-incubating-SNAPSHOT/examples-0.3-incubating-SNAPSHOT.pom
[JENKINS] Archiving <https://builds.apache.org/job/Tamaya-Master-branch/ws/docs/pom.xml>
to org.apache.tamaya/tamaya-docs/0.3-incubating-SNAPSHOT/tamaya-docs-0.3-incubating-SNAPSHOT.pom
[JENKINS] Archiving <https://builds.apache.org/job/Tamaya-Master-branch/ws/code/pom.xml>
to org.apache.tamaya/tamaya-code/0.3-incubating-SNAPSHOT/tamaya-code-0.3-incubating-SNAPSHOT.pom
[JENKINS] Archiving <https://builds.apache.org/job/Tamaya-Master-branch/ws/code/target/feature/feature.xml>
to org.apache.tamaya/tamaya-code/0.3-incubating-20161212.164835-291/tamaya-code-0.3-incubating-20161212.164835-291-features.xml
channel stopped

Mime
View raw message