tamaya-commits mailing list archives

Site index · List index
Message view « Date » · « Thread »
Top « Date » · « Thread »
From Apache Jenkins Server <jenk...@builds.apache.org>
Subject Build failed in Jenkins: Tamaya-Sandbox-Master » Apache Tamaya :: OSGI Integration :: Features #217
Date Mon, 19 Dec 2016 22:09:52 GMT
See <https://builds.apache.org/job/Tamaya-Sandbox-Master/org.apache.tamaya.ext$tamaya-features/217/>

------------------------------------------
[INFO]                                                                         
[INFO] ------------------------------------------------------------------------
[INFO] Building Apache Tamaya :: OSGI Integration :: Features 0.3-incubating-SNAPSHOT
[INFO] ------------------------------------------------------------------------
[INFO] 
[INFO] --- maven-clean-plugin:3.0.0:clean (default-clean) @ tamaya-features ---
[INFO] Deleting <https://builds.apache.org/job/Tamaya-Sandbox-Master/org.apache.tamaya.ext$tamaya-features/ws/target>
[INFO] 
[INFO] --- maven-enforcer-plugin:1.4.1:enforce (enforce-versions) @ tamaya-features ---
[INFO] 
[INFO] --- apache-rat-plugin:0.12:check (default) @ tamaya-features ---
[INFO] Enabled default license matchers.
[INFO] Will parse SCM ignores for exclusions...
[INFO] Finished adding exclusions from SCM ignore files.
[INFO] 61 implicit excludes (use -debug for more details).
[INFO] Exclude: **/*banner.txt
[INFO] Exclude: banner.txt
[INFO] Exclude: .git
[INFO] Exclude: derby.log
[INFO] Exclude: **/bootstrap-*
[INFO] Exclude: **/js/jquery-*
[INFO] Exclude: **/*.json
[INFO] Exclude: **/*.md
[INFO] Exclude: **/*.md.vm
[INFO] Exclude: src/site/asciidoc/temp-properties-files-for-site/attributes.adoc
[INFO] Exclude: readme/**
[INFO] 5 resources included (use -debug for more details)
[INFO] Rat check: Summary over all files. Unapproved: 0, unknown: 0, generated: 0, approved:
5 licenses.
[INFO] 
[INFO] --- maven-remote-resources-plugin:1.5:process (process-resource-bundles) @ tamaya-features
---
[INFO] 
[INFO] --- karaf-maven-plugin:4.0.5:features-generate-descriptor (generate) @ tamaya-features
---
[INFO] Generating feature descriptor file <https://builds.apache.org/job/Tamaya-Sandbox-Master/org.apache.tamaya.ext$tamaya-features/ws/target/feature/feature.xml>
[INFO] ...done!
[INFO] 
[INFO] --- maven-resources-plugin:2.7:copy-resources (features) @ tamaya-features ---
[INFO] Using 'UTF-8' encoding to copy filtered resources.
[INFO] Copying 1 resource
[INFO] 
[INFO] --- maven-resources-plugin:2.7:resources (default-resources) @ tamaya-features ---
[INFO] Using 'UTF-8' encoding to copy filtered resources.
[INFO] skip non existing resourceDirectory <https://builds.apache.org/job/Tamaya-Sandbox-Master/org.apache.tamaya.ext$tamaya-features/ws/src/main/resources>
[INFO] Copying 3 resources
[INFO] 
[INFO] --- maven-compiler-plugin:3.5.1:compile (default-compile) @ tamaya-features ---
[INFO] No sources to compile
[INFO] 
[INFO] --- bnd-maven-plugin:3.3.0:bnd-process (default) @ tamaya-features ---
[INFO] 
[INFO] --- maven-resources-plugin:2.7:testResources (default-testResources) @ tamaya-features
---
[INFO] Using 'UTF-8' encoding to copy filtered resources.
[INFO] Copying 2 resources
[INFO] Copying 3 resources
[INFO] 
[INFO] --- maven-compiler-plugin:3.5.1:testCompile (default-testCompile) @ tamaya-features
---
[INFO] Changes detected - recompiling the module!
[INFO] Compiling 1 source file to <https://builds.apache.org/job/Tamaya-Sandbox-Master/org.apache.tamaya.ext$tamaya-features/ws/target/test-classes>
[INFO] 
[INFO] --- maven-surefire-plugin:2.19.1:test (default-test) @ tamaya-features ---

-------------------------------------------------------
 T E S T S
-------------------------------------------------------
Running org.apache.tamaya.osgi.OSGIKarafTest
SLF4J: Class path contains multiple SLF4J bindings.
SLF4J: Found binding in [jar:file:/home/jenkins/jenkins-slave/maven-repositories/0/org/apache/karaf/org.apache.karaf.client/4.0.7/org.apache.karaf.client-4.0.7.jar!/org/slf4j/impl/StaticLoggerBinder.class]
SLF4J: Found binding in [jar:file:/home/jenkins/jenkins-slave/maven-repositories/0/org/ops4j/pax/logging/pax-logging-api/1.8.5/pax-logging-api-1.8.5.jar!/org/slf4j/impl/StaticLoggerBinder.class]
SLF4J: See http://www.slf4j.org/codes.html#multiple_bindings for an explanation.
SLF4J: Actual binding is of type [org.slf4j.impl.SimpleLoggerFactory]
2016-12-19 22:08:43,979 | WARN  | pool-7-thread-1  | JaxbUtil                         | 8
- org.apache.karaf.features.core - 4.0.7 | Old style feature file without namespace found
(URI: mvn:org.apache.tamaya.ext/tamaya-osgi-features/0.3-incubating-SNAPSHOT/xml/features).
This format is deprecated and support for it will soon be removed
2016-12-19 22:08:44,709 | ERROR | pool-7-thread-1  | BootFeaturesInstaller            | 8
- org.apache.karaf.features.core - 4.0.7 | Error installing boot features
org.apache.karaf.features.internal.util.MultiException: Error
	at org.apache.karaf.features.internal.download.impl.MavenDownloadManager$MavenDownloader.<init>(MavenDownloadManager.java:84)[8:org.apache.karaf.features.core:4.0.7]
	at org.apache.karaf.features.internal.download.impl.MavenDownloadManager.createDownloader(MavenDownloadManager.java:72)[8:org.apache.karaf.features.core:4.0.7]
	at org.apache.karaf.features.internal.region.Subsystem.downloadBundles(Subsystem.java:363)[8:org.apache.karaf.features.core:4.0.7]
	at org.apache.karaf.features.internal.region.Subsystem.downloadBundles(Subsystem.java:360)[8:org.apache.karaf.features.core:4.0.7]
	at org.apache.karaf.features.internal.region.SubsystemResolver.resolve(SubsystemResolver.java:187)[8:org.apache.karaf.features.core:4.0.7]
	at org.apache.karaf.features.internal.service.Deployer.deploy(Deployer.java:263)[8:org.apache.karaf.features.core:4.0.7]
	at org.apache.karaf.features.internal.service.FeaturesServiceImpl.doProvision(FeaturesServiceImpl.java:1176)[8:org.apache.karaf.features.core:4.0.7]
	at org.apache.karaf.features.internal.service.FeaturesServiceImpl$1.call(FeaturesServiceImpl.java:1074)[8:org.apache.karaf.features.core:4.0.7]
	at java.util.concurrent.FutureTask.run(FutureTask.java:262)[:1.7.0_80]
	at java.util.concurrent.ThreadPoolExecutor.runWorker(ThreadPoolExecutor.java:1145)[:1.7.0_80]
	at java.util.concurrent.ThreadPoolExecutor$Worker.run(ThreadPoolExecutor.java:615)[:1.7.0_80]
	at java.lang.Thread.run(Thread.java:745)[:1.7.0_80]
Caused by: java.lang.Exception: Unable to create resource for bundle mvn:org.apache.tamaya/tamaya-api/0.3-incubating-SNAPSHOT
	at org.apache.karaf.features.internal.region.Subsystem.createResource(Subsystem.java:605)[8:org.apache.karaf.features.core:4.0.7]
	at org.apache.karaf.features.internal.region.Subsystem$1.downloaded(Subsystem.java:390)[8:org.apache.karaf.features.core:4.0.7]
	at org.apache.karaf.features.internal.download.impl.MavenDownloadManager$MavenDownloader$1.operationComplete(MavenDownloadManager.java:133)[8:org.apache.karaf.features.core:4.0.7]
	at org.apache.karaf.features.internal.download.impl.MavenDownloadManager$MavenDownloader$1.operationComplete(MavenDownloadManager.java:127)[8:org.apache.karaf.features.core:4.0.7]
	at org.apache.karaf.features.internal.download.impl.DefaultFuture.notifyListener(DefaultFuture.java:344)[8:org.apache.karaf.features.core:4.0.7]
	at org.apache.karaf.features.internal.download.impl.DefaultFuture.notifyListeners(DefaultFuture.java:329)[8:org.apache.karaf.features.core:4.0.7]
	at org.apache.karaf.features.internal.download.impl.DefaultFuture.setValue(DefaultFuture.java:255)[8:org.apache.karaf.features.core:4.0.7]
	at org.apache.karaf.features.internal.download.impl.AbstractDownloadTask.setFile(AbstractDownloadTask.java:61)[8:org.apache.karaf.features.core:4.0.7]
	at org.apache.karaf.features.internal.download.impl.AbstractRetryableDownloadTask.run(AbstractRetryableDownloadTask.java:59)[8:org.apache.karaf.features.core:4.0.7]
	at java.util.concurrent.Executors$RunnableAdapter.call(Executors.java:471)[:1.7.0_80]
	at java.util.concurrent.FutureTask.run(FutureTask.java:262)[:1.7.0_80]
	at java.util.concurrent.ScheduledThreadPoolExecutor$ScheduledFutureTask.access$201(ScheduledThreadPoolExecutor.java:178)[:1.7.0_80]
	at java.util.concurrent.ScheduledThreadPoolExecutor$ScheduledFutureTask.run(ScheduledThreadPoolExecutor.java:292)[:1.7.0_80]
	... 3 more
Caused by: org.osgi.framework.BundleException: Unable to build resource for mvn:org.apache.tamaya/tamaya-api/0.3-incubating-SNAPSHOT:
Unsupported 'Bundle-ManifestVersion' value: 1
	at org.apache.karaf.features.internal.resolver.ResourceBuilder.build(ResourceBuilder.java:80)[8:org.apache.karaf.features.core:4.0.7]
	at org.apache.karaf.features.internal.resolver.ResourceBuilder.build(ResourceBuilder.java:69)[8:org.apache.karaf.features.core:4.0.7]
	at org.apache.karaf.features.internal.region.Subsystem.createResource(Subsystem.java:603)[8:org.apache.karaf.features.core:4.0.7]
	... 15 more
Caused by: org.osgi.framework.BundleException: Unsupported 'Bundle-ManifestVersion' value:
1
	at org.apache.karaf.features.internal.resolver.ResourceBuilder.doBuild(ResourceBuilder.java:88)[8:org.apache.karaf.features.core:4.0.7]
	at org.apache.karaf.features.internal.resolver.ResourceBuilder.build(ResourceBuilder.java:78)[8:org.apache.karaf.features.core:4.0.7]
	... 17 more
[SUREFIRE] std/in stream corrupted
java.io.IOException: Command NOOP unexpectedly read Void data with length 4.
	at org.apache.maven.surefire.booter.MasterProcessCommand.decode(MasterProcessCommand.java:139)
	at org.apache.maven.surefire.booter.CommandReader$CommandRunnable.run(CommandReader.java:360)
	at java.lang.Thread.run(Thread.java:745)

Results :

Tests run: 0, Failures: 0, Errors: 0, Skipped: 0

[JENKINS] Recording test results

Mime
View raw message