tamaya-commits mailing list archives

Site index · List index
Message view « Date » · « Thread »
Top « Date » · « Thread »
From Apache Jenkins Server <jenk...@builds.apache.org>
Subject Build failed in Jenkins: Tamaya-Extensions-Master #229
Date Tue, 13 Dec 2016 00:54:10 GMT
See <https://builds.apache.org/job/Tamaya-Extensions-Master/229/>

------------------------------------------
[...truncated 904 lines...]
[DEBUG] Implicit exclude: **/BitKeeper
[DEBUG] Implicit exclude: **/ChangeSet/**
[DEBUG] Implicit exclude: pom.xml.next
[DEBUG] Implicit exclude: .classpath
[DEBUG] Implicit exclude: **/.bzr
[DEBUG] Implicit exclude: pom.xml.releaseBackup
[DEBUG] Implicit exclude: .settings/**/*
[DEBUG] Implicit exclude: release.properties
[DEBUG] Implicit exclude: */.hg/*
[DEBUG] Implicit exclude: **/BitKeeper/**
[DEBUG] Implicit exclude: *~
[DEBUG] Implicit exclude: **/.bzr/**
[DEBUG] Implicit exclude: **/.darcsrepo
[DEBUG] Implicit exclude: .DS_Store
[DEBUG] Implicit exclude: **/._*
[DEBUG] Implicit exclude: .idea
[DEBUG] Implicit exclude: .settings
[DEBUG] Implicit exclude: **/*~
[DEBUG] Implicit exclude: target/**/*
[DEBUG] Implicit exclude: .repository
[DEBUG] Implicit exclude: */CVS/*
[DEBUG] Implicit exclude: *.iws
[DEBUG] Implicit exclude: **/.svn/**
[DEBUG] Implicit exclude: build.log
[DEBUG] Implicit exclude: **/project.pj
[DEBUG] Implicit exclude: **/.hgignore
[DEBUG] Implicit exclude: **/-darcs-backup*
[DEBUG] Implicit exclude: .project
[DEBUG] Implicit exclude: **/.metadata/**
[DEBUG] Implicit exclude: **/ChangeSet
[DEBUG] Implicit exclude: **/.gitattributes
[DEBUG] Implicit exclude: **/CVS/**
[DEBUG] Implicit exclude: dependency-reduced-pom.xml
[DEBUG] Implicit exclude: **/*.checkstyle
[DEBUG] Implicit exclude: **/%*%
[DEBUG] Implicit exclude: **/.git/**
[DEBUG] Implicit exclude: **/.hg/**
[DEBUG] Implicit exclude: **/.arch-ids/**
[DEBUG] Implicit exclude: **/.bzrignore
[DEBUG] Implicit exclude: **/.git
[DEBUG] Implicit exclude: **/SCCS/**
[DEBUG] Implicit exclude: **/_darcs
[DEBUG] Implicit exclude: **/.hg
[DEBUG] Implicit exclude: **/.metadata
[DEBUG] Implicit exclude: */.git/*
[DEBUG] Implicit exclude: **/.#*
[DEBUG] Implicit exclude: **/vssver.scc
[DEBUG] Implicit exclude: pom.xml.tag
[DEBUG] Implicit exclude: **/#*#
[DEBUG] Implicit exclude: modules/**/*
[DEBUG] Implicit exclude: */.svn/*
[DEBUG] Implicit exclude: */.bzr/*
[DEBUG] Implicit exclude: **/CVS
[DEBUG] Implicit exclude: .mvn
[DEBUG] Implicit exclude: **/RCS
[DEBUG] Implicit exclude: *.iml
[DEBUG] Implicit exclude: distribution/**/*
[DEBUG] Implicit exclude: *.log
[DEBUG] Implicit exclude: **/RCS/**
[DEBUG] Implicit exclude: **/.arch-ids
[DEBUG] Implicit exclude: temp-properties-files-for-site/
[DEBUG] Implicit exclude: cobertura.ser
[DEBUG] Implicit exclude: **/.darcs-temp-mail
[DEBUG] Implicit exclude: target/
[DEBUG] Implicit exclude: **/.svn
[DEBUG] Implicit exclude: **/.gitignore
[DEBUG] Implicit exclude: **/.MySCMServerInfo
[DEBUG] Implicit exclude: **/_darcs/**
[DEBUG] Implicit exclude: **/*.fbExcludeFilterFile
[DEBUG] Implicit exclude: **/.darcsrepo/**
[DEBUG] Implicit exclude: **/.DS_Store
[DEBUG] Implicit exclude: .idea/**/*
[DEBUG] Implicit exclude: pom.xml.versionsBackup
[DEBUG] Implicit exclude: **/.cvsignore
[INFO] Exclude: **/*banner.txt
[INFO] Exclude: banner.txt
[INFO] Exclude: .git
[INFO] Exclude: derby.log
[INFO] Exclude: **/bootstrap-*
[INFO] Exclude: **/js/jquery-*
[INFO] Exclude: **/*.json
[INFO] Exclude: **/*.md
[INFO] Exclude: **/*.md.vm
[INFO] Exclude: src/site/asciidoc/temp-properties-files-for-site/attributes.adoc
[INFO] Exclude: readme/**
[DEBUG] No excluded resources.
[INFO] 1 resources included (use -debug for more details)
[DEBUG]  - included pom.xml
[INFO] Rat check: Summary over all files. Unapproved: 0, unknown: 0, generated: 0, approved:
1 licenses.
[WARNING] Failed to getClass for org.apache.maven.plugins.source.SourceJarMojo
[INFO] 
[INFO] <<< maven-source-plugin:3.0.1:jar (source-jar) < generate-sources @ tamaya-extensions-all
<<<
[INFO] 
[INFO] --- maven-source-plugin:3.0.1:jar (source-jar) @ tamaya-extensions-all ---
[INFO] 
[INFO] --- maven-failsafe-plugin:2.19.1:integration-test (default) @ tamaya-extensions-all
---
[INFO] No tests to run.
[INFO] Skipping execution of surefire because it has already been run for this configuration
[JENKINS] Recording test results[INFO] 

[INFO] --- maven-failsafe-plugin:2.19.1:verify (default) @ tamaya-extensions-all ---
[DEBUG] Failsafe report directory: <https://builds.apache.org/job/Tamaya-Extensions-Master/ws/target/failsafe-reports>
[JENKINS] Recording test results
[INFO] 
[INFO] --- maven-install-plugin:2.5.2:install (default-install) @ tamaya-extensions-all ---
[INFO] Installing <https://builds.apache.org/job/Tamaya-Extensions-Master/ws/pom.xml>
to /home/jenkins/jenkins-slave/maven-repositories/0/org/apache/tamaya/ext/tamaya-extensions-all/0.3-incubating-SNAPSHOT/tamaya-extensions-all-0.3-incubating-SNAPSHOT.pom
[DEBUG] Writing tracking file /home/jenkins/jenkins-slave/maven-repositories/0/org/apache/tamaya/ext/tamaya-extensions-all/0.3-incubating-SNAPSHOT/_remote.repositories
[INFO] Installing <https://builds.apache.org/job/Tamaya-Extensions-Master/ws/target/feature/feature.xml>
to /home/jenkins/jenkins-slave/maven-repositories/0/org/apache/tamaya/ext/tamaya-extensions-all/0.3-incubating-SNAPSHOT/tamaya-extensions-all-0.3-incubating-SNAPSHOT-features.xml
[DEBUG] Writing tracking file /home/jenkins/jenkins-slave/maven-repositories/0/org/apache/tamaya/ext/tamaya-extensions-all/0.3-incubating-SNAPSHOT/_remote.repositories
[INFO] Installing <https://builds.apache.org/job/Tamaya-Extensions-Master/ws/target/feature/feature.xml>
to /home/jenkins/jenkins-slave/maven-repositories/0/org/apache/tamaya/ext/tamaya-extensions-all/0.3-incubating-SNAPSHOT/tamaya-extensions-all-0.3-incubating-SNAPSHOT-features.xml
[DEBUG] Skipped re-installing <https://builds.apache.org/job/Tamaya-Extensions-Master/ws/target/feature/feature.xml>
to /home/jenkins/jenkins-slave/maven-repositories/0/org/apache/tamaya/ext/tamaya-extensions-all/0.3-incubating-SNAPSHOT/tamaya-extensions-all-0.3-incubating-SNAPSHOT-features.xml,
seems unchanged
[DEBUG] Writing tracking file /home/jenkins/jenkins-slave/maven-repositories/0/org/apache/tamaya/ext/tamaya-extensions-all/0.3-incubating-SNAPSHOT/_remote.repositories
[INFO] 
[INFO] --- maven-deploy-plugin:2.8.2:deploy (default-deploy) @ tamaya-extensions-all ---
[DEBUG] Using transporter WagonTransporter with priority -1.0 for https://repository.apache.org/content/repositories/snapshots
[DEBUG] Using connector BasicRepositoryConnector with priority 0.0 for https://repository.apache.org/content/repositories/snapshots
[INFO] Downloading: https://repository.apache.org/content/repositories/snapshots/org/apache/tamaya/ext/tamaya-extensions-all/0.3-incubating-SNAPSHOT/maven-metadata.xml
[INFO] Downloaded: https://repository.apache.org/content/repositories/snapshots/org/apache/tamaya/ext/tamaya-extensions-all/0.3-incubating-SNAPSHOT/maven-metadata.xml
(864 B at 0.9 KB/sec)
[DEBUG] Writing tracking file /home/jenkins/jenkins-slave/maven-repositories/0/org/apache/tamaya/ext/tamaya-extensions-all/0.3-incubating-SNAPSHOT/resolver-status.properties
[INFO] Uploading: https://repository.apache.org/content/repositories/snapshots/org/apache/tamaya/ext/tamaya-extensions-all/0.3-incubating-SNAPSHOT/tamaya-extensions-all-0.3-incubating-20161213.011737-11.pom
[INFO] ------------------------------------------------------------------------
[INFO] Reactor Summary:
[INFO] 
[INFO] Apache Tamaya Extensions ........................... FAILURE [ 42.727 s]
[INFO] Apache Tamaya Extension Modules .................... SKIPPED
[INFO] Apache Tamaya Modules Common Functional Extensions . SKIPPED
[INFO] Apache Tamaya Common Support Classes ............... SKIPPED
[INFO] Apache Tamaya Optional Configuration Backend ....... SKIPPED
[INFO] Apache Tamaya Event and dynamic Update Extensions .. SKIPPED
[INFO] Apache Tamaya Adaptive Configuration Filtering ..... SKIPPED
[INFO] Apache Tamaya Resource Services .................... SKIPPED
[INFO] Apache Tamaya Modules - Formats Parent ............. SKIPPED
[INFO] Apache Tamaya Modules Formats Common ............... SKIPPED
[INFO] Apache Tamaya JSON Support ......................... SKIPPED
[INFO] Apache Tamaya YAML Support ......................... SKIPPED
[INFO] Apache Tamaya Modules - Injection Parent ........... SKIPPED
[INFO] Apache Tamaya Modules - Injection API .............. SKIPPED
[INFO] Apache Tamaya Resolver Services .................... SKIPPED
[INFO] Apache Tamaya Modules - Injection Standalone ....... SKIPPED
[INFO] Apache Tamaya Modules - Injection CDI (Direct) ..... SKIPPED
[INFO] Apache Tamaya Modules - Injection CDI .............. SKIPPED
[INFO] Apache Tamaya Modules - Mutable Configuration ...... SKIPPED
[INFO] Apache Tamaya Spring Integration ................... SKIPPED
[INFO] Apache Tamaya Extension Distribution ............... SKIPPED
[INFO] ------------------------------------------------------------------------
[INFO] BUILD FAILURE
[INFO] ------------------------------------------------------------------------
[INFO] Total time: 58.645 s
[INFO] Finished at: 2016-12-13T01:17:52+00:00
[INFO] Final Memory: 51M/601M
[INFO] ------------------------------------------------------------------------
Waiting for Jenkins to finish collecting data
[ERROR] Failed to execute goal org.apache.maven.plugins:maven-deploy-plugin:2.8.2:deploy (default-deploy)
on project tamaya-extensions-all: Failed to deploy artifacts: Could not transfer artifact
org.apache.tamaya.ext:tamaya-extensions-all:pom:0.3-incubating-20161213.011737-11 from/to
apache.snapshots.https (https://repository.apache.org/content/repositories/snapshots): Failed
to transfer file: https://repository.apache.org/content/repositories/snapshots/org/apache/tamaya/ext/tamaya-extensions-all/0.3-incubating-SNAPSHOT/tamaya-extensions-all-0.3-incubating-20161213.011737-11.pom.
Return code is: 401, ReasonPhrase: Unauthorized. -> [Help 1]
org.apache.maven.lifecycle.LifecycleExecutionException: Failed to execute goal org.apache.maven.plugins:maven-deploy-plugin:2.8.2:deploy
(default-deploy) on project tamaya-extensions-all: Failed to deploy artifacts: Could not transfer
artifact org.apache.tamaya.ext:tamaya-extensions-all:pom:0.3-incubating-20161213.011737-11
from/to apache.snapshots.https (https://repository.apache.org/content/repositories/snapshots):
Failed to transfer file: https://repository.apache.org/content/repositories/snapshots/org/apache/tamaya/ext/tamaya-extensions-all/0.3-incubating-SNAPSHOT/tamaya-extensions-all-0.3-incubating-20161213.011737-11.pom.
Return code is: 401, ReasonPhrase: Unauthorized.
	at org.apache.maven.lifecycle.internal.MojoExecutor.execute(MojoExecutor.java:216)
	at org.apache.maven.lifecycle.internal.MojoExecutor.execute(MojoExecutor.java:153)
	at org.apache.maven.lifecycle.internal.MojoExecutor.execute(MojoExecutor.java:145)
	at org.apache.maven.lifecycle.internal.LifecycleModuleBuilder.buildProject(LifecycleModuleBuilder.java:116)
	at org.apache.maven.lifecycle.internal.LifecycleModuleBuilder.buildProject(LifecycleModuleBuilder.java:80)
	at org.apache.maven.lifecycle.internal.builder.singlethreaded.SingleThreadedBuilder.build(SingleThreadedBuilder.java:51)
	at org.apache.maven.lifecycle.internal.LifecycleStarter.execute(LifecycleStarter.java:128)
	at org.apache.maven.DefaultMaven.doExecute(DefaultMaven.java:307)
	at org.apache.maven.DefaultMaven.doExecute(DefaultMaven.java:193)
	at org.apache.maven.DefaultMaven.execute(DefaultMaven.java:106)
	at org.jvnet.hudson.maven3.launcher.Maven32Launcher.main(Maven32Launcher.java:132)
	at sun.reflect.NativeMethodAccessorImpl.invoke0(Native Method)
	at sun.reflect.NativeMethodAccessorImpl.invoke(NativeMethodAccessorImpl.java:62)
	at sun.reflect.DelegatingMethodAccessorImpl.invoke(DelegatingMethodAccessorImpl.java:43)
	at java.lang.reflect.Method.invoke(Method.java:498)
	at org.codehaus.plexus.classworlds.launcher.Launcher.launchStandard(Launcher.java:330)
	at org.codehaus.plexus.classworlds.launcher.Launcher.launch(Launcher.java:238)
	at jenkins.maven3.agent.Maven32Main.launch(Maven32Main.java:186)
	at sun.reflect.NativeMethodAccessorImpl.invoke0(Native Method)
	at sun.reflect.NativeMethodAccessorImpl.invoke(NativeMethodAccessorImpl.java:62)
	at sun.reflect.DelegatingMethodAccessorImpl.invoke(DelegatingMethodAccessorImpl.java:43)
	at java.lang.reflect.Method.invoke(Method.java:498)
	at hudson.maven.Maven3Builder.call(Maven3Builder.java:136)
	at hudson.maven.Maven3Builder.call(Maven3Builder.java:71)
	at hudson.remoting.UserRequest.perform(UserRequest.java:153)
	at hudson.remoting.UserRequest.perform(UserRequest.java:50)
	at hudson.remoting.Request$2.run(Request.java:332)
	at hudson.remoting.InterceptingExecutorService$1.call(InterceptingExecutorService.java:68)
	at java.util.concurrent.FutureTask.run(FutureTask.java:266)
	at java.util.concurrent.ThreadPoolExecutor.runWorker(ThreadPoolExecutor.java:1142)
	at java.util.concurrent.ThreadPoolExecutor$Worker.run(ThreadPoolExecutor.java:617)
	at java.lang.Thread.run(Thread.java:745)
Caused by: org.apache.maven.plugin.MojoExecutionException: Failed to deploy artifacts: Could
not transfer artifact org.apache.tamaya.ext:tamaya-extensions-all:pom:0.3-incubating-20161213.011737-11
from/to apache.snapshots.https (https://repository.apache.org/content/repositories/snapshots):
Failed to transfer file: https://repository.apache.org/content/repositories/snapshots/org/apache/tamaya/ext/tamaya-extensions-all/0.3-incubating-SNAPSHOT/tamaya-extensions-all-0.3-incubating-20161213.011737-11.pom.
Return code is: 401, ReasonPhrase: Unauthorized.
	at org.apache.maven.plugin.deploy.DeployMojo.deployProject(DeployMojo.java:284)
	at org.apache.maven.plugin.deploy.DeployMojo.execute(DeployMojo.java:169)
	at org.apache.maven.plugin.DefaultBuildPluginManager.executeMojo(DefaultBuildPluginManager.java:134)
	at org.apache.maven.lifecycle.internal.MojoExecutor.execute(MojoExecutor.java:208)
	... 31 more
Caused by: org.apache.maven.artifact.deployer.ArtifactDeploymentException: Failed to deploy
artifacts: Could not transfer artifact org.apache.tamaya.ext:tamaya-extensions-all:pom:0.3-incubating-20161213.011737-11
from/to apache.snapshots.https (https://repository.apache.org/content/repositories/snapshots):
Failed to transfer file: https://repository.apache.org/content/repositories/snapshots/org/apache/tamaya/ext/tamaya-extensions-all/0.3-incubating-SNAPSHOT/tamaya-extensions-all-0.3-incubating-20161213.011737-11.pom.
Return code is: 401, ReasonPhrase: Unauthorized.
	at org.apache.maven.artifact.deployer.DefaultArtifactDeployer.deploy(DefaultArtifactDeployer.java:143)
	at org.apache.maven.plugin.deploy.AbstractDeployMojo.deploy(AbstractDeployMojo.java:171)
	at org.apache.maven.plugin.deploy.DeployMojo.deployProject(DeployMojo.java:242)
	... 34 more
Caused by: org.eclipse.aether.deployment.DeploymentException: Failed to deploy artifacts:
Could not transfer artifact org.apache.tamaya.ext:tamaya-extensions-all:pom:0.3-incubating-20161213.011737-11
from/to apache.snapshots.https (https://repository.apache.org/content/repositories/snapshots):
Failed to transfer file: https://repository.apache.org/content/repositories/snapshots/org/apache/tamaya/ext/tamaya-extensions-all/0.3-incubating-SNAPSHOT/tamaya-extensions-all-0.3-incubating-20161213.011737-11.pom.
Return code is: 401, ReasonPhrase: Unauthorized.
	at org.eclipse.aether.internal.impl.DefaultDeployer.deploy(DefaultDeployer.java:317)
	at org.eclipse.aether.internal.impl.DefaultDeployer.deploy(DefaultDeployer.java:245)
	at org.eclipse.aether.internal.impl.DefaultRepositorySystem.deploy(DefaultRepositorySystem.java:413)
	at org.apache.maven.artifact.deployer.DefaultArtifactDeployer.deploy(DefaultArtifactDeployer.java:139)
	... 36 more
Caused by: org.eclipse.aether.transfer.ArtifactTransferException: Could not transfer artifact
org.apache.tamaya.ext:tamaya-extensions-all:pom:0.3-incubating-20161213.011737-11 from/to
apache.snapshots.https (https://repository.apache.org/content/repositories/snapshots): Failed
to transfer file: https://repository.apache.org/content/repositories/snapshots/org/apache/tamaya/ext/tamaya-extensions-all/0.3-incubating-SNAPSHOT/tamaya-extensions-all-0.3-incubating-20161213.011737-11.pom.
Return code is: 401, ReasonPhrase: Unauthorized.
	at org.eclipse.aether.connector.basic.ArtifactTransportListener.transferFailed(ArtifactTransportListener.java:43)
	at org.eclipse.aether.connector.basic.BasicRepositoryConnector$TaskRunner.run(BasicRepositoryConnector.java:355)
	at org.eclipse.aether.connector.basic.BasicRepositoryConnector.put(BasicRepositoryConnector.java:274)
	at org.eclipse.aether.internal.impl.DefaultDeployer.deploy(DefaultDeployer.java:311)
	... 39 more
Caused by: org.apache.maven.wagon.TransferFailedException: Failed to transfer file: https://repository.apache.org/content/repositories/snapshots/org/apache/tamaya/ext/tamaya-extensions-all/0.3-incubating-SNAPSHOT/tamaya-extensions-all-0.3-incubating-20161213.011737-11.pom.
Return code is: 401, ReasonPhrase: Unauthorized.
	at org.apache.maven.wagon.providers.http.AbstractHttpClientWagon.put(AbstractHttpClientWagon.java:642)
	at org.apache.maven.wagon.providers.http.AbstractHttpClientWagon.put(AbstractHttpClientWagon.java:557)
	at org.apache.maven.wagon.providers.http.AbstractHttpClientWagon.put(AbstractHttpClientWagon.java:539)
	at org.apache.maven.wagon.providers.http.AbstractHttpClientWagon.put(AbstractHttpClientWagon.java:533)
	at org.apache.maven.wagon.providers.http.AbstractHttpClientWagon.put(AbstractHttpClientWagon.java:513)
	at org.eclipse.aether.transport.wagon.WagonTransporter$PutTaskRunner.run(WagonTransporter.java:644)
	at org.eclipse.aether.transport.wagon.WagonTransporter.execute(WagonTransporter.java:427)
	at org.eclipse.aether.transport.wagon.WagonTransporter.put(WagonTransporter.java:410)
	at org.eclipse.aether.connector.basic.BasicRepositoryConnector$PutTaskRunner.runTask(BasicRepositoryConnector.java:510)
	at org.eclipse.aether.connector.basic.BasicRepositoryConnector$TaskRunner.run(BasicRepositoryConnector.java:350)
	... 41 more
[ERROR] 
[ERROR] Re-run Maven using the -X switch to enable full debug logging.
[ERROR] 
[ERROR] For more information about the errors and possible solutions, please read the following
articles:
[ERROR] [Help 1] http://cwiki.apache.org/confluence/display/MAVEN/MojoExecutionException
[JENKINS] Archiving <https://builds.apache.org/job/Tamaya-Extensions-Master/ws/modules/filter/pom.xml>
to org.apache.tamaya.ext/tamaya-filter/0.3-incubating-SNAPSHOT/tamaya-filter-0.3-incubating-SNAPSHOT.pom
[JENKINS] Archiving <https://builds.apache.org/job/Tamaya-Extensions-Master/ws/modules/pom.xml>
to org.apache.tamaya.ext/tamaya-extensions/0.3-incubating-SNAPSHOT/tamaya-extensions-0.3-incubating-SNAPSHOT.pom
[JENKINS] Archiving <https://builds.apache.org/job/Tamaya-Extensions-Master/ws/modules/spring/pom.xml>
to org.apache.tamaya.ext/tamaya-spring/0.3-incubating-SNAPSHOT/tamaya-spring-0.3-incubating-SNAPSHOT.pom
[JENKINS] Archiving <https://builds.apache.org/job/Tamaya-Extensions-Master/ws/modules/events/pom.xml>
to org.apache.tamaya.ext/tamaya-events/0.3-incubating-SNAPSHOT/tamaya-events-0.3-incubating-SNAPSHOT.pom
[JENKINS] Archiving <https://builds.apache.org/job/Tamaya-Extensions-Master/ws/modules/formats/base/pom.xml>
to org.apache.tamaya.ext/tamaya-formats/0.3-incubating-SNAPSHOT/tamaya-formats-0.3-incubating-SNAPSHOT.pom
[JENKINS] Archiving <https://builds.apache.org/job/Tamaya-Extensions-Master/ws/modules/injection/cdi-ee/pom.xml>
to org.apache.tamaya.ext/tamaya-cdi/0.3-incubating-SNAPSHOT/tamaya-cdi-0.3-incubating-SNAPSHOT.pom
[JENKINS] Archiving <https://builds.apache.org/job/Tamaya-Extensions-Master/ws/modules/spi-support/pom.xml>
to org.apache.tamaya.ext/tamaya-spisupport/0.3-incubating-SNAPSHOT/tamaya-spisupport-0.3-incubating-SNAPSHOT.pom
[JENKINS] Archiving <https://builds.apache.org/job/Tamaya-Extensions-Master/ws/modules/formats/yaml/pom.xml>
to org.apache.tamaya.ext/tamaya-yaml/0.3-incubating-SNAPSHOT/tamaya-yaml-0.3-incubating-SNAPSHOT.pom
[JENKINS] Archiving <https://builds.apache.org/job/Tamaya-Extensions-Master/ws/modules/injection/injection-api/pom.xml>
to org.apache.tamaya.ext/tamaya-injection-api/0.3-incubating-SNAPSHOT/tamaya-injection-api-0.3-incubating-SNAPSHOT.pom
[JENKINS] Archiving <https://builds.apache.org/job/Tamaya-Extensions-Master/ws/modules/mutable-config/pom.xml>
to org.apache.tamaya.ext/tamaya-mutable-config/0.3-incubating-SNAPSHOT/tamaya-mutable-config-0.3-incubating-SNAPSHOT.pom
[JENKINS] Archiving <https://builds.apache.org/job/Tamaya-Extensions-Master/ws/modules/formats/pom.xml>
to org.apache.tamaya.ext/tamaya-formats-all/0.3-incubating-SNAPSHOT/tamaya-formats-all-0.3-incubating-SNAPSHOT.pom
[JENKINS] Archiving <https://builds.apache.org/job/Tamaya-Extensions-Master/ws/modules/injection/cdi-se/pom.xml>
to org.apache.tamaya.ext/tamaya-cdi-se/0.3-incubating-SNAPSHOT/tamaya-cdi-se-0.3-incubating-SNAPSHOT.pom
[JENKINS] Archiving <https://builds.apache.org/job/Tamaya-Extensions-Master/ws/pom.xml>
to org.apache.tamaya.ext/tamaya-extensions-all/0.3-incubating-SNAPSHOT/tamaya-extensions-all-0.3-incubating-SNAPSHOT.pom
[JENKINS] Archiving <https://builds.apache.org/job/Tamaya-Extensions-Master/ws/target/feature/feature.xml>
to org.apache.tamaya.ext/tamaya-extensions-all/0.3-incubating-SNAPSHOT/tamaya-extensions-all-0.3-incubating-SNAPSHOT-features.xml
[JENKINS] Archiving <https://builds.apache.org/job/Tamaya-Extensions-Master/ws/modules/resources/pom.xml>
to org.apache.tamaya.ext/tamaya-resources/0.3-incubating-SNAPSHOT/tamaya-resources-0.3-incubating-SNAPSHOT.pom
[JENKINS] Archiving <https://builds.apache.org/job/Tamaya-Extensions-Master/ws/modules/formats/json/pom.xml>
to org.apache.tamaya.ext/tamaya-json/0.3-incubating-SNAPSHOT/tamaya-json-0.3-incubating-SNAPSHOT.pom
[JENKINS] Archiving <https://builds.apache.org/job/Tamaya-Extensions-Master/ws/modules/injection/pom.xml>
to org.apache.tamaya.ext/tamaya-injection-all/0.3-incubating-SNAPSHOT/tamaya-injection-all-0.3-incubating-SNAPSHOT.pom
[JENKINS] Archiving <https://builds.apache.org/job/Tamaya-Extensions-Master/ws/modules/functions/pom.xml>
to org.apache.tamaya.ext/tamaya-functions/0.3-incubating-SNAPSHOT/tamaya-functions-0.3-incubating-SNAPSHOT.pom
[JENKINS] Archiving <https://builds.apache.org/job/Tamaya-Extensions-Master/ws/modules/optional/pom.xml>
to org.apache.tamaya.ext/tamaya-optional/0.3-incubating-SNAPSHOT/tamaya-optional-0.3-incubating-SNAPSHOT.pom
[JENKINS] Archiving <https://builds.apache.org/job/Tamaya-Extensions-Master/ws/distribution/pom.xml>
to org.apache.tamaya.ext/tamaya-extension-distribution/0.3-incubating-SNAPSHOT/tamaya-extension-distribution-0.3-incubating-SNAPSHOT.pom
[JENKINS] Archiving <https://builds.apache.org/job/Tamaya-Extensions-Master/ws/modules/resolver/pom.xml>
to org.apache.tamaya.ext/tamaya-resolver/0.3-incubating-SNAPSHOT/tamaya-resolver-0.3-incubating-SNAPSHOT.pom
[JENKINS] Archiving <https://builds.apache.org/job/Tamaya-Extensions-Master/ws/modules/injection/standalone/pom.xml>
to org.apache.tamaya.ext/tamaya-injection/0.3-incubating-SNAPSHOT/tamaya-injection-0.3-incubating-SNAPSHOT.pom
channel stopped

Mime
View raw message