tamaya-commits mailing list archives

Site index · List index
Message view « Date » · « Thread »
Top « Date » · « Thread »
From Apache Jenkins Server <jenk...@builds.apache.org>
Subject Build failed in Jenkins: Tamaya-Extensions-Master #154
Date Tue, 15 Nov 2016 00:54:32 GMT
See <https://builds.apache.org/job/Tamaya-Extensions-Master/154/>

------------------------------------------
[...truncated 11548 lines...]
[DEBUG] Default ResourceManager initialization complete.
[DEBUG] Loaded System Directive: org.apache.velocity.runtime.directive.Stop
[DEBUG] Loaded System Directive: org.apache.velocity.runtime.directive.Define
[DEBUG] Loaded System Directive: org.apache.velocity.runtime.directive.Break
[DEBUG] Loaded System Directive: org.apache.velocity.runtime.directive.Evaluate
[DEBUG] Loaded System Directive: org.apache.velocity.runtime.directive.Literal
[DEBUG] Loaded System Directive: org.apache.velocity.runtime.directive.Macro
[DEBUG] Loaded System Directive: org.apache.velocity.runtime.directive.Parse
[DEBUG] Loaded System Directive: org.apache.velocity.runtime.directive.Include
[DEBUG] Loaded System Directive: org.apache.velocity.runtime.directive.Foreach
[DEBUG] Velocimacro : initialization starting.
[DEBUG] Velocimacro : "velocimacro.library" is not set.  Trying default library: VM_global_library.vm
[DEBUG] Velocimacro : Default library not found.
[DEBUG] Velocimacro : allowInline = true : VMs can be defined inline in templates
[DEBUG] Velocimacro : allowInlineToOverride = false : VMs defined inline may NOT replace previous
VM definitions
[DEBUG] Velocimacro : allowInlineLocal = false : VMs defined inline will be global in scope
if allowed.
[DEBUG] Velocimacro : autoload off : VM system will not automatically reload global library
macros
[DEBUG] Velocimacro : Velocimacro : initialization complete.
[DEBUG] RuntimeInstance successfully initialized.
[DEBUG] Supplemental data models won't be loaded.  No models specified.
[DEBUG] Using transporter WagonTransporter with priority -1.0 for https://repository.apache.org/content/repositories/snapshots/
[INFO] Downloading: https://repository.apache.org/content/repositories/snapshots/org/apache/tamaya/tamaya-all/0.3-incubating-SNAPSHOT/maven-metadata.xml
[INFO] Downloaded: https://repository.apache.org/content/repositories/snapshots/org/apache/tamaya/tamaya-all/0.3-incubating-SNAPSHOT/maven-metadata.xml
(2 KB at 1.9 KB/sec)
[DEBUG] Using transporter WagonTransporter with priority -1.0 for https://repository.apache.org/content/repositories/snapshots/
[INFO] Downloading: https://repository.apache.org/content/repositories/snapshots/org/apache/tamaya/tamaya-all/0.3-incubating-SNAPSHOT/tamaya-all-0.3-incubating-20161115.003354-255.pom
[INFO] Downloaded: https://repository.apache.org/content/repositories/snapshots/org/apache/tamaya/tamaya-all/0.3-incubating-SNAPSHOT/tamaya-all-0.3-incubating-20161115.003354-255.pom
(0 B at 0.0 KB/sec)
[DEBUG] Writing tracking file /home/jenkins/jenkins-slave/maven-repositories/1/org/apache/tamaya/tamaya-all/0.3-incubating-SNAPSHOT/_remote.repositories
[DEBUG] Building project for org.apache.tamaya:tamaya-api:jar:0.3-incubating-SNAPSHOT:compile
[DEBUG] Using transporter WagonTransporter with priority -1.0 for https://repository.apache.org/snapshots
[INFO] Downloading: https://repository.apache.org/snapshots/org/apache/tamaya/tamaya-code/0.3-incubating-SNAPSHOT/tamaya-code-0.3-incubating-20161115.003456-253.pom
[INFO] Downloaded: https://repository.apache.org/snapshots/org/apache/tamaya/tamaya-code/0.3-incubating-SNAPSHOT/tamaya-code-0.3-incubating-20161115.003456-253.pom
(0 B at 0.0 KB/sec)
[DEBUG] Writing tracking file /home/jenkins/jenkins-slave/maven-repositories/1/org/apache/tamaya/tamaya-code/0.3-incubating-SNAPSHOT/_remote.repositories
[DEBUG] Adding project with groupId [org.apache.tamaya]
[DEBUG] Building project for org.apache.geronimo.specs:geronimo-annotation_1.2_spec:jar:1.0-alpha-1:compile
[DEBUG] Adding project with groupId [org.apache.geronimo.specs]
[INFO] 
[INFO] --- karaf-maven-plugin:4.0.5:features-generate-descriptor (generate) @ tamaya-spisupport
---
[DEBUG] Using transporter WagonTransporter with priority -1.0 for https://repository.apache.org/content/repositories/snapshots/
[INFO] Downloading: https://repository.apache.org/content/repositories/snapshots/org/apache/tamaya/ext/tamaya-spisupport/0.3-incubating-SNAPSHOT/maven-metadata.xml
[DEBUG] Using transporter WagonTransporter with priority -1.0 for https://repository.apache.org/snapshots
[INFO] Downloading: https://repository.apache.org/snapshots/org/apache/tamaya/ext/tamaya-spisupport/0.3-incubating-SNAPSHOT/maven-metadata.xml
[INFO] Downloaded: https://repository.apache.org/content/repositories/snapshots/org/apache/tamaya/ext/tamaya-spisupport/0.3-incubating-SNAPSHOT/maven-metadata.xml
(2 KB at 2.7 KB/sec)
[INFO] Downloaded: https://repository.apache.org/snapshots/org/apache/tamaya/ext/tamaya-spisupport/0.3-incubating-SNAPSHOT/maven-metadata.xml
(2 KB at 2.5 KB/sec)
[DEBUG] Dependency collection stats: {ConflictMarker.analyzeTime=0, ConflictMarker.markTime=0,
ConflictMarker.nodeCount=4, ConflictIdSorter.graphTime=0, ConflictIdSorter.topsortTime=0,
ConflictIdSorter.conflictIdCount=3, ConflictIdSorter.conflictIdCycleCount=0, ConflictResolver.totalTime=0,
ConflictResolver.conflictItemCount=4, DefaultDependencyCollector.collectTime=594, DefaultDependencyCollector.transformTime=0}
[INFO] Generating feature descriptor file <https://builds.apache.org/job/Tamaya-Extensions-Master/ws/modules/spi-support/target/feature/feature.xml>
[DEBUG] Resolving artifact org.apache.tamaya:tamaya-api:jar:0.3-incubating-SNAPSHOT from [asf-snapshots
(https://repository.apache.org/content/repositories/snapshots/, default, releases+snapshots),
apache.snapshots (https://repository.apache.org/snapshots, default, snapshots), central (https://repo.maven.apache.org/maven2,
default, releases)]
[DEBUG] Resolved artifact org.apache.tamaya:tamaya-api:jar:0.3-incubating-SNAPSHOT to /home/jenkins/jenkins-slave/maven-repositories/1/org/apache/tamaya/tamaya-api/0.3-incubating-SNAPSHOT/tamaya-api-0.3-incubating-SNAPSHOT.jar
from asf-snapshots (https://repository.apache.org/content/repositories/snapshots/, default,
releases+snapshots)
[DEBUG] Resolving artifact org.apache.geronimo.specs:geronimo-annotation_1.2_spec:jar:1.0-alpha-1
from [asf-snapshots (https://repository.apache.org/content/repositories/snapshots/, default,
releases+snapshots), apache.snapshots (https://repository.apache.org/snapshots, default, snapshots),
central (https://repo.maven.apache.org/maven2, default, releases)]
[DEBUG] Resolved artifact org.apache.geronimo.specs:geronimo-annotation_1.2_spec:jar:1.0-alpha-1
to /home/jenkins/jenkins-slave/maven-repositories/1/org/apache/geronimo/specs/geronimo-annotation_1.2_spec/1.0-alpha-1/geronimo-annotation_1.2_spec-1.0-alpha-1.jar
from central (https://repo.maven.apache.org/maven2, default, releases)
[INFO] ...done!
[INFO] 
[INFO] --- maven-resources-plugin:2.7:resources (default-resources) @ tamaya-spisupport ---
[DEBUG] properties used {env.OLDPWD=/home/jenkins, file.encoding.pkg=sun.io, asciidoctorj.version=1.5.2,
java.home=/usr/local/asfpackages/java/jdk1.8.0_102/jre, LOGNAME=jenkins, ROOT_BUILD_CAUSE=TIMERTRIGGER,
XFILESEARCHPATH=/usr/dt/app-defaults/%L/Dt, env.GIT_URL=https://git-wip-us.apache.org/repos/asf/incubator-tamaya-extensions.git,
javadoc.version=2.10.4, NODE_NAME=ubuntu-6, PWD=/home/jenkins/jenkins-slave, JENKINS_URL=https://builds.apache.org/,
sun.font.fontmanager=sun.awt.X11FontManager, java.endorsed.dirs=/usr/local/asfpackages/java/jdk1.8.0_102/jre/lib/endorsed,
env.LOGNAME=jenkins, env.POM_VERSION=0.3-incubating-SNAPSHOT, mockito.version=1.10.19, env.HUDSON_HOME=/x1/jenkins/jenkins-home,
karaf.osgi.version=6.0.0, sun.os.patch.level=unknown, java.vendor.url=http://java.oracle.com/,
env.NODE_NAME=ubuntu-6, java.version=1.8.0_102, JOB_NAME=Tamaya-Extensions-Master, env.MAVEN_OPTS=-Xmx2g
-Xms256m -XX:MaxPermSize=512m, arguments=, env.NODE_LABELS=ubuntu ubuntu-6, env.JENKINS_SERVER_COOKIE=f4ebd1e6b0d976e8,
java.vendor.url.bug=http://bugreport.sun.com/bugreport/, env.SSH_CLIENT=140.211.11.14 44671
22, enforcer.version=1.4.1, BUILD_CAUSE=TIMERTRIGGER, user.name=jenkins, env.LANG=en_US, sun.io.unicode.encoding=UnicodeLittle,
XDG_RUNTIME_DIR=/run/user/20000, sun.jnu.encoding=ISO-8859-1, java.runtime.name=Java(TM) SE
Runtime Environment, reflow-skin.version=1.1.1, GIT_COMMITTER_EMAIL=builds@apache.org, env.SSH_CONNECTION=140.211.11.14
44671 67.195.81.188 22, java.specification.name=Java Platform API Specification, user.timezone=Etc/UTC,
path.separator=:, johnzon.version=0.9-incubating, BUILD_TAG=jenkins-Tamaya-Extensions-Master-154,
file.encoding=ISO-8859-1, PATH=/usr/local/sbin:/usr/local/bin:/usr/sbin:/usr/bin:/sbin:/bin:/usr/games:/usr/local/games,
env.HOME=/home/jenkins, sun.java.command=jenkins.maven3.agent.Maven32Main /home/jenkins/tools/maven/apache-maven-3.3.3
/home/jenkins/jenkins-slave/slave.jar /home/jenkins/jenkins-slave/maven32-interceptor.jar
/home/jenkins/jenkins-slave/maven3-interceptor-commons.jar 44108, HUDSON_URL=https://builds.apache.org/,
JENKINS_SERVER_COOKIE=f4ebd1e6b0d976e8, findbugs.skip=false, EXECUTOR_NUMBER=1, sources.plugin=3.0.1,
env.BUILD_TAG=jenkins-Tamaya-Extensions-Master-154, env.GIT_COMMITTER_NAME=jenkins, env.ROOT_BUILD_CAUSE=TIMERTRIGGER,
env._=/home/jenkins/tools/java/jdk1.7.0_55/bin/java, GIT_COMMIT=dc2cd7d380bd8a0971f8b3a49bd9394caea781a3,
GIT_COMMITTER_NAME=jenkins, java.io.tmpdir=/tmp, user.language=en, line.separator=
, maven.repo.local=/home/jenkins/jenkins-slave/maven-repositories/1, additionalparam=-Xdoclint:none,
BUILD_URL=https://builds.apache.org/job/Tamaya-Extensions-Master/154/, SSH_CONNECTION=140.211.11.14
44671 67.195.81.188 22, SHLVL=1, M2_HOME=/home/jenkins/tools/maven/apache-maven-3.3.3, USER=jenkins,
maven.compile.optimize=false, env.JOB_NAME=Tamaya-Extensions-Master, java.vm.info=mixed mode,
env.BUILD_DISPLAY_NAME=#154, java.vm.specification.name=Java Virtual Machine Specification,
BUILD_DISPLAY_NAME=#154, project.reporting.outputEncoding=UTF-8, surefire.version=2.19.1,
env.BUILD_URL=https://builds.apache.org/job/Tamaya-Extensions-Master/154/, env.M2_HOME=/home/jenkins/tools/maven/apache-maven-3.3.3,
json.spec.version=1.0-alpha-1, sourceReleaseAssemblyDescriptor=source-release, guice.disable.misplaced.annotation.check=true,
commons-io.version=2.5, maven.compile.deprecation=true, HUDSON_SERVER_COOKIE=f4ebd1e6b0d976e8,
gem.plugin=1.0.7, env.GIT_COMMITTER_EMAIL=builds@apache.org, env.POM_ARTIFACTID=tamaya-extensions-all,
MAVEN_HOME=/home/jenkins/tools/maven/apache-maven-3.3.3, java.awt.printerjob=sun.print.PSPrinterJob,
maven3.interceptor.common=/home/jenkins/jenkins-slave/maven3-interceptor-commons.jar, CLASSPATH=,
jdkVersion=1.7, env.HUDSON_SERVER_COOKIE=f4ebd1e6b0d976e8, distMgmtSnapshotsName=Apache Development
Snapshot Repository, distMgmtSnapshotsUrl=https://repository.apache.org/content/repositories/snapshots,
MAIL=/var/mail/jenkins, rat.version=0.12, env.BUILD_NUMBER=154, os.name=Linux, java.specification.vendor=Oracle
Corporation, java.vm.name=Java HotSpot(TM) 64-Bit Server VM, BUILD_NUMBER=154, env.JOB_URL=https://builds.apache.org/job/Tamaya-Extensions-Master/,
maven3.interceptor=/home/jenkins/jenkins-slave/maven32-interceptor.jar, java.library.path=/usr/java/packages/lib/amd64:/usr/lib64:/lib64:/lib:/usr/lib,
asciidoctor.version=1.5.2, findbugs.version=3.0.4, env.PATH=/home/jenkins/tools/maven/apache-maven-3.3.3/bin:/home/jenkins/tools/java/latest1.8/bin:/usr/local/sbin:/usr/local/bin:/usr/sbin:/usr/bin:/sbin:/bin:/usr/games:/usr/local/games,
GIT_AUTHOR_EMAIL=builds@apache.org, env.HUDSON_URL=https://builds.apache.org/, env.JENKINS_URL=https://builds.apache.org/,
POM_GROUPID=org.apache.tamaya.ext, POM_ARTIFACTID=tamaya-extensions-all, java.class.version=52.0,
env.SHLVL=1, JOB_URL=https://builds.apache.org/job/Tamaya-Extensions-Master/, env.BUILD_CAUSE=TIMERTRIGGER,
env.GIT_COMMIT=dc2cd7d380bd8a0971f8b3a49bd9394caea781a3, GIT_PREVIOUS_COMMIT=dc2cd7d380bd8a0971f8b3a49bd9394caea781a3,
osgi.version=6.0.0, env.JENKINS_HOME=/x1/jenkins/jenkins-home, env.BUILD_CAUSE_TIMERTRIGGER=true,
GIT_BRANCH=origin/master, JENKINS_HOME=/x1/jenkins/jenkins-home, BUILD_ID=154, sun.boot.library.path=/usr/local/asfpackages/java/jdk1.8.0_102/jre/lib/amd64,
project.build.sourceEncoding=UTF-8, sun.management.compiler=HotSpot 64-Bit Tiered Compilers,
env.POM_DISPLAYNAME=Apache Tamaya Extensions, java.awt.graphicsenv=sun.awt.X11GraphicsEnvironment,
POM_VERSION=0.3-incubating-SNAPSHOT, env.USER=jenkins, HUDSON_HOME=/x1/jenkins/jenkins-home,
GIT_PREVIOUS_SUCCESSFUL_COMMIT=dc2cd7d380bd8a0971f8b3a49bd9394caea781a3, PATH+MAVEN=/home/jenkins/tools/maven/apache-maven-3.3.3/bin,
NLSPATH=/usr/dt/lib/nls/msg/%L/%N.cat, maven.compile.sourceLevel=1.7, hamcrest.version=2.0.0.0,
junit.version=4.12, OLDPWD=/home/jenkins, gpg.useagent=true, java.vm.specification.version=1.8,
JAVA_HOME=/home/jenkins/tools/java/latest1.8, SHELL=/bin/bash, env.NLSPATH=/usr/dt/lib/nls/msg/%L/%N.cat,
awt.toolkit=sun.awt.X11.XToolkit, NODE_LABELS=ubuntu ubuntu-6, env.GIT_AUTHOR_NAME=jenkins,
env.MAVEN_HOME=/home/jenkins/tools/maven/apache-maven-3.3.3, sun.cpu.isalist=, securerandom.source=file:/dev/./urandom,
java.ext.dirs=/usr/local/asfpackages/java/jdk1.8.0_102/jre/lib/ext:/usr/java/packages/lib/ext,
os.version=3.13.0-86-generic, env.GIT_AUTHOR_EMAIL=builds@apache.org, user.home=/home/jenkins,
_=/home/jenkins/tools/java/jdk1.7.0_55/bin/java, java.vm.vendor=Oracle Corporation, env.JAVA_HOME=/home/jenkins/tools/java/latest1.8,
env.XDG_SESSION_ID=74, SSH_CLIENT=140.211.11.14 44671 22, user.dir=<https://builds.apache.org/job/Tamaya-Extensions-Master/ws/,>
env.XFILESEARCHPATH=/usr/dt/app-defaults/%L/Dt, env.MAIL=/var/mail/jenkins, env.PWD=/home/jenkins/jenkins-slave,
sun.cpu.endian=little, maven.compile.targetLevel=1.7, env.GIT_PREVIOUS_COMMIT=dc2cd7d380bd8a0971f8b3a49bd9394caea781a3,
java.vm.version=25.102-b14, java.class.path=/home/jenkins/jenkins-slave/maven32-agent.jar:/home/jenkins/tools/maven/apache-maven-3.3.3/boot/plexus-classworlds-2.5.2.jar:/home/jenkins/tools/maven/apache-maven-3.3.3/conf/logging,
org.slf4j.simpleLogger.defaultLogLevel=debug, maven.javadoc.skip=false, MAVEN_OPTS=-Xmx2g
-Xms256m -XX:MaxPermSize=512m, ROOT_BUILD_CAUSE_TIMERTRIGGER=true, os.arch=amd64, maven.build.version=Apache
Maven 3.3.3 (7994120775791599e205a5524ec3e0dfe41d4a06; 2015-04-22T11:57:37+00:00), arquillian.deamon.version=1.0.0.Alpha1,
WORKSPACE=<https://builds.apache.org/job/Tamaya-Extensions-Master/ws/,> env.POM_PACKAGING=pom,
sun.java.launcher=SUN_STANDARD, released_version=0.2-incubating, toolchains.plugin=1.1, LANG=en_US,
env.BUILD_ID=154, java.vm.specification.vendor=Oracle Corporation, file.separator=/, env.GIT_BRANCH=origin/master,
java.runtime.version=1.8.0_102-b14, XDG_SESSION_ID=74, sun.boot.class.path=/usr/local/asfpackages/java/jdk1.8.0_102/jre/lib/resources.jar:/usr/local/asfpackages/java/jdk1.8.0_102/jre/lib/rt.jar:/usr/local/asfpackages/java/jdk1.8.0_102/jre/lib/sunrsasign.jar:/usr/local/asfpackages/java/jdk1.8.0_102/jre/lib/jsse.jar:/usr/local/asfpackages/java/jdk1.8.0_102/jre/lib/jce.jar:/usr/local/asfpackages/java/jdk1.8.0_102/jre/lib/charsets.jar:/usr/local/asfpackages/java/jdk1.8.0_102/jre/lib/jfr.jar:/usr/local/asfpackages/java/jdk1.8.0_102/jre/classes,
organization.logo=https://www.apache.org/images/asf_logo_wide.gif, jruby.version=1.7.20, env.XDG_RUNTIME_DIR=/run/user/20000,
env.WORKSPACE=<https://builds.apache.org/job/Tamaya-Extensions-Master/ws/,> maven.version=3.3.3,
env.GIT_PREVIOUS_SUCCESSFUL_COMMIT=dc2cd7d380bd8a0971f8b3a49bd9394caea781a3, env.ROOT_BUILD_CAUSE_TIMERTRIGGER=true,
PATH+JDK=/home/jenkins/tools/java/latest1.8/bin, user.country=US, env.EXECUTOR_NUMBER=1, POM_PACKAGING=pom,
checkstyle.version=2.15, maven.home=/usr/local/asfpackages/maven/apache-maven-3.3.3, env.SHELL=/bin/bash,
maven.compiler.target=1.6, arquillian.version=1.1.7.Final, JOB_BASE_NAME=Tamaya-Extensions-Master,
HOME=/home/jenkins, env.JOB_BASE_NAME=Tamaya-Extensions-Master, java.vendor=Oracle Corporation,
GIT_AUTHOR_NAME=jenkins, env.POM_GROUPID=org.apache.tamaya.ext, maven.compiler.source=1.6,
BUILD_CAUSE_TIMERTRIGGER=true, env.HUDSON_COOKIE=7d163a9a-eb3c-4832-9653-a91520e92b77, asciidoctor-diagramm.version=1.2.1,
java.specification.version=1.8, POM_DISPLAYNAME=Apache Tamaya Extensions, GIT_URL=https://git-wip-us.apache.org/repos/asf/incubator-tamaya-extensions.git,
sun.arch.data.model=64}
[INFO] Using 'UTF-8' encoding to copy filtered resources.
[DEBUG] resource with targetPath null
directory <https://builds.apache.org/job/Tamaya-Extensions-Master/ws/modules/spi-support/src/main/resources>
excludes []
includes []
[INFO] skip non existing resourceDirectory <https://builds.apache.org/job/Tamaya-Extensions-Master/ws/modules/spi-support/src/main/resources>
[DEBUG] resource with targetPath null
directory <https://builds.apache.org/job/Tamaya-Extensions-Master/ws/modules/spi-support/target/maven-shared-archive-resources>
excludes []
includes []
[DEBUG] ignoreDelta true
[INFO] Copying 3 resources
[DEBUG] file LICENSE has a filtered file extension
[DEBUG] copy <https://builds.apache.org/job/Tamaya-Extensions-Master/ws/modules/spi-support/target/maven-shared-archive-resources/META-INF/LICENSE>
to <https://builds.apache.org/job/Tamaya-Extensions-Master/ws/modules/spi-support/target/classes/META-INF/LICENSE>
[DEBUG] file DEPENDENCIES has a filtered file extension
[DEBUG] copy <https://builds.apache.org/job/Tamaya-Extensions-Master/ws/modules/spi-support/target/maven-shared-archive-resources/META-INF/DEPENDENCIES>
to <https://builds.apache.org/job/Tamaya-Extensions-Master/ws/modules/spi-support/target/classes/META-INF/DEPENDENCIES>
[DEBUG] file NOTICE has a filtered file extension
[DEBUG] copy <https://builds.apache.org/job/Tamaya-Extensions-Master/ws/modules/spi-support/target/maven-shared-archive-resources/META-INF/NOTICE>
to <https://builds.apache.org/job/Tamaya-Extensions-Master/ws/modules/spi-support/target/classes/META-INF/NOTICE>
[DEBUG] no use filter components
[INFO] 
[INFO] --- maven-compiler-plugin:3.5.1:compile (default-compile) @ tamaya-spisupport ---
[DEBUG] Using compiler 'javac'.
[DEBUG] Source directories: [<https://builds.apache.org/job/Tamaya-Extensions-Master/ws/modules/spi-support/src/main/java]>
[DEBUG] Classpath: [<https://builds.apache.org/job/Tamaya-Extensions-Master/ws/modules/spi-support/target/classes>
 /home/jenkins/jenkins-slave/maven-repositories/1/org/apache/tamaya/tamaya-api/0.3-incubating-SNAPSHOT/tamaya-api-0.3-incubating-SNAPSHOT.jar
 /home/jenkins/jenkins-slave/maven-repositories/1/org/apache/geronimo/specs/geronimo-annotation_1.2_spec/1.0-alpha-1/geronimo-annotation_1.2_spec-1.0-alpha-1.jar]
[DEBUG] Output directory: <https://builds.apache.org/job/Tamaya-Extensions-Master/ws/modules/spi-support/target/classes>
[DEBUG] Adding <https://builds.apache.org/job/Tamaya-Extensions-Master/ws/modules/spi-support/target/generated-sources/annotations>
to compile source roots:
  <https://builds.apache.org/job/Tamaya-Extensions-Master/ws/modules/spi-support/src/main/java>
[DEBUG] New compile source roots:
  <https://builds.apache.org/job/Tamaya-Extensions-Master/ws/modules/spi-support/src/main/java>
  <https://builds.apache.org/job/Tamaya-Extensions-Master/ws/modules/spi-support/target/generated-sources/annotations>
[DEBUG] CompilerReuseStrategy: reuseCreated
[DEBUG] useIncrementalCompilation enabled
[DEBUG] Stale source detected: <https://builds.apache.org/job/Tamaya-Extensions-Master/ws/modules/spi-support/src/main/java/org/apache/tamaya/spisupport/BasePropertySource.java>
[DEBUG] Stale source detected: <https://builds.apache.org/job/Tamaya-Extensions-Master/ws/modules/spi-support/src/main/java/org/apache/tamaya/spisupport/PropertySourceComparator.java>
[DEBUG] Stale source detected: <https://builds.apache.org/job/Tamaya-Extensions-Master/ws/modules/spi-support/src/main/java/org/apache/tamaya/spisupport/PriorityServiceComparator.java>
[DEBUG] Stale source detected: <https://builds.apache.org/job/Tamaya-Extensions-Master/ws/modules/spi-support/src/main/java/org/apache/tamaya/spisupport/SystemPropertySource.java>
[DEBUG] Stale source detected: <https://builds.apache.org/job/Tamaya-Extensions-Master/ws/modules/spi-support/src/main/java/org/apache/tamaya/spisupport/DefaultConfiguration.java>
[DEBUG] Stale source detected: <https://builds.apache.org/job/Tamaya-Extensions-Master/ws/modules/spi-support/src/main/java/org/apache/tamaya/spisupport/EnvironmentPropertySource.java>
[DEBUG] Stale source detected: <https://builds.apache.org/job/Tamaya-Extensions-Master/ws/modules/spi-support/src/main/java/org/apache/tamaya/spisupport/DefaultConfigurationContext.java>
[DEBUG] Stale source detected: <https://builds.apache.org/job/Tamaya-Extensions-Master/ws/modules/spi-support/src/main/java/org/apache/tamaya/spisupport/RegexPropertyFilter.java>
[DEBUG] Stale source detected: <https://builds.apache.org/job/Tamaya-Extensions-Master/ws/modules/spi-support/src/main/java/org/apache/tamaya/spisupport/PropertyConverterManager.java>
[DEBUG] Stale source detected: <https://builds.apache.org/job/Tamaya-Extensions-Master/ws/modules/spi-support/src/main/java/org/apache/tamaya/spisupport/PropertyFilterComparator.java>
[DEBUG] Stale source detected: <https://builds.apache.org/job/Tamaya-Extensions-Master/ws/modules/spi-support/src/main/java/org/apache/tamaya/spisupport/MapPropertySource.java>
[DEBUG] Stale source detected: <https://builds.apache.org/job/Tamaya-Extensions-Master/ws/modules/spi-support/src/main/java/org/apache/tamaya/spisupport/DefaultConfigurationContextBuilder.java>
[DEBUG] Stale source detected: <https://builds.apache.org/job/Tamaya-Extensions-Master/ws/modules/spi-support/src/main/java/org/apache/tamaya/spisupport/SimplePropertySource.java>
[DEBUG] Stale source detected: <https://builds.apache.org/job/Tamaya-Extensions-Master/ws/modules/spi-support/src/main/java/org/apache/tamaya/spisupport/PropertyFiltering.java>
[DEBUG] Stale source detected: <https://builds.apache.org/job/Tamaya-Extensions-Master/ws/modules/spi-support/src/main/java/org/apache/tamaya/spisupport/EnumConverter.java>
[DEBUG] Stale source detected: <https://builds.apache.org/job/Tamaya-Extensions-Master/ws/modules/spi-support/src/main/java/org/apache/tamaya/spisupport/CLIPropertySource.java>
[DEBUG] Stale source detected: <https://builds.apache.org/job/Tamaya-Extensions-Master/ws/modules/spi-support/src/main/java/org/apache/tamaya/spisupport/PropertyFilterManager.java>
[DEBUG] Stale source detected: <https://builds.apache.org/job/Tamaya-Extensions-Master/ws/modules/spi-support/src/main/java/org/apache/tamaya/spisupport/PropertiesResourcePropertySource.java>
[INFO] Changes detected - recompiling the module!
[DEBUG] Classpath:
[DEBUG]  <https://builds.apache.org/job/Tamaya-Extensions-Master/ws/modules/spi-support/target/classes>
[DEBUG]  /home/jenkins/jenkins-slave/maven-repositories/1/org/apache/tamaya/tamaya-api/0.3-incubating-SNAPSHOT/tamaya-api-0.3-incubating-SNAPSHOT.jar
[DEBUG]  /home/jenkins/jenkins-slave/maven-repositories/1/org/apache/geronimo/specs/geronimo-annotation_1.2_spec/1.0-alpha-1/geronimo-annotation_1.2_spec-1.0-alpha-1.jar
[DEBUG] Source roots:
[DEBUG]  <https://builds.apache.org/job/Tamaya-Extensions-Master/ws/modules/spi-support/src/main/java>
[DEBUG]  <https://builds.apache.org/job/Tamaya-Extensions-Master/ws/modules/spi-support/target/generated-sources/annotations>
[DEBUG] Command line options:
[DEBUG] -d <https://builds.apache.org/job/Tamaya-Extensions-Master/ws/modules/spi-support/target/classes>
-classpath <https://builds.apache.org/job/Tamaya-Extensions-Master/ws/modules/spi-support/target/classes>:/home/jenkins/jenkins-slave/maven-repositories/1/org/apache/tamaya/tamaya-api/0.3-incubating-SNAPSHOT/tamaya-api-0.3-incubating-SNAPSHOT.jar:/home/jenkins/jenkins-slave/maven-repositories/1/org/apache/geronimo/specs/geronimo-annotation_1.2_spec/1.0-alpha-1/geronimo-annotation_1.2_spec-1.0-alpha-1.jar:
-sourcepath <https://builds.apache.org/job/Tamaya-Extensions-Master/ws/modules/spi-support/src/main/java>:<https://builds.apache.org/job/Tamaya-Extensions-Master/ws/modules/spi-support/target/generated-sources/annotations>:
-s <https://builds.apache.org/job/Tamaya-Extensions-Master/ws/modules/spi-support/target/generated-sources/annotations>
-g -deprecation -target 1.7 -source 1.7 -encoding UTF-8
[DEBUG] incrementalBuildHelper#beforeRebuildExecution
[INFO] Compiling 18 source files to <https://builds.apache.org/job/Tamaya-Extensions-Master/ws/modules/spi-support/target/classes>
[DEBUG] incrementalBuildHelper#afterRebuildExecution
[INFO] <https://builds.apache.org/job/Tamaya-Extensions-Master/ws/modules/spi-support/src/main/java/org/apache/tamaya/spisupport/DefaultConfiguration.java>:
Some input files use unchecked or unsafe operations.
[INFO] <https://builds.apache.org/job/Tamaya-Extensions-Master/ws/modules/spi-support/src/main/java/org/apache/tamaya/spisupport/DefaultConfiguration.java>:
Recompile with -Xlint:unchecked for details.
[INFO] -------------------------------------------------------------
[WARNING] COMPILATION WARNING : 
[INFO] -------------------------------------------------------------
[WARNING] bootstrap class path not set in conjunction with -source 1.7
[WARNING] <https://builds.apache.org/job/Tamaya-Extensions-Master/ws/modules/spi-support/src/main/java/org/apache/tamaya/spisupport/DefaultConfigurationContext.java>:[247,21]
<T>addPropertyConverter(org.apache.tamaya.TypeLiteral<T>,org.apache.tamaya.spi.PropertyConverter<T>)
in org.apache.tamaya.spi.ConfigurationContext has been deprecated
[WARNING] <https://builds.apache.org/job/Tamaya-Extensions-Master/ws/modules/spi-support/src/main/java/org/apache/tamaya/spisupport/CLIPropertySource.java>:[47,14]
non-varargs call of varargs method with inexact argument type for last parameter;
  cast to java.lang.String for a varargs call
  cast to java.lang.String[] for a non-varargs call and to suppress this warning
[INFO] 3 warnings 
[INFO] -------------------------------------------------------------
[INFO] -------------------------------------------------------------
[ERROR] COMPILATION ERROR : 
[INFO] -------------------------------------------------------------
[ERROR] <https://builds.apache.org/job/Tamaya-Extensions-Master/ws/modules/spi-support/src/main/java/org/apache/tamaya/spisupport/DefaultConfigurationContextBuilder.java>:[45,8]
org.apache.tamaya.spisupport.DefaultConfigurationContextBuilder is not abstract and does not
override abstract method addDefaultPropertyConverters() in org.apache.tamaya.spi.ConfigurationContextBuilder
[INFO] 1 error
[INFO] -------------------------------------------------------------
[INFO] ------------------------------------------------------------------------
[INFO] Reactor Summary:
[INFO] 
[INFO] Apache Tamaya Extensions ........................... SUCCESS [ 41.091 s]
[INFO] Apache Tamaya Extension Modules .................... SUCCESS [ 14.218 s]
[INFO] Apache Tamaya Common Support Classes ............... FAILURE [ 17.905 s]
[INFO] Apache Tamaya Modules Common Functional Extensions . SKIPPED
[INFO] Apache Tamaya Event and dynamic Update Extensions .. SKIPPED
[INFO] Apache Tamaya Adaptive Configuration Filtering ..... SKIPPED
[INFO] Apache Tamaya Resource Services .................... SKIPPED
[INFO] Apache Tamaya Modules - Formats Parent ............. SKIPPED
[INFO] Apache Tamaya Modules Formats Common ............... SKIPPED
[INFO] Apache Tamaya JSON Support ......................... SKIPPED
[INFO] Apache Tamaya YAML Support ......................... SKIPPED
[INFO] Apache Tamaya Modules - Injection Parent ........... SKIPPED
[INFO] Apache Tamaya Modules - Injection API .............. SKIPPED
[INFO] Apache Tamaya Resolver Services .................... SKIPPED
[INFO] Apache Tamaya Modules - Injection Standalone ....... SKIPPED
[INFO] Apache Tamaya Modules - Injection CDI (Direct) ..... SKIPPED
[INFO] Apache Tamaya Modules - Injection CDI .............. SKIPPED
[INFO] Apache Tamaya Modules - Mutable Configuration ...... SKIPPED
[INFO] Apache Tamaya Optional Configuration Backend ....... SKIPPED
[INFO] Apache Tamaya Spring Integration ................... SKIPPED
[INFO] Apache Tamaya Extension Distribution ............... SKIPPED
[INFO] ------------------------------------------------------------------------
[INFO] BUILD FAILURE
[INFO] ------------------------------------------------------------------------
[INFO] Total time: 01:46 min
[INFO] Finished at: 2016-11-15T00:50:53+00:00
[INFO] Final Memory: 60M/783M
[INFO] ------------------------------------------------------------------------
Waiting for Jenkins to finish collecting data
[ERROR] Failed to execute goal org.apache.maven.plugins:maven-compiler-plugin:3.5.1:compile
(default-compile) on project tamaya-spisupport: Compilation failure
[ERROR] <https://builds.apache.org/job/Tamaya-Extensions-Master/ws/modules/spi-support/src/main/java/org/apache/tamaya/spisupport/DefaultConfigurationContextBuilder.java>:[45,8]
org.apache.tamaya.spisupport.DefaultConfigurationContextBuilder is not abstract and does not
override abstract method addDefaultPropertyConverters() in org.apache.tamaya.spi.ConfigurationContextBuilder
[ERROR] -> [Help 1]
org.apache.maven.lifecycle.LifecycleExecutionException: Failed to execute goal org.apache.maven.plugins:maven-compiler-plugin:3.5.1:compile
(default-compile) on project tamaya-spisupport: Compilation failure
<https://builds.apache.org/job/Tamaya-Extensions-Master/ws/modules/spi-support/src/main/java/org/apache/tamaya/spisupport/DefaultConfigurationContextBuilder.java>:[45,8]
org.apache.tamaya.spisupport.DefaultConfigurationContextBuilder is not abstract and does not
override abstract method addDefaultPropertyConverters() in org.apache.tamaya.spi.ConfigurationContextBuilder

	at org.apache.maven.lifecycle.internal.MojoExecutor.execute(MojoExecutor.java:212)
	at org.apache.maven.lifecycle.internal.MojoExecutor.execute(MojoExecutor.java:153)
	at org.apache.maven.lifecycle.internal.MojoExecutor.execute(MojoExecutor.java:145)
	at org.apache.maven.lifecycle.internal.LifecycleModuleBuilder.buildProject(LifecycleModuleBuilder.java:116)
	at org.apache.maven.lifecycle.internal.LifecycleModuleBuilder.buildProject(LifecycleModuleBuilder.java:80)
	at org.apache.maven.lifecycle.internal.builder.singlethreaded.SingleThreadedBuilder.build(SingleThreadedBuilder.java:51)
	at org.apache.maven.lifecycle.internal.LifecycleStarter.execute(LifecycleStarter.java:128)
	at org.apache.maven.DefaultMaven.doExecute(DefaultMaven.java:307)
	at org.apache.maven.DefaultMaven.doExecute(DefaultMaven.java:193)
	at org.apache.maven.DefaultMaven.execute(DefaultMaven.java:106)
	at org.jvnet.hudson.maven3.launcher.Maven32Launcher.main(Maven32Launcher.java:132)
	at sun.reflect.NativeMethodAccessorImpl.invoke0(Native Method)
	at sun.reflect.NativeMethodAccessorImpl.invoke(NativeMethodAccessorImpl.java:62)
	at sun.reflect.DelegatingMethodAccessorImpl.invoke(DelegatingMethodAccessorImpl.java:43)
	at java.lang.reflect.Method.invoke(Method.java:498)
	at org.codehaus.plexus.classworlds.launcher.Launcher.launchStandard(Launcher.java:330)
	at org.codehaus.plexus.classworlds.launcher.Launcher.launch(Launcher.java:238)
	at jenkins.maven3.agent.Maven32Main.launch(Maven32Main.java:186)
	at sun.reflect.NativeMethodAccessorImpl.invoke0(Native Method)
	at sun.reflect.NativeMethodAccessorImpl.invoke(NativeMethodAccessorImpl.java:62)
	at sun.reflect.DelegatingMethodAccessorImpl.invoke(DelegatingMethodAccessorImpl.java:43)
	at java.lang.reflect.Method.invoke(Method.java:498)
	at hudson.maven.Maven3Builder.call(Maven3Builder.java:136)
	at hudson.maven.Maven3Builder.call(Maven3Builder.java:71)
	at hudson.remoting.UserRequest.perform(UserRequest.java:153)
	at hudson.remoting.UserRequest.perform(UserRequest.java:50)
	at hudson.remoting.Request$2.run(Request.java:332)
	at hudson.remoting.InterceptingExecutorService$1.call(InterceptingExecutorService.java:68)
	at java.util.concurrent.FutureTask.run(FutureTask.java:266)
	at java.util.concurrent.ThreadPoolExecutor.runWorker(ThreadPoolExecutor.java:1142)
	at java.util.concurrent.ThreadPoolExecutor$Worker.run(ThreadPoolExecutor.java:617)
	at java.lang.Thread.run(Thread.java:745)
Caused by: org.apache.maven.plugin.compiler.CompilationFailureException: Compilation failure
<https://builds.apache.org/job/Tamaya-Extensions-Master/ws/modules/spi-support/src/main/java/org/apache/tamaya/spisupport/DefaultConfigurationContextBuilder.java>:[45,8]
org.apache.tamaya.spisupport.DefaultConfigurationContextBuilder is not abstract and does not
override abstract method addDefaultPropertyConverters() in org.apache.tamaya.spi.ConfigurationContextBuilder

	at org.apache.maven.plugin.compiler.AbstractCompilerMojo.execute(AbstractCompilerMojo.java:972)
	at org.apache.maven.plugin.compiler.CompilerMojo.execute(CompilerMojo.java:129)
	at org.apache.maven.plugin.DefaultBuildPluginManager.executeMojo(DefaultBuildPluginManager.java:134)
	at org.apache.maven.lifecycle.internal.MojoExecutor.execute(MojoExecutor.java:208)
	... 31 more
[ERROR] 
[ERROR] Re-run Maven using the -X switch to enable full debug logging.
[ERROR] 
[ERROR] For more information about the errors and possible solutions, please read the following
articles:
[ERROR] [Help 1] http://cwiki.apache.org/confluence/display/MAVEN/MojoFailureException
[ERROR] 
[ERROR] After correcting the problems, you can resume the build with the command
[ERROR]   mvn <goals> -rf :tamaya-spisupport
[JENKINS] Archiving <https://builds.apache.org/job/Tamaya-Extensions-Master/ws/modules/filter/pom.xml>
to org.apache.tamaya.ext/tamaya-filter/0.3-incubating-SNAPSHOT/tamaya-filter-0.3-incubating-SNAPSHOT.pom
[JENKINS] Archiving <https://builds.apache.org/job/Tamaya-Extensions-Master/ws/modules/pom.xml>
to org.apache.tamaya.ext/tamaya-extensions/0.3-incubating-SNAPSHOT/tamaya-extensions-0.3-incubating-SNAPSHOT.pom
[JENKINS] Archiving <https://builds.apache.org/job/Tamaya-Extensions-Master/ws/modules/target/feature/feature.xml>
to org.apache.tamaya.ext/tamaya-extensions/0.3-incubating-SNAPSHOT/tamaya-extensions-0.3-incubating-SNAPSHOT-features.xml
[JENKINS] Archiving <https://builds.apache.org/job/Tamaya-Extensions-Master/ws/modules/spring/pom.xml>
to org.apache.tamaya.ext/tamaya-spring/0.3-incubating-SNAPSHOT/tamaya-spring-0.3-incubating-SNAPSHOT.pom
[JENKINS] Archiving <https://builds.apache.org/job/Tamaya-Extensions-Master/ws/modules/events/pom.xml>
to org.apache.tamaya.ext/tamaya-events/0.3-incubating-SNAPSHOT/tamaya-events-0.3-incubating-SNAPSHOT.pom
[JENKINS] Archiving <https://builds.apache.org/job/Tamaya-Extensions-Master/ws/modules/formats/base/pom.xml>
to org.apache.tamaya.ext/tamaya-formats/0.3-incubating-SNAPSHOT/tamaya-formats-0.3-incubating-SNAPSHOT.pom
[JENKINS] Archiving <https://builds.apache.org/job/Tamaya-Extensions-Master/ws/modules/injection/cdi-ee/pom.xml>
to org.apache.tamaya.ext/tamaya-cdi/0.3-incubating-SNAPSHOT/tamaya-cdi-0.3-incubating-SNAPSHOT.pom
[JENKINS] Archiving <https://builds.apache.org/job/Tamaya-Extensions-Master/ws/modules/formats/yaml/pom.xml>
to org.apache.tamaya.ext/tamaya-yaml/0.3-incubating-SNAPSHOT/tamaya-yaml-0.3-incubating-SNAPSHOT.pom
[JENKINS] Archiving <https://builds.apache.org/job/Tamaya-Extensions-Master/ws/modules/injection/injection-api/pom.xml>
to org.apache.tamaya.ext/tamaya-injection-api/0.3-incubating-SNAPSHOT/tamaya-injection-api-0.3-incubating-SNAPSHOT.pom
[JENKINS] Archiving <https://builds.apache.org/job/Tamaya-Extensions-Master/ws/modules/mutable-config/pom.xml>
to org.apache.tamaya.ext/tamaya-mutable-config/0.3-incubating-SNAPSHOT/tamaya-mutable-config-0.3-incubating-SNAPSHOT.pom
[JENKINS] Archiving <https://builds.apache.org/job/Tamaya-Extensions-Master/ws/modules/spi-support/pom.xml>
to org.apache.tamaya.ext/tamaya-spisupport/0.3-incubating-SNAPSHOT/tamaya-spisupport-0.3-incubating-SNAPSHOT.pom
[JENKINS] Archiving <https://builds.apache.org/job/Tamaya-Extensions-Master/ws/modules/spi-support/target/feature/feature.xml>
to org.apache.tamaya.ext/tamaya-spisupport/0.3-incubating-SNAPSHOT/tamaya-spisupport-0.3-incubating-SNAPSHOT-features.xml
[JENKINS] Archiving <https://builds.apache.org/job/Tamaya-Extensions-Master/ws/modules/formats/pom.xml>
to org.apache.tamaya.ext/tamaya-formats-all/0.3-incubating-SNAPSHOT/tamaya-formats-all-0.3-incubating-SNAPSHOT.pom
[JENKINS] Archiving <https://builds.apache.org/job/Tamaya-Extensions-Master/ws/modules/injection/cdi-se/pom.xml>
to org.apache.tamaya.ext/tamaya-cdi-se/0.3-incubating-SNAPSHOT/tamaya-cdi-se-0.3-incubating-SNAPSHOT.pom
[JENKINS] Archiving <https://builds.apache.org/job/Tamaya-Extensions-Master/ws/pom.xml>
to org.apache.tamaya.ext/tamaya-extensions-all/0.3-incubating-SNAPSHOT/tamaya-extensions-all-0.3-incubating-SNAPSHOT.pom
[JENKINS] Archiving <https://builds.apache.org/job/Tamaya-Extensions-Master/ws/target/feature/feature.xml>
to org.apache.tamaya.ext/tamaya-extensions-all/0.3-incubating-SNAPSHOT/tamaya-extensions-all-0.3-incubating-SNAPSHOT-features.xml
Compressed 38.99 KB of artifacts by 82.1% relative to #153
[JENKINS] Archiving <https://builds.apache.org/job/Tamaya-Extensions-Master/ws/modules/resources/pom.xml>
to org.apache.tamaya.ext/tamaya-resources/0.3-incubating-SNAPSHOT/tamaya-resources-0.3-incubating-SNAPSHOT.pom
[JENKINS] Archiving <https://builds.apache.org/job/Tamaya-Extensions-Master/ws/modules/formats/json/pom.xml>
to org.apache.tamaya.ext/tamaya-json/0.3-incubating-SNAPSHOT/tamaya-json-0.3-incubating-SNAPSHOT.pom
[JENKINS] Archiving <https://builds.apache.org/job/Tamaya-Extensions-Master/ws/modules/injection/pom.xml>
to org.apache.tamaya.ext/tamaya-injection-all/0.3-incubating-SNAPSHOT/tamaya-injection-all-0.3-incubating-SNAPSHOT.pom
[JENKINS] Archiving <https://builds.apache.org/job/Tamaya-Extensions-Master/ws/modules/functions/pom.xml>
to org.apache.tamaya.ext/tamaya-functions/0.3-incubating-SNAPSHOT/tamaya-functions-0.3-incubating-SNAPSHOT.pom
[JENKINS] Archiving <https://builds.apache.org/job/Tamaya-Extensions-Master/ws/modules/optional/pom.xml>
to org.apache.tamaya.ext/tamaya-optional/0.3-incubating-SNAPSHOT/tamaya-optional-0.3-incubating-SNAPSHOT.pom
[JENKINS] Archiving <https://builds.apache.org/job/Tamaya-Extensions-Master/ws/distribution/pom.xml>
to org.apache.tamaya.ext/tamaya-extension-distribution/0.3-incubating-SNAPSHOT/tamaya-extension-distribution-0.3-incubating-SNAPSHOT.pom
[JENKINS] Archiving <https://builds.apache.org/job/Tamaya-Extensions-Master/ws/modules/resolver/pom.xml>
to org.apache.tamaya.ext/tamaya-resolver/0.3-incubating-SNAPSHOT/tamaya-resolver-0.3-incubating-SNAPSHOT.pom
[JENKINS] Archiving <https://builds.apache.org/job/Tamaya-Extensions-Master/ws/modules/injection/standalone/pom.xml>
to org.apache.tamaya.ext/tamaya-injection/0.3-incubating-SNAPSHOT/tamaya-injection-0.3-incubating-SNAPSHOT.pom
channel stopped


Mime
View raw message