tamaya-commits mailing list archives

Site index · List index
Message view « Date » · « Thread »
Top « Date » · « Thread »
From Apache Jenkins Server <jenk...@builds.apache.org>
Subject Build failed in Jenkins: Tamaya-Sandbox-Master #133
Date Sat, 19 Nov 2016 00:24:26 GMT
See <https://builds.apache.org/job/Tamaya-Sandbox-Master/133/>

------------------------------------------
[...truncated 154 lines...]
[INFO] 
[INFO] --- karaf-maven-plugin:4.0.5:features-generate-descriptor (generate) @ tamaya-sandbox
---
[INFO] Generating feature descriptor file <https://builds.apache.org/job/Tamaya-Sandbox-Master/ws/target/feature/feature.xml>
[INFO] ...done!
[INFO] 
[INFO] --- maven-site-plugin:3.4:attach-descriptor (attach-descriptor) @ tamaya-sandbox ---
[INFO] 
[INFO] --- maven-javadoc-plugin:2.10.4:jar (attach-javadocs) @ tamaya-sandbox ---
[INFO] Not executing Javadoc as the project is not a Java classpath-capable package
[INFO] 
[INFO] >>> maven-source-plugin:3.0.1:jar (source-jar) > generate-sources @ tamaya-sandbox
>>>
[INFO] 
[INFO] --- maven-enforcer-plugin:1.4.1:enforce (enforce-versions) @ tamaya-sandbox ---
[INFO] 
[INFO] --- apache-rat-plugin:0.12:check (default) @ tamaya-sandbox ---
[INFO] Enabled default license matchers.
[INFO] Will parse SCM ignores for exclusions...
[INFO] Parsing exclusions from <https://builds.apache.org/job/Tamaya-Sandbox-Master/ws/.gitignore>
[INFO] Finished adding exclusions from SCM ignore files.
[INFO] 86 implicit excludes (use -debug for more details).
[INFO] Exclude: **/*banner.txt
[INFO] Exclude: banner.txt
[INFO] Exclude: .git
[INFO] Exclude: derby.log
[INFO] Exclude: **/bootstrap-*
[INFO] Exclude: **/js/jquery-*
[INFO] Exclude: **/*.json
[INFO] Exclude: **/*.md
[INFO] Exclude: **/*.md.vm
[INFO] Exclude: src/site/asciidoc/temp-properties-files-for-site/attributes.adoc
[INFO] Exclude: readme/**
[INFO] 1 resources included (use -debug for more details)
[INFO] Rat check: Summary over all files. Unapproved: 0, unknown: 0, generated: 0, approved:
1 licenses.
[WARNING] Failed to getClass for org.apache.maven.plugins.source.SourceJarMojo
[INFO] 
[INFO] <<< maven-source-plugin:3.0.1:jar (source-jar) < generate-sources @ tamaya-sandbox
<<<
[INFO] 
[INFO] --- maven-source-plugin:3.0.1:jar (source-jar) @ tamaya-sandbox ---
[INFO] 
[INFO] --- maven-failsafe-plugin:2.19.1:integration-test (default) @ tamaya-sandbox ---
[INFO] No tests to run.
[INFO] Skipping execution of surefire because it has already been run for this configuration
[JENKINS] Recording test results[INFO] 
[INFO] --- maven-failsafe-plugin:2.19.1:verify (default) @ tamaya-sandbox ---

[JENKINS] Recording test results[INFO] 
[INFO] --- maven-install-plugin:2.5.2:install (default-install) @ tamaya-sandbox ---
[INFO] Installing <https://builds.apache.org/job/Tamaya-Sandbox-Master/ws/pom.xml> to
/home/jenkins/jenkins-slave/maven-repositories/1/org/apache/tamaya/ext/tamaya-sandbox/0.3-incubating-SNAPSHOT/tamaya-sandbox-0.3-incubating-SNAPSHOT.pom
[INFO] Installing <https://builds.apache.org/job/Tamaya-Sandbox-Master/ws/target/feature/feature.xml>
to /home/jenkins/jenkins-slave/maven-repositories/1/org/apache/tamaya/ext/tamaya-sandbox/0.3-incubating-SNAPSHOT/tamaya-sandbox-0.3-incubating-SNAPSHOT-features.xml

[INFO] Installing <https://builds.apache.org/job/Tamaya-Sandbox-Master/ws/target/feature/feature.xml>
to /home/jenkins/jenkins-slave/maven-repositories/1/org/apache/tamaya/ext/tamaya-sandbox/0.3-incubating-SNAPSHOT/tamaya-sandbox-0.3-incubating-SNAPSHOT-features.xml
[INFO] 
[INFO] --- maven-deploy-plugin:2.8.2:deploy (default-deploy) @ tamaya-sandbox ---
[INFO] Downloading: https://repository.apache.org/content/repositories/snapshots/org/apache/tamaya/ext/tamaya-sandbox/0.3-incubating-SNAPSHOT/maven-metadata.xml
[INFO] Downloaded: https://repository.apache.org/content/repositories/snapshots/org/apache/tamaya/ext/tamaya-sandbox/0.3-incubating-SNAPSHOT/maven-metadata.xml
(857 B at 0.8 KB/sec)
[INFO] Uploading: https://repository.apache.org/content/repositories/snapshots/org/apache/tamaya/ext/tamaya-sandbox/0.3-incubating-SNAPSHOT/tamaya-sandbox-0.3-incubating-20161119.002350-40.pom
[INFO] Uploaded: https://repository.apache.org/content/repositories/snapshots/org/apache/tamaya/ext/tamaya-sandbox/0.3-incubating-SNAPSHOT/tamaya-sandbox-0.3-incubating-20161119.002350-40.pom
(5 KB at 5.1 KB/sec)
[INFO] Downloading: https://repository.apache.org/content/repositories/snapshots/org/apache/tamaya/ext/tamaya-sandbox/maven-metadata.xml
[INFO] Downloaded: https://repository.apache.org/content/repositories/snapshots/org/apache/tamaya/ext/tamaya-sandbox/maven-metadata.xml
(304 B at 0.5 KB/sec)
[INFO] Uploading: https://repository.apache.org/content/repositories/snapshots/org/apache/tamaya/ext/tamaya-sandbox/0.3-incubating-SNAPSHOT/maven-metadata.xml
[INFO] Uploaded: https://repository.apache.org/content/repositories/snapshots/org/apache/tamaya/ext/tamaya-sandbox/0.3-incubating-SNAPSHOT/maven-metadata.xml
(857 B at 1.0 KB/sec)
[INFO] Uploading: https://repository.apache.org/content/repositories/snapshots/org/apache/tamaya/ext/tamaya-sandbox/maven-metadata.xml
[INFO] Uploaded: https://repository.apache.org/content/repositories/snapshots/org/apache/tamaya/ext/tamaya-sandbox/maven-metadata.xml
(304 B at 0.4 KB/sec)
[INFO] Uploading: https://repository.apache.org/content/repositories/snapshots/org/apache/tamaya/ext/tamaya-sandbox/0.3-incubating-SNAPSHOT/tamaya-sandbox-0.3-incubating-20161119.002350-40-features.xml
[INFO] Uploaded: https://repository.apache.org/content/repositories/snapshots/org/apache/tamaya/ext/tamaya-sandbox/0.3-incubating-SNAPSHOT/tamaya-sandbox-0.3-incubating-20161119.002350-40-features.xml
(587 B at 0.7 KB/sec)
[INFO] Uploading: https://repository.apache.org/content/repositories/snapshots/org/apache/tamaya/ext/tamaya-sandbox/0.3-incubating-SNAPSHOT/maven-metadata.xml
[INFO] Uploaded: https://repository.apache.org/content/repositories/snapshots/org/apache/tamaya/ext/tamaya-sandbox/0.3-incubating-SNAPSHOT/maven-metadata.xml
(857 B at 1.0 KB/sec)
[INFO] Uploading: https://repository.apache.org/content/repositories/snapshots/org/apache/tamaya/ext/tamaya-sandbox/0.3-incubating-SNAPSHOT/tamaya-sandbox-0.3-incubating-20161119.002350-40-features.xml
[INFO] Uploaded: https://repository.apache.org/content/repositories/snapshots/org/apache/tamaya/ext/tamaya-sandbox/0.3-incubating-SNAPSHOT/tamaya-sandbox-0.3-incubating-20161119.002350-40-features.xml
(587 B at 0.7 KB/sec)
[INFO] Uploading: https://repository.apache.org/content/repositories/snapshots/org/apache/tamaya/ext/tamaya-sandbox/0.3-incubating-SNAPSHOT/maven-metadata.xml
[INFO] Uploaded: https://repository.apache.org/content/repositories/snapshots/org/apache/tamaya/ext/tamaya-sandbox/0.3-incubating-SNAPSHOT/maven-metadata.xml
(857 B at 1.0 KB/sec)
[INFO]                                                                         
[INFO] ------------------------------------------------------------------------
[INFO] Building Apache Tamaya Modules - Hazelcast PropertySource 0.3-incubating-SNAPSHOT
[INFO] ------------------------------------------------------------------------
[INFO] Downloading: http://repository.apache.org/snapshots/org/apache/tamaya/ext/tamaya-functions/0.3-incubating-SNAPSHOT/maven-metadata.xml
[INFO] Downloaded: http://repository.apache.org/snapshots/org/apache/tamaya/ext/tamaya-functions/0.3-incubating-SNAPSHOT/maven-metadata.xml
(2 KB at 3.6 KB/sec)
[INFO] Downloading: http://repository.apache.org/snapshots/org/apache/tamaya/ext/tamaya-extensions/0.3-incubating-SNAPSHOT/maven-metadata.xml
[INFO] Downloaded: http://repository.apache.org/snapshots/org/apache/tamaya/ext/tamaya-extensions/0.3-incubating-SNAPSHOT/maven-metadata.xml
(863 B at 1.9 KB/sec)
[INFO] Downloading: http://repository.apache.org/snapshots/org/apache/tamaya/ext/tamaya-extensions-all/0.3-incubating-SNAPSHOT/maven-metadata.xml
[INFO] Downloaded: http://repository.apache.org/snapshots/org/apache/tamaya/ext/tamaya-extensions-all/0.3-incubating-SNAPSHOT/maven-metadata.xml
(864 B at 2.1 KB/sec)
[INFO] Downloading: http://repository.apache.org/snapshots/org/apache/tamaya/ext/tamaya-spisupport/0.3-incubating-SNAPSHOT/maven-metadata.xml
[INFO] Downloaded: http://repository.apache.org/snapshots/org/apache/tamaya/ext/tamaya-spisupport/0.3-incubating-SNAPSHOT/maven-metadata.xml
(2 KB at 3.6 KB/sec)
[INFO] Downloading: http://repository.apache.org/snapshots/org/apache/tamaya/ext/tamaya-mutable-config/0.3-incubating-SNAPSHOT/maven-metadata.xml
[INFO] Downloaded: http://repository.apache.org/snapshots/org/apache/tamaya/ext/tamaya-mutable-config/0.3-incubating-SNAPSHOT/maven-metadata.xml
(2 KB at 3.7 KB/sec)
[INFO] 
[INFO] --- maven-clean-plugin:3.0.0:clean (default-clean) @ tamaya-hazelcast ---
[INFO] Deleting <https://builds.apache.org/job/Tamaya-Sandbox-Master/ws/hazelcast/target>
[INFO] 
[INFO] --- maven-enforcer-plugin:1.4.1:enforce (enforce-versions) @ tamaya-hazelcast ---
[INFO] 
[INFO] --- apache-rat-plugin:0.12:check (default) @ tamaya-hazelcast ---
[INFO] Enabled default license matchers.
[INFO] Will parse SCM ignores for exclusions...
[INFO] Finished adding exclusions from SCM ignore files.
[INFO] 61 implicit excludes (use -debug for more details).
[INFO] Exclude: **/*banner.txt
[INFO] Exclude: banner.txt
[INFO] Exclude: .git
[INFO] Exclude: derby.log
[INFO] Exclude: **/bootstrap-*
[INFO] Exclude: **/js/jquery-*
[INFO] Exclude: **/*.json
[INFO] Exclude: **/*.md
[INFO] Exclude: **/*.md.vm
[INFO] Exclude: src/site/asciidoc/temp-properties-files-for-site/attributes.adoc
[INFO] Exclude: readme/**
[INFO] 3 resources included (use -debug for more details)
[INFO] Rat check: Summary over all files. Unapproved: 0, unknown: 0, generated: 0, approved:
3 licenses.
[INFO] 
[INFO] --- maven-bundle-plugin:3.2.0:cleanVersions (cleanVersions) @ tamaya-hazelcast ---
[INFO] 
[INFO] --- maven-remote-resources-plugin:1.5:process (process-resource-bundles) @ tamaya-hazelcast
---
[INFO] 
[INFO] --- karaf-maven-plugin:4.0.5:features-generate-descriptor (generate) @ tamaya-hazelcast
---
[INFO] Downloading: http://repository.apache.org/snapshots/org/apache/tamaya/ext/tamaya-hazelcast/0.3-incubating-SNAPSHOT/maven-metadata.xml
[INFO] Generating feature descriptor file <https://builds.apache.org/job/Tamaya-Sandbox-Master/ws/hazelcast/target/feature/feature.xml>
[INFO] ...done!
[INFO] 
[INFO] --- maven-resources-plugin:2.7:resources (default-resources) @ tamaya-hazelcast ---
[INFO] Using 'UTF-8' encoding to copy filtered resources.
[INFO] skip non existing resourceDirectory <https://builds.apache.org/job/Tamaya-Sandbox-Master/ws/hazelcast/src/main/resources>
[INFO] Copying 3 resources
[INFO] 
[INFO] --- maven-compiler-plugin:3.5.1:compile (default-compile) @ tamaya-hazelcast ---
[INFO] Changes detected - recompiling the module!
[INFO] Compiling 1 source file to <https://builds.apache.org/job/Tamaya-Sandbox-Master/ws/hazelcast/target/classes>
[INFO] -------------------------------------------------------------
[ERROR] COMPILATION ERROR : 
[INFO] -------------------------------------------------------------
[ERROR] <https://builds.apache.org/job/Tamaya-Sandbox-Master/ws/hazelcast/src/main/java/org/apache/tamaya/hazelcast/HazelcastPropertySource.java>:[26,39]
cannot find symbol
  symbol:   class ConfigChangeRequest
  location: package org.apache.tamaya.mutableconfig
[ERROR] <https://builds.apache.org/job/Tamaya-Sandbox-Master/ws/hazelcast/src/main/java/org/apache/tamaya/hazelcast/HazelcastPropertySource.java>:[27,39]
cannot find symbol
  symbol:   class Refreshable
  location: package org.apache.tamaya.mutableconfig
[ERROR] <https://builds.apache.org/job/Tamaya-Sandbox-Master/ws/hazelcast/src/main/java/org/apache/tamaya/hazelcast/HazelcastPropertySource.java>:[59,12]
cannot find symbol
  symbol: class Refreshable
[ERROR] <https://builds.apache.org/job/Tamaya-Sandbox-Master/ws/hazelcast/src/main/java/org/apache/tamaya/hazelcast/HazelcastPropertySource.java>:[139,29]
cannot find symbol
  symbol:   class ConfigChangeRequest
  location: class org.apache.tamaya.hazelcast.HazelcastPropertySource
[ERROR] <https://builds.apache.org/job/Tamaya-Sandbox-Master/ws/hazelcast/src/main/java/org/apache/tamaya/hazelcast/HazelcastPropertySource.java>:[68,9]
no suitable constructor found for BasePropertySource(java.lang.String)
    constructor org.apache.tamaya.spisupport.BasePropertySource.BasePropertySource() is not
applicable
      (actual and formal argument lists differ in length)
    constructor org.apache.tamaya.spisupport.BasePropertySource.BasePropertySource(int) is
not applicable
      (actual argument java.lang.String cannot be converted to int by method invocation conversion)
[ERROR] <https://builds.apache.org/job/Tamaya-Sandbox-Master/ws/hazelcast/src/main/java/org/apache/tamaya/hazelcast/HazelcastPropertySource.java>:[77,9]
no suitable constructor found for BasePropertySource(java.lang.String)
    constructor org.apache.tamaya.spisupport.BasePropertySource.BasePropertySource() is not
applicable
      (actual and formal argument lists differ in length)
    constructor org.apache.tamaya.spisupport.BasePropertySource.BasePropertySource(int) is
not applicable
      (actual argument java.lang.String cannot be converted to int by method invocation conversion)
[ERROR] <https://builds.apache.org/job/Tamaya-Sandbox-Master/ws/hazelcast/src/main/java/org/apache/tamaya/hazelcast/HazelcastPropertySource.java>:[82,9]
no suitable constructor found for BasePropertySource(java.lang.String)
    constructor org.apache.tamaya.spisupport.BasePropertySource.BasePropertySource() is not
applicable
      (actual and formal argument lists differ in length)
    constructor org.apache.tamaya.spisupport.BasePropertySource.BasePropertySource(int) is
not applicable
      (actual argument java.lang.String cannot be converted to int by method invocation conversion)
[ERROR] <https://builds.apache.org/job/Tamaya-Sandbox-Master/ws/hazelcast/src/main/java/org/apache/tamaya/hazelcast/HazelcastPropertySource.java>:[87,9]
no suitable constructor found for BasePropertySource(java.lang.String)
    constructor org.apache.tamaya.spisupport.BasePropertySource.BasePropertySource() is not
applicable
      (actual and formal argument lists differ in length)
    constructor org.apache.tamaya.spisupport.BasePropertySource.BasePropertySource(int) is
not applicable
      (actual argument java.lang.String cannot be converted to int by method invocation conversion)
[ERROR] <https://builds.apache.org/job/Tamaya-Sandbox-Master/ws/hazelcast/src/main/java/org/apache/tamaya/hazelcast/HazelcastPropertySource.java>:[131,5]
method does not override or implement a method from a supertype
[INFO] 9 errors 
[INFO] -------------------------------------------------------------
[INFO] ------------------------------------------------------------------------
[INFO] Reactor Summary:
[INFO] 
[INFO] Apache Tamaya Extensions - Sandbox ................. SUCCESS [ 25.938 s]
[INFO] Apache Tamaya Modules - Hazelcast PropertySource ... FAILURE [  6.001 s]
[INFO] Apache Tamaya Modules - Apache Commons ............. SKIPPED
[INFO] Apache Tamaya Modules - Joda-Time Support .......... SKIPPED
[INFO] Apache Tamaya Modules - Usage tracker .............. SKIPPED
[INFO] Apache Tamaya Modules - Validation ................. SKIPPED
[INFO] Apache Tamaya Modules - Remote PropertySource ...... SKIPPED
[INFO] Apache Tamaya Modules - Configured System Properties SKIPPED
[INFO] Apache Tamaya Modules - etcd PropertySource ........ SKIPPED
[INFO] Apache Tamaya Modules - Consul ..................... SKIPPED
[INFO] Apache Tamaya Modules - Apache Camel Support ....... SKIPPED
[INFO] Apache Tamaya Modules - PropertySources ............ SKIPPED
[INFO] Apache Tamaya Modules - JMX Support ................ SKIPPED
[INFO] ------------------------------------------------------------------------
[INFO] BUILD FAILURE
[INFO] ------------------------------------------------------------------------
[INFO] Total time: 40.023 s
[INFO] Finished at: 2016-11-19T00:24:07+00:00
[INFO] Final Memory: 62M/702M
[INFO] ------------------------------------------------------------------------
Waiting for Jenkins to finish collecting data
[ERROR] Failed to execute goal org.apache.maven.plugins:maven-compiler-plugin:3.5.1:compile
(default-compile) on project tamaya-hazelcast: Compilation failure: Compilation failure:
[ERROR] <https://builds.apache.org/job/Tamaya-Sandbox-Master/ws/hazelcast/src/main/java/org/apache/tamaya/hazelcast/HazelcastPropertySource.java>:[26,39]
cannot find symbol
[ERROR] symbol:   class ConfigChangeRequest
[ERROR] location: package org.apache.tamaya.mutableconfig
[ERROR] <https://builds.apache.org/job/Tamaya-Sandbox-Master/ws/hazelcast/src/main/java/org/apache/tamaya/hazelcast/HazelcastPropertySource.java>:[27,39]
cannot find symbol
[ERROR] symbol:   class Refreshable
[ERROR] location: package org.apache.tamaya.mutableconfig
[ERROR] <https://builds.apache.org/job/Tamaya-Sandbox-Master/ws/hazelcast/src/main/java/org/apache/tamaya/hazelcast/HazelcastPropertySource.java>:[59,12]
cannot find symbol
[ERROR] symbol: class Refreshable
[ERROR] <https://builds.apache.org/job/Tamaya-Sandbox-Master/ws/hazelcast/src/main/java/org/apache/tamaya/hazelcast/HazelcastPropertySource.java>:[139,29]
cannot find symbol
[ERROR] symbol:   class ConfigChangeRequest
[ERROR] location: class org.apache.tamaya.hazelcast.HazelcastPropertySource
[ERROR] <https://builds.apache.org/job/Tamaya-Sandbox-Master/ws/hazelcast/src/main/java/org/apache/tamaya/hazelcast/HazelcastPropertySource.java>:[68,9]
no suitable constructor found for BasePropertySource(java.lang.String)
[ERROR] constructor org.apache.tamaya.spisupport.BasePropertySource.BasePropertySource() is
not applicable
[ERROR] (actual and formal argument lists differ in length)
[ERROR] constructor org.apache.tamaya.spisupport.BasePropertySource.BasePropertySource(int)
is not applicable
[ERROR] (actual argument java.lang.String cannot be converted to int by method invocation
conversion)
[ERROR] <https://builds.apache.org/job/Tamaya-Sandbox-Master/ws/hazelcast/src/main/java/org/apache/tamaya/hazelcast/HazelcastPropertySource.java>:[77,9]
no suitable constructor found for BasePropertySource(java.lang.String)
[ERROR] constructor org.apache.tamaya.spisupport.BasePropertySource.BasePropertySource() is
not applicable
[ERROR] (actual and formal argument lists differ in length)
[ERROR] constructor org.apache.tamaya.spisupport.BasePropertySource.BasePropertySource(int)
is not applicable
[ERROR] (actual argument java.lang.String cannot be converted to int by method invocation
conversion)
[ERROR] <https://builds.apache.org/job/Tamaya-Sandbox-Master/ws/hazelcast/src/main/java/org/apache/tamaya/hazelcast/HazelcastPropertySource.java>:[82,9]
no suitable constructor found for BasePropertySource(java.lang.String)
[ERROR] constructor org.apache.tamaya.spisupport.BasePropertySource.BasePropertySource() is
not applicable
[ERROR] (actual and formal argument lists differ in length)
[ERROR] constructor org.apache.tamaya.spisupport.BasePropertySource.BasePropertySource(int)
is not applicable
[ERROR] (actual argument java.lang.String cannot be converted to int by method invocation
conversion)
[ERROR] <https://builds.apache.org/job/Tamaya-Sandbox-Master/ws/hazelcast/src/main/java/org/apache/tamaya/hazelcast/HazelcastPropertySource.java>:[87,9]
no suitable constructor found for BasePropertySource(java.lang.String)
[ERROR] constructor org.apache.tamaya.spisupport.BasePropertySource.BasePropertySource() is
not applicable
[ERROR] (actual and formal argument lists differ in length)
[ERROR] constructor org.apache.tamaya.spisupport.BasePropertySource.BasePropertySource(int)
is not applicable
[ERROR] (actual argument java.lang.String cannot be converted to int by method invocation
conversion)
[ERROR] <https://builds.apache.org/job/Tamaya-Sandbox-Master/ws/hazelcast/src/main/java/org/apache/tamaya/hazelcast/HazelcastPropertySource.java>:[131,5]
method does not override or implement a method from a supertype
[ERROR] -> [Help 1]
[ERROR] 
[ERROR] To see the full stack trace of the errors, re-run Maven with the -e switch.
[ERROR] Re-run Maven using the -X switch to enable full debug logging.
[ERROR] 
[ERROR] For more information about the errors and possible solutions, please read the following
articles:
[ERROR] [Help 1] http://cwiki.apache.org/confluence/display/MAVEN/MojoFailureException
[ERROR] 
[ERROR] After correcting the problems, you can resume the build with the command
[ERROR]   mvn <goals> -rf :tamaya-hazelcast
[JENKINS] Archiving <https://builds.apache.org/job/Tamaya-Sandbox-Master/ws/jodatime/pom.xml>
to org.apache.tamaya.ext/tamaya-jodatime/0.3-incubating-SNAPSHOT/tamaya-jodatime-0.3-incubating-SNAPSHOT.pom
[JENKINS] Archiving <https://builds.apache.org/job/Tamaya-Sandbox-Master/ws/configured-sysprops/pom.xml>
to org.apache.tamaya.ext/tamaya-sysprops/0.3-incubating-SNAPSHOT/tamaya-sysprops-0.3-incubating-SNAPSHOT.pom
[JENKINS] Archiving <https://builds.apache.org/job/Tamaya-Sandbox-Master/ws/management/pom.xml>
to org.apache.tamaya.ext/tamaya-management/0.3-incubating-SNAPSHOT/tamaya-management-0.3-incubating-SNAPSHOT.pom
[JENKINS] Archiving <https://builds.apache.org/job/Tamaya-Sandbox-Master/ws/validation/pom.xml>
to org.apache.tamaya.ext/tamaya-validation/0.3-incubating-SNAPSHOT/tamaya-validation-0.3-incubating-SNAPSHOT.pom
[JENKINS] Archiving <https://builds.apache.org/job/Tamaya-Sandbox-Master/ws/pom.xml>
to org.apache.tamaya.ext/tamaya-sandbox/0.3-incubating-SNAPSHOT/tamaya-sandbox-0.3-incubating-SNAPSHOT.pom
[JENKINS] Archiving <https://builds.apache.org/job/Tamaya-Sandbox-Master/ws/target/feature/feature.xml>
to org.apache.tamaya.ext/tamaya-sandbox/0.3-incubating-20161119.002350-40/tamaya-sandbox-0.3-incubating-20161119.002350-40-features.xml
[JENKINS] Archiving <https://builds.apache.org/job/Tamaya-Sandbox-Master/ws/etcd/pom.xml>
to org.apache.tamaya.ext/tamaya-etcd/0.3-incubating-SNAPSHOT/tamaya-etcd-0.3-incubating-SNAPSHOT.pom
[JENKINS] Archiving <https://builds.apache.org/job/Tamaya-Sandbox-Master/ws/camel/pom.xml>
to org.apache.tamaya.ext/tamaya-camel/0.3-incubating-SNAPSHOT/tamaya-camel-0.3-incubating-SNAPSHOT.pom
[JENKINS] Archiving <https://builds.apache.org/job/Tamaya-Sandbox-Master/ws/propertysources/pom.xml>
to org.apache.tamaya.ext/tamaya-propertysources/0.3-incubating-SNAPSHOT/tamaya-propertysources-0.3-incubating-SNAPSHOT.pom
[JENKINS] Archiving <https://builds.apache.org/job/Tamaya-Sandbox-Master/ws/hazelcast/pom.xml>
to org.apache.tamaya.ext/tamaya-hazelcast/0.3-incubating-SNAPSHOT/tamaya-hazelcast-0.3-incubating-SNAPSHOT.pom
[JENKINS] Archiving <https://builds.apache.org/job/Tamaya-Sandbox-Master/ws/hazelcast/target/feature/feature.xml>
to org.apache.tamaya.ext/tamaya-hazelcast/0.3-incubating-SNAPSHOT/tamaya-hazelcast-0.3-incubating-SNAPSHOT-features.xml
No prior successful build to compare, so performing full copy of artifacts
[JENKINS] Archiving <https://builds.apache.org/job/Tamaya-Sandbox-Master/ws/remote/pom.xml>
to org.apache.tamaya.ext/tamaya-remote/0.3-incubating-SNAPSHOT/tamaya-remote-0.3-incubating-SNAPSHOT.pom
[JENKINS] Archiving <https://builds.apache.org/job/Tamaya-Sandbox-Master/ws/consul/pom.xml>
to org.apache.tamaya.ext/tamaya-consul/0.3-incubating-SNAPSHOT/tamaya-consul-0.3-incubating-SNAPSHOT.pom
[JENKINS] Archiving <https://builds.apache.org/job/Tamaya-Sandbox-Master/ws/apache-commons/pom.xml>
to org.apache.tamaya.ext/tamaya-commons-config/0.3-incubating-SNAPSHOT/tamaya-commons-config-0.3-incubating-SNAPSHOT.pom
[JENKINS] Archiving <https://builds.apache.org/job/Tamaya-Sandbox-Master/ws/usagetracker/pom.xml>
to org.apache.tamaya.ext/tamaya-usagetracker/0.3-incubating-SNAPSHOT/tamaya-usagetracker-0.3-incubating-SNAPSHOT.pom
Sending e-mails to: commits@tamaya.incubator.apache.org
channel stopped

Mime
View raw message