tamaya-commits mailing list archives

Site index · List index
Message view « Date » · « Thread »
Top « Date » · « Thread »
From Apache Jenkins Server <jenk...@builds.apache.org>
Subject Build failed in Jenkins: tamaya-master-branch-ci #1
Date Wed, 05 Oct 2016 22:37:32 GMT
See <https://builds.apache.org/job/tamaya-master-branch-ci/1/>

------------------------------------------
[...truncated 1632 lines...]
[INFO] --- maven-bundle-plugin:3.2.0:cleanVersions (cleanVersions) @ tamaya-core ---
[WARNING] Failed to getClass for org.apache.maven.plugins.source.SourceJarMojo
[INFO] 
[INFO] <<< maven-source-plugin:3.0.1:jar (source-jar) < generate-sources @ tamaya-core
<<<
[INFO] 
[INFO] --- maven-source-plugin:3.0.1:jar (source-jar) @ tamaya-core ---
[INFO] Building jar: <https://builds.apache.org/job/tamaya-master-branch-ci/ws/code/core/target/tamaya-core-0.3-incubating-SNAPSHOT-sources.jar>
[INFO] 
[INFO] --- maven-failsafe-plugin:2.19.1:integration-test (default) @ tamaya-core ---
[JENKINS] Recording test results
[INFO] 
[INFO] --- maven-failsafe-plugin:2.19.1:verify (default) @ tamaya-core ---
[JENKINS] Recording test results
[INFO] 
[INFO] --- maven-install-plugin:2.5.2:install (default-install) @ tamaya-core ---
[INFO] Installing <https://builds.apache.org/job/tamaya-master-branch-ci/ws/code/core/target/tamaya-core-0.3-incubating-SNAPSHOT.jar>
to /home/jenkins/jenkins-slave/maven-repositories/0/org/apache/tamaya/tamaya-core/0.3-incubating-SNAPSHOT/tamaya-core-0.3-incubating-SNAPSHOT.jar
[INFO] Installing <https://builds.apache.org/job/tamaya-master-branch-ci/ws/code/core/pom.xml>
to /home/jenkins/jenkins-slave/maven-repositories/0/org/apache/tamaya/tamaya-core/0.3-incubating-SNAPSHOT/tamaya-core-0.3-incubating-SNAPSHOT.pom
[INFO] Installing <https://builds.apache.org/job/tamaya-master-branch-ci/ws/code/core/target/feature/feature.xml>
to /home/jenkins/jenkins-slave/maven-repositories/0/org/apache/tamaya/tamaya-core/0.3-incubating-SNAPSHOT/tamaya-core-0.3-incubating-SNAPSHOT-features.xml
[INFO] Installing <https://builds.apache.org/job/tamaya-master-branch-ci/ws/code/core/target/tamaya-core-0.3-incubating-SNAPSHOT-javadoc.jar>
to /home/jenkins/jenkins-slave/maven-repositories/0/org/apache/tamaya/tamaya-core/0.3-incubating-SNAPSHOT/tamaya-core-0.3-incubating-SNAPSHOT-javadoc.jar
[INFO] Installing <https://builds.apache.org/job/tamaya-master-branch-ci/ws/code/core/target/tamaya-core-0.3-incubating-SNAPSHOT-sources.jar>
to /home/jenkins/jenkins-slave/maven-repositories/0/org/apache/tamaya/tamaya-core/0.3-incubating-SNAPSHOT/tamaya-core-0.3-incubating-SNAPSHOT-sources.jar
[INFO] 
[INFO] --- maven-bundle-plugin:3.2.0:install (default-install) @ tamaya-core ---
[INFO] Installing org/apache/tamaya/tamaya-core/0.3-incubating-SNAPSHOT/tamaya-core-0.3-incubating-SNAPSHOT.jar
[INFO] Writing OBR metadata
[INFO] 
[INFO] --- maven-enforcer-plugin:1.4.1:enforce (enforce-versions) @ tamaya-core ---
[INFO] 
[INFO] --- apache-rat-plugin:0.12:check (default) @ tamaya-core ---
[INFO] Enabled default license matchers.
[INFO] Will parse SCM ignores for exclusions...
[INFO] Finished adding exclusions from SCM ignore files.
[INFO] 61 implicit excludes (use -debug for more details).
[INFO] Exclude: **/*banner.txt
[INFO] Exclude: banner.txt
[INFO] Exclude: .git
[INFO] Exclude: derby.log
[INFO] Exclude: **/bootstrap-*
[INFO] Exclude: **/js/jquery-*
[INFO] Exclude: **/*.json
[INFO] Exclude: **/*.md
[INFO] Exclude: **/*.md.vm
[INFO] Exclude: src/site/asciidoc/temp-properties-files-for-site/attributes.adoc
[INFO] Exclude: readme/**
[INFO] 91 resources included (use -debug for more details)
[INFO] Rat check: Summary over all files. Unapproved: 0, unknown: 0, generated: 0, approved:
91 licenses.
[INFO] 
[INFO] --- maven-bundle-plugin:3.2.0:cleanVersions (cleanVersions) @ tamaya-core ---
[INFO] 
[INFO] --- maven-remote-resources-plugin:1.5:process (process-resource-bundles) @ tamaya-core
---
[INFO] 
[INFO] --- karaf-maven-plugin:4.0.5:features-generate-descriptor (generate) @ tamaya-core
---
[INFO] Generating feature descriptor file <https://builds.apache.org/job/tamaya-master-branch-ci/ws/code/core/target/feature/feature.xml>
[INFO] ...done!
[INFO] 
[INFO] --- maven-resources-plugin:2.7:resources (default-resources) @ tamaya-core ---
[INFO] Using 'UTF-8' encoding to copy filtered resources.
[INFO] Copying 7 resources
[INFO] Copying 3 resources
[INFO] Copying 3 resources
[INFO] 
[INFO] --- maven-compiler-plugin:3.5.1:compile (default-compile) @ tamaya-core ---
[INFO] Nothing to compile - all classes are up to date
[INFO] 
[INFO] >>> findbugs-maven-plugin:3.0.4:check (findbugs-analyze) > :findbugs @
tamaya-core >>>
[INFO] 
[INFO] --- findbugs-maven-plugin:3.0.4:findbugs (findbugs) @ tamaya-core ---
[INFO] Fork Value is true
[INFO] Done FindBugs Analysis....
[INFO] 
[INFO] <<< findbugs-maven-plugin:3.0.4:check (findbugs-analyze) < :findbugs @
tamaya-core <<<
[INFO] 
[INFO] --- findbugs-maven-plugin:3.0.4:check (findbugs-analyze) @ tamaya-core ---
[INFO] BugInstance size is 0
[INFO] Error size is 0
[INFO] No errors/warnings found
[INFO] 
[INFO] --- maven-resources-plugin:2.7:testResources (default-testResources) @ tamaya-core
---
[INFO] Using 'UTF-8' encoding to copy filtered resources.
[INFO] Copying 14 resources
[INFO] Copying 3 resources
[INFO] Copying 3 resources
[INFO] 
[INFO] --- maven-compiler-plugin:3.5.1:testCompile (default-testCompile) @ tamaya-core ---
[INFO] Nothing to compile - all classes are up to date
[INFO] 
[INFO] --- maven-surefire-plugin:2.19.1:test (default-test) @ tamaya-core ---
[INFO] Skipping execution of surefire because it has already been run for this configuration
[JENKINS] Recording test results
[INFO] 
[INFO] --- maven-bundle-plugin:3.2.0:bundle (default-bundle) @ tamaya-core ---
[INFO] 
[INFO] --- maven-site-plugin:3.4:attach-descriptor (attach-descriptor) @ tamaya-core ---
[INFO] 
[INFO] --- maven-javadoc-plugin:2.10.4:jar (attach-javadocs) @ tamaya-core ---
[INFO] Building jar: <https://builds.apache.org/job/tamaya-master-branch-ci/ws/code/core/target/tamaya-core-0.3-incubating-SNAPSHOT-javadoc.jar>
[INFO] 
[INFO] >>> maven-source-plugin:3.0.1:jar (source-jar) > generate-sources @ tamaya-core
>>>
[INFO] 
[INFO] --- maven-enforcer-plugin:1.4.1:enforce (enforce-versions) @ tamaya-core ---
[INFO] 
[INFO] --- apache-rat-plugin:0.12:check (default) @ tamaya-core ---
[INFO] Enabled default license matchers.
[INFO] Will parse SCM ignores for exclusions...
[INFO] Finished adding exclusions from SCM ignore files.
[INFO] 61 implicit excludes (use -debug for more details).
[INFO] Exclude: **/*banner.txt
[INFO] Exclude: banner.txt
[INFO] Exclude: .git
[INFO] Exclude: derby.log
[INFO] Exclude: **/bootstrap-*
[INFO] Exclude: **/js/jquery-*
[INFO] Exclude: **/*.json
[INFO] Exclude: **/*.md
[INFO] Exclude: **/*.md.vm
[INFO] Exclude: src/site/asciidoc/temp-properties-files-for-site/attributes.adoc
[INFO] Exclude: readme/**
[INFO] 91 resources included (use -debug for more details)
[INFO] Rat check: Summary over all files. Unapproved: 0, unknown: 0, generated: 0, approved:
91 licenses.
[INFO] 
[INFO] --- maven-bundle-plugin:3.2.0:cleanVersions (cleanVersions) @ tamaya-core ---
[WARNING] Failed to getClass for org.apache.maven.plugins.source.SourceJarMojo
[INFO] 
[INFO] <<< maven-source-plugin:3.0.1:jar (source-jar) < generate-sources @ tamaya-core
<<<
[INFO] 
[INFO] --- maven-source-plugin:3.0.1:jar (source-jar) @ tamaya-core ---
[INFO] Building jar: <https://builds.apache.org/job/tamaya-master-branch-ci/ws/code/core/target/tamaya-core-0.3-incubating-SNAPSHOT-sources.jar>
[INFO] 
[INFO] --- maven-failsafe-plugin:2.19.1:integration-test (default) @ tamaya-core ---
[INFO] Skipping execution of surefire because it has already been run for this configuration
[JENKINS] Recording test results
[INFO] 
[INFO] --- maven-failsafe-plugin:2.19.1:verify (default) @ tamaya-core ---
[JENKINS] Recording test results[INFO] 
[INFO] --- maven-install-plugin:2.5.2:install (default-install) @ tamaya-core ---

[INFO] Installing <https://builds.apache.org/job/tamaya-master-branch-ci/ws/code/core/target/tamaya-core-0.3-incubating-SNAPSHOT.jar>
to /home/jenkins/jenkins-slave/maven-repositories/0/org/apache/tamaya/tamaya-core/0.3-incubating-SNAPSHOT/tamaya-core-0.3-incubating-SNAPSHOT.jar
[INFO] Installing <https://builds.apache.org/job/tamaya-master-branch-ci/ws/code/core/pom.xml>
to /home/jenkins/jenkins-slave/maven-repositories/0/org/apache/tamaya/tamaya-core/0.3-incubating-SNAPSHOT/tamaya-core-0.3-incubating-SNAPSHOT.pom
[INFO] Installing <https://builds.apache.org/job/tamaya-master-branch-ci/ws/code/core/target/feature/feature.xml>
to /home/jenkins/jenkins-slave/maven-repositories/0/org/apache/tamaya/tamaya-core/0.3-incubating-SNAPSHOT/tamaya-core-0.3-incubating-SNAPSHOT-features.xml
[INFO] Installing <https://builds.apache.org/job/tamaya-master-branch-ci/ws/code/core/target/tamaya-core-0.3-incubating-SNAPSHOT-javadoc.jar>
to /home/jenkins/jenkins-slave/maven-repositories/0/org/apache/tamaya/tamaya-core/0.3-incubating-SNAPSHOT/tamaya-core-0.3-incubating-SNAPSHOT-javadoc.jar
[INFO] Installing <https://builds.apache.org/job/tamaya-master-branch-ci/ws/code/core/target/tamaya-core-0.3-incubating-SNAPSHOT-sources.jar>
to /home/jenkins/jenkins-slave/maven-repositories/0/org/apache/tamaya/tamaya-core/0.3-incubating-SNAPSHOT/tamaya-core-0.3-incubating-SNAPSHOT-sources.jar
[INFO] Installing <https://builds.apache.org/job/tamaya-master-branch-ci/ws/code/core/target/feature/feature.xml>
to /home/jenkins/jenkins-slave/maven-repositories/0/org/apache/tamaya/tamaya-core/0.3-incubating-SNAPSHOT/tamaya-core-0.3-incubating-SNAPSHOT-features.xml
[INFO] Installing <https://builds.apache.org/job/tamaya-master-branch-ci/ws/code/core/target/tamaya-core-0.3-incubating-SNAPSHOT-javadoc.jar>
to /home/jenkins/jenkins-slave/maven-repositories/0/org/apache/tamaya/tamaya-core/0.3-incubating-SNAPSHOT/tamaya-core-0.3-incubating-SNAPSHOT-javadoc.jar
[INFO] Installing <https://builds.apache.org/job/tamaya-master-branch-ci/ws/code/core/target/tamaya-core-0.3-incubating-SNAPSHOT-sources.jar>
to /home/jenkins/jenkins-slave/maven-repositories/0/org/apache/tamaya/tamaya-core/0.3-incubating-SNAPSHOT/tamaya-core-0.3-incubating-SNAPSHOT-sources.jar
[INFO] 
[INFO] --- maven-bundle-plugin:3.2.0:install (default-install) @ tamaya-core ---
[INFO] Installing org/apache/tamaya/tamaya-core/0.3-incubating-SNAPSHOT/tamaya-core-0.3-incubating-SNAPSHOT.jar
[INFO] Writing OBR metadata
[INFO] 
[INFO] --- maven-deploy-plugin:2.8.2:deploy (default-deploy) @ tamaya-core ---
[INFO] Downloading: https://repository.apache.org/content/repositories/snapshots/org/apache/tamaya/tamaya-core/0.3-incubating-SNAPSHOT/maven-metadata.xml
[INFO] Downloaded: https://repository.apache.org/content/repositories/snapshots/org/apache/tamaya/tamaya-core/0.3-incubating-SNAPSHOT/maven-metadata.xml
(2 KB at 37.2 KB/sec)
[INFO] Uploading: https://repository.apache.org/content/repositories/snapshots/org/apache/tamaya/tamaya-core/0.3-incubating-SNAPSHOT/tamaya-core-0.3-incubating-20161005.223720-198.jar
[INFO] Uploaded: https://repository.apache.org/content/repositories/snapshots/org/apache/tamaya/tamaya-core/0.3-incubating-SNAPSHOT/tamaya-core-0.3-incubating-20161005.223720-198.jar
(91 KB at 932.3 KB/sec)
[INFO] Uploading: https://repository.apache.org/content/repositories/snapshots/org/apache/tamaya/tamaya-core/0.3-incubating-SNAPSHOT/tamaya-core-0.3-incubating-20161005.223720-198.pom
[INFO] Uploaded: https://repository.apache.org/content/repositories/snapshots/org/apache/tamaya/tamaya-core/0.3-incubating-SNAPSHOT/tamaya-core-0.3-incubating-20161005.223720-198.pom
(4 KB at 42.1 KB/sec)
[INFO] Downloading: https://repository.apache.org/content/repositories/snapshots/org/apache/tamaya/tamaya-core/maven-metadata.xml
[INFO] Downloaded: https://repository.apache.org/content/repositories/snapshots/org/apache/tamaya/tamaya-core/maven-metadata.xml
(442 B at 10.8 KB/sec)
[INFO] Uploading: https://repository.apache.org/content/repositories/snapshots/org/apache/tamaya/tamaya-core/0.3-incubating-SNAPSHOT/maven-metadata.xml
[INFO] Uploaded: https://repository.apache.org/content/repositories/snapshots/org/apache/tamaya/tamaya-core/0.3-incubating-SNAPSHOT/maven-metadata.xml
(2 KB at 20.7 KB/sec)
[INFO] Uploading: https://repository.apache.org/content/repositories/snapshots/org/apache/tamaya/tamaya-core/maven-metadata.xml
[INFO] Uploaded: https://repository.apache.org/content/repositories/snapshots/org/apache/tamaya/tamaya-core/maven-metadata.xml
(442 B at 6.1 KB/sec)
[INFO] Uploading: https://repository.apache.org/content/repositories/snapshots/org/apache/tamaya/tamaya-core/0.3-incubating-SNAPSHOT/tamaya-core-0.3-incubating-20161005.223720-198-features.xml
[INFO] Uploaded: https://repository.apache.org/content/repositories/snapshots/org/apache/tamaya/tamaya-core/0.3-incubating-SNAPSHOT/tamaya-core-0.3-incubating-20161005.223720-198-features.xml
(558 B at 7.2 KB/sec)
[INFO] Uploading: https://repository.apache.org/content/repositories/snapshots/org/apache/tamaya/tamaya-core/0.3-incubating-SNAPSHOT/maven-metadata.xml
[INFO] Uploaded: https://repository.apache.org/content/repositories/snapshots/org/apache/tamaya/tamaya-core/0.3-incubating-SNAPSHOT/maven-metadata.xml
(2 KB at 20.7 KB/sec)
[INFO] Uploading: https://repository.apache.org/content/repositories/snapshots/org/apache/tamaya/tamaya-core/0.3-incubating-SNAPSHOT/tamaya-core-0.3-incubating-20161005.223720-198-javadoc.jar
[INFO] Uploaded: https://repository.apache.org/content/repositories/snapshots/org/apache/tamaya/tamaya-core/0.3-incubating-SNAPSHOT/tamaya-core-0.3-incubating-20161005.223720-198-javadoc.jar
(223 KB at 2199.5 KB/sec)
[INFO] Uploading: https://repository.apache.org/content/repositories/snapshots/org/apache/tamaya/tamaya-core/0.3-incubating-SNAPSHOT/maven-metadata.xml
[INFO] Uploaded: https://repository.apache.org/content/repositories/snapshots/org/apache/tamaya/tamaya-core/0.3-incubating-SNAPSHOT/maven-metadata.xml
(2 KB at 20.7 KB/sec)
[INFO] Uploading: https://repository.apache.org/content/repositories/snapshots/org/apache/tamaya/tamaya-core/0.3-incubating-SNAPSHOT/tamaya-core-0.3-incubating-20161005.223720-198-sources.jar
[INFO] Uploaded: https://repository.apache.org/content/repositories/snapshots/org/apache/tamaya/tamaya-core/0.3-incubating-SNAPSHOT/tamaya-core-0.3-incubating-20161005.223720-198-sources.jar
(69 KB at 609.0 KB/sec)
[INFO] Uploading: https://repository.apache.org/content/repositories/snapshots/org/apache/tamaya/tamaya-core/0.3-incubating-SNAPSHOT/maven-metadata.xml
[INFO] Uploaded: https://repository.apache.org/content/repositories/snapshots/org/apache/tamaya/tamaya-core/0.3-incubating-SNAPSHOT/maven-metadata.xml
(2 KB at 21.4 KB/sec)
[INFO] Uploading: https://repository.apache.org/content/repositories/snapshots/org/apache/tamaya/tamaya-core/0.3-incubating-SNAPSHOT/tamaya-core-0.3-incubating-20161005.223720-198-features.xml
[INFO] Uploaded: https://repository.apache.org/content/repositories/snapshots/org/apache/tamaya/tamaya-core/0.3-incubating-SNAPSHOT/tamaya-core-0.3-incubating-20161005.223720-198-features.xml
(558 B at 6.6 KB/sec)
[INFO] Uploading: https://repository.apache.org/content/repositories/snapshots/org/apache/tamaya/tamaya-core/0.3-incubating-SNAPSHOT/maven-metadata.xml
[INFO] Uploaded: https://repository.apache.org/content/repositories/snapshots/org/apache/tamaya/tamaya-core/0.3-incubating-SNAPSHOT/maven-metadata.xml
(2 KB at 19.4 KB/sec)
[INFO] Uploading: https://repository.apache.org/content/repositories/snapshots/org/apache/tamaya/tamaya-core/0.3-incubating-SNAPSHOT/tamaya-core-0.3-incubating-20161005.223720-198-javadoc.jar
[INFO] Uploaded: https://repository.apache.org/content/repositories/snapshots/org/apache/tamaya/tamaya-core/0.3-incubating-SNAPSHOT/tamaya-core-0.3-incubating-20161005.223720-198-javadoc.jar
(223 KB at 2290.1 KB/sec)
[INFO] Uploading: https://repository.apache.org/content/repositories/snapshots/org/apache/tamaya/tamaya-core/0.3-incubating-SNAPSHOT/maven-metadata.xml
[INFO] Uploaded: https://repository.apache.org/content/repositories/snapshots/org/apache/tamaya/tamaya-core/0.3-incubating-SNAPSHOT/maven-metadata.xml
(2 KB at 18.6 KB/sec)
[INFO] Uploading: https://repository.apache.org/content/repositories/snapshots/org/apache/tamaya/tamaya-core/0.3-incubating-SNAPSHOT/tamaya-core-0.3-incubating-20161005.223720-198-sources.jar
[INFO] Uploaded: https://repository.apache.org/content/repositories/snapshots/org/apache/tamaya/tamaya-core/0.3-incubating-SNAPSHOT/tamaya-core-0.3-incubating-20161005.223720-198-sources.jar
(69 KB at 740.0 KB/sec)
[INFO] Uploading: https://repository.apache.org/content/repositories/snapshots/org/apache/tamaya/tamaya-core/0.3-incubating-SNAPSHOT/maven-metadata.xml
[INFO] Uploaded: https://repository.apache.org/content/repositories/snapshots/org/apache/tamaya/tamaya-core/0.3-incubating-SNAPSHOT/maven-metadata.xml
(2 KB at 21.0 KB/sec)
[INFO] 
[INFO] --- maven-bundle-plugin:3.2.0:deploy (default-deploy) @ tamaya-core ---
[INFO] Remote OBR update disabled (enable with -DremoteOBR)
[INFO]                                                                         
[INFO] ------------------------------------------------------------------------
[INFO] Building Apache Tamaya Documentation 0.3-incubating-SNAPSHOT
[INFO] ------------------------------------------------------------------------
[INFO] Downloading: http://rubygems-proxy.torquebox.org/releases/rubygems/asciidoctor-diagram/1.2.1/asciidoctor-diagram-1.2.1.gem
[INFO] ------------------------------------------------------------------------
[INFO] Reactor Summary:
[INFO] 
[INFO] Apache Tamaya ...................................... SUCCESS [ 39.021 s]
[INFO] Apache Tamaya Build Configuration .................. SUCCESS [  6.177 s]
[INFO] Apache Tamaya Code - all ........................... SUCCESS [  7.605 s]
[INFO] Apache Tamaya API .................................. SUCCESS [01:14 min]
[INFO] Apache Tamaya Core Implementation .................. SUCCESS [ 48.356 s]
[INFO] Apache Tamaya Documentation ........................ FAILURE [  2.045 s]
[INFO] Apache Tamaya Distribution ......................... SKIPPED
[INFO] ------------------------------------------------------------------------
[INFO] BUILD FAILURE
[INFO] ------------------------------------------------------------------------
[INFO] Total time: 03:18 min
[INFO] Finished at: 2016-10-05T22:37:32+00:00
[INFO] Final Memory: 76M/677M
[INFO] ------------------------------------------------------------------------
[ERROR] Failed to execute goal on project tamaya-docs: Could not resolve dependencies for
project org.apache.tamaya:tamaya-docs:jar:0.3-incubating-SNAPSHOT: Could not transfer artifact
rubygems:asciidoctor-diagram:gem:1.2.1 from/to rubygems-proxy-releases (http://rubygems-proxy.torquebox.org/releases):
TransferFailedException: ClientProtocolException: Received redirect response HTTP/1.1 301
Moved Permanently but no location header -> [Help 1]
[ERROR] 
[ERROR] To see the full stack trace of the errors, re-run Maven with the -e switch.
[ERROR] Re-run Maven using the -X switch to enable full debug logging.
[ERROR] 
[ERROR] For more information about the errors and possible solutions, please read the following
articles:
[ERROR] [Help 1] http://cwiki.apache.org/confluence/display/MAVEN/DependencyResolutionException
[ERROR] 
[ERROR] After correcting the problems, you can resume the build with the command
[ERROR]   mvn <goals> -rf :tamaya-docs
[JENKINS] Archiving <https://builds.apache.org/job/tamaya-master-branch-ci/ws/pom.xml>
to org.apache.tamaya/tamaya-all/0.3-incubating-SNAPSHOT/tamaya-all-0.3-incubating-SNAPSHOT.pom
[JENKINS] Archiving <https://builds.apache.org/job/tamaya-master-branch-ci/ws/target/feature/feature.xml>
to org.apache.tamaya/tamaya-all/0.3-incubating-20161005.223455-201/tamaya-all-0.3-incubating-20161005.223455-201-features.xml
[JENKINS] Archiving <https://builds.apache.org/job/tamaya-master-branch-ci/ws/target/tamaya-all-0.3-incubating-SNAPSHOT-site.xml>
to org.apache.tamaya/tamaya-all/0.3-incubating-20161005.223455-201/tamaya-all-0.3-incubating-20161005.223455-201-site.xml
No prior successful build to compare, so performing full copy of artifacts
[JENKINS] Archiving <https://builds.apache.org/job/tamaya-master-branch-ci/ws/buildconfigurations/pom.xml>
to org.apache.tamaya/buildconfigurations/0.3-incubating-SNAPSHOT/buildconfigurations-0.3-incubating-SNAPSHOT.pom
[JENKINS] Archiving <https://builds.apache.org/job/tamaya-master-branch-ci/ws/buildconfigurations/target/buildconfigurations-0.3-incubating-SNAPSHOT.jar>
to org.apache.tamaya/buildconfigurations/0.3-incubating-20161005.223503-200/buildconfigurations-0.3-incubating-20161005.223503-200.jar
[JENKINS] Archiving <https://builds.apache.org/job/tamaya-master-branch-ci/ws/buildconfigurations/target/feature/feature.xml>
to org.apache.tamaya/buildconfigurations/0.3-incubating-20161005.223503-200/buildconfigurations-0.3-incubating-20161005.223503-200-features.xml
[JENKINS] Archiving <https://builds.apache.org/job/tamaya-master-branch-ci/ws/buildconfigurations/target/buildconfigurations-0.3-incubating-SNAPSHOT-sources.jar>
to org.apache.tamaya/buildconfigurations/0.3-incubating-20161005.223503-200/buildconfigurations-0.3-incubating-20161005.223503-200-sources.jar
No prior successful build to compare, so performing full copy of artifacts
[JENKINS] Archiving <https://builds.apache.org/job/tamaya-master-branch-ci/ws/code/core/pom.xml>
to org.apache.tamaya/tamaya-core/0.3-incubating-SNAPSHOT/tamaya-core-0.3-incubating-SNAPSHOT.pom
[JENKINS] Archiving <https://builds.apache.org/job/tamaya-master-branch-ci/ws/code/core/target/tamaya-core-0.3-incubating-SNAPSHOT.jar>
to org.apache.tamaya/tamaya-core/0.3-incubating-20161005.223720-198/tamaya-core-0.3-incubating-20161005.223720-198.jar
[JENKINS] Archiving <https://builds.apache.org/job/tamaya-master-branch-ci/ws/code/core/target/feature/feature.xml>
to org.apache.tamaya/tamaya-core/0.3-incubating-20161005.223720-198/tamaya-core-0.3-incubating-20161005.223720-198-features.xml
[JENKINS] Archiving <https://builds.apache.org/job/tamaya-master-branch-ci/ws/code/core/target/tamaya-core-0.3-incubating-SNAPSHOT-javadoc.jar>
to org.apache.tamaya/tamaya-core/0.3-incubating-20161005.223720-198/tamaya-core-0.3-incubating-20161005.223720-198-javadoc.jar
[JENKINS] Archiving <https://builds.apache.org/job/tamaya-master-branch-ci/ws/code/core/target/tamaya-core-0.3-incubating-SNAPSHOT-sources.jar>
to org.apache.tamaya/tamaya-core/0.3-incubating-20161005.223720-198/tamaya-core-0.3-incubating-20161005.223720-198-sources.jar
No prior successful build to compare, so performing full copy of artifacts
[JENKINS] Archiving <https://builds.apache.org/job/tamaya-master-branch-ci/ws/code/api/pom.xml>
to org.apache.tamaya/tamaya-api/0.3-incubating-SNAPSHOT/tamaya-api-0.3-incubating-SNAPSHOT.pom
[JENKINS] Archiving <https://builds.apache.org/job/tamaya-master-branch-ci/ws/code/api/target/tamaya-api-0.3-incubating-SNAPSHOT.jar>
to org.apache.tamaya/tamaya-api/0.3-incubating-20161005.223627-199/tamaya-api-0.3-incubating-20161005.223627-199.jar
[JENKINS] Archiving <https://builds.apache.org/job/tamaya-master-branch-ci/ws/code/api/target/feature/feature.xml>
to org.apache.tamaya/tamaya-api/0.3-incubating-20161005.223627-199/tamaya-api-0.3-incubating-20161005.223627-199-features.xml
[JENKINS] Archiving <https://builds.apache.org/job/tamaya-master-branch-ci/ws/code/api/target/tamaya-api-0.3-incubating-SNAPSHOT-javadoc.jar>
to org.apache.tamaya/tamaya-api/0.3-incubating-20161005.223627-199/tamaya-api-0.3-incubating-20161005.223627-199-javadoc.jar
[JENKINS] Archiving <https://builds.apache.org/job/tamaya-master-branch-ci/ws/code/api/target/tamaya-api-0.3-incubating-SNAPSHOT-sources.jar>
to org.apache.tamaya/tamaya-api/0.3-incubating-20161005.223627-199/tamaya-api-0.3-incubating-20161005.223627-199-sources.jar
No prior successful build to compare, so performing full copy of artifacts
[JENKINS] Archiving <https://builds.apache.org/job/tamaya-master-branch-ci/ws/distribution/pom.xml>
to org.apache.tamaya/tamaya-distribution/0.3-incubating-SNAPSHOT/tamaya-distribution-0.3-incubating-SNAPSHOT.pom
No prior successful build to compare, so performing full copy of artifacts
[JENKINS] Archiving <https://builds.apache.org/job/tamaya-master-branch-ci/ws/docs/pom.xml>
to org.apache.tamaya/tamaya-docs/0.3-incubating-SNAPSHOT/tamaya-docs-0.3-incubating-SNAPSHOT.pom
No prior successful build to compare, so performing full copy of artifacts
[JENKINS] Archiving <https://builds.apache.org/job/tamaya-master-branch-ci/ws/code/pom.xml>
to org.apache.tamaya/tamaya-code/0.3-incubating-SNAPSHOT/tamaya-code-0.3-incubating-SNAPSHOT.pom
[JENKINS] Archiving <https://builds.apache.org/job/tamaya-master-branch-ci/ws/code/target/feature/feature.xml>
to org.apache.tamaya/tamaya-code/0.3-incubating-20161005.223513-199/tamaya-code-0.3-incubating-20161005.223513-199-features.xml
No prior successful build to compare, so performing full copy of artifacts
channel stopped

Mime
View raw message