tamaya-commits mailing list archives

Site index · List index
Message view « Date » · « Thread »
Top « Date » · « Thread »
From Apache Jenkins Server <jenk...@builds.apache.org>
Subject Build failed in Jenkins: Tamaya-Site-Master #192
Date Wed, 05 Oct 2016 22:21:31 GMT
See <https://builds.apache.org/job/Tamaya-Site-Master/192/changes>

Changes:

[plexus] [TAMAYA-180] Removed the examples from the master branch.

------------------------------------------
[...truncated 11368 lines...]
[INFO] Downloaded: https://repo.maven.apache.org/maven2/lt/velykis/maven/skins/reflow-velocity-tools/1.1.1/reflow-velocity-tools-1.1.1.jar
(20 KB at 203.8 KB/sec)
[INFO] Downloading: https://repo.maven.apache.org/maven2/org/codehaus/plexus/plexus-io/2.0.8/plexus-io-2.0.8.jar
[INFO] Downloaded: https://repo.maven.apache.org/maven2/io/netty/netty-common/4.0.0.CR1/netty-common-4.0.0.CR1.jar
(278 KB at 2571.2 KB/sec)
[INFO] Downloaded: https://repo.maven.apache.org/maven2/org/jsoup/jsoup/1.7.3/jsoup-1.7.3.jar
(291 KB at 2616.4 KB/sec)
[INFO] Downloaded: https://repo.maven.apache.org/maven2/org/codehaus/plexus/plexus-io/2.0.8/plexus-io-2.0.8.jar
(58 KB at 504.4 KB/sec)
[INFO] Downloaded: https://repo.maven.apache.org/maven2/org/codehaus/plexus/plexus-archiver/2.4.3/plexus-archiver-2.4.3.jar
(160 KB at 1332.3 KB/sec)
[INFO] Downloaded: https://repo.maven.apache.org/maven2/org/jruby/jruby-complete/1.7.17/jruby-complete-1.7.17.jar
(21883 KB at 27422.0 KB/sec)
[INFO] configuring report plugin org.apache.maven.plugins:maven-project-info-reports-plugin:2.9
[INFO] configuring report plugin org.apache.maven.plugins:maven-javadoc-plugin:2.10.4
[INFO] Downloading: https://repo.maven.apache.org/maven2/org/apache/maven/shared/maven-invoker/2.2/maven-invoker-2.2.pom
[INFO] Downloaded: https://repo.maven.apache.org/maven2/org/apache/maven/shared/maven-invoker/2.2/maven-invoker-2.2.pom
(6 KB at 519.6 KB/sec)
[INFO] Downloading: https://repo.maven.apache.org/maven2/org/codehaus/plexus/plexus-archiver/3.3/plexus-archiver-3.3.pom
[INFO] Downloaded: https://repo.maven.apache.org/maven2/org/codehaus/plexus/plexus-archiver/3.3/plexus-archiver-3.3.pom
(6 KB at 520.2 KB/sec)
[INFO] Downloading: https://repo.maven.apache.org/maven2/org/tukaani/xz/1.5/xz-1.5.pom
[INFO] Downloaded: https://repo.maven.apache.org/maven2/org/tukaani/xz/1.5/xz-1.5.pom (2 KB
at 232.4 KB/sec)
[INFO] Downloading: https://repo.maven.apache.org/maven2/org/apache/maven/shared/maven-invoker/2.2/maven-invoker-2.2.jar
[INFO] Downloading: https://repo.maven.apache.org/maven2/org/codehaus/plexus/plexus-archiver/3.3/plexus-archiver-3.3.jar
[INFO] Downloading: https://repo.maven.apache.org/maven2/org/tukaani/xz/1.5/xz-1.5.jar
[INFO] Downloaded: https://repo.maven.apache.org/maven2/org/apache/maven/shared/maven-invoker/2.2/maven-invoker-2.2.jar
(30 KB at 2270.7 KB/sec)
[INFO] Downloaded: https://repo.maven.apache.org/maven2/org/tukaani/xz/1.5/xz-1.5.jar (98
KB at 6944.4 KB/sec)
[INFO] Downloaded: https://repo.maven.apache.org/maven2/org/codehaus/plexus/plexus-archiver/3.3/plexus-archiver-3.3.jar
(182 KB at 11314.5 KB/sec)
[INFO] preparing 'javadoc' report requires 'generate-sources' forked phase execution
[INFO] 
[INFO] >>> maven-javadoc-plugin:2.10.4:javadoc > generate-sources @ tamaya-all
>>>
[INFO] 
[INFO] --- maven-enforcer-plugin:1.4.1:enforce (enforce-versions) @ tamaya-all ---
[INFO] 
[INFO] --- apache-rat-plugin:0.12:check (default) @ tamaya-all ---
[INFO] Downloading: https://repo.maven.apache.org/maven2/org/apache/rat/apache-rat-core/0.12/apache-rat-core-0.12.pom
[INFO] Downloaded: https://repo.maven.apache.org/maven2/org/apache/rat/apache-rat-core/0.12/apache-rat-core-0.12.pom
(5 KB at 377.3 KB/sec)
[INFO] Downloading: https://repo.maven.apache.org/maven2/org/apache/rat/apache-rat-api/0.12/apache-rat-api-0.12.pom
[INFO] Downloaded: https://repo.maven.apache.org/maven2/org/apache/rat/apache-rat-api/0.12/apache-rat-api-0.12.pom
(2 KB at 182.6 KB/sec)
[INFO] Downloading: https://repo.maven.apache.org/maven2/org/apache/rat/apache-rat-core/0.12/apache-rat-core-0.12.jar
[INFO] Downloading: https://repo.maven.apache.org/maven2/org/apache/rat/apache-rat-api/0.12/apache-rat-api-0.12.jar
[INFO] Downloaded: https://repo.maven.apache.org/maven2/org/apache/rat/apache-rat-api/0.12/apache-rat-api-0.12.jar
(11 KB at 941.6 KB/sec)
[INFO] Downloaded: https://repo.maven.apache.org/maven2/org/apache/rat/apache-rat-core/0.12/apache-rat-core-0.12.jar
(120 KB at 7468.5 KB/sec)
[INFO] Enabled default license matchers.
[INFO] Will parse SCM ignores for exclusions...
[INFO] Parsing exclusions from <https://builds.apache.org/job/Tamaya-Site-Master/ws/.gitignore>
[INFO] Finished adding exclusions from SCM ignore files.
[INFO] 83 implicit excludes (use -debug for more details).
[INFO] Exclude: **/*banner.txt
[INFO] Exclude: banner.txt
[INFO] Exclude: .git
[INFO] Exclude: derby.log
[INFO] Exclude: **/bootstrap-*
[INFO] Exclude: **/js/jquery-*
[INFO] Exclude: **/*.json
[INFO] Exclude: **/*.md
[INFO] Exclude: **/*.md.vm
[INFO] Exclude: src/site/asciidoc/temp-properties-files-for-site/attributes.adoc
[INFO] Exclude: readme/**
[INFO] 48 resources included (use -debug for more details)
[INFO] Rat check: Summary over all files. Unapproved: 0, unknown: 0, generated: 0, approved:
46 licenses.
[INFO] 
[INFO] <<< maven-javadoc-plugin:2.10.4:javadoc < generate-sources @ tamaya-all
<<<
[INFO] preparing 'aggregate' report requires 'generate-sources' forked phase execution
[INFO] 
[INFO] >>> maven-javadoc-plugin:2.10.4:aggregate > generate-sources @ tamaya-all
>>>
[INFO]                                                                         
[INFO] >>>>>>>>>>>>>>>>>>>>>>>>>>>>>>>>>>>>>>>>>>>>>>>>>>>>>>>>>>>>>>>>>>>>>>>>
[INFO] Forking Apache Tamaya 0.3-incubating-SNAPSHOT
[INFO] >>>>>>>>>>>>>>>>>>>>>>>>>>>>>>>>>>>>>>>>>>>>>>>>>>>>>>>>>>>>>>>>>>>>>>>>
[INFO] 
[INFO] --- maven-enforcer-plugin:1.4.1:enforce (enforce-versions) @ tamaya-all ---
[INFO] 
[INFO] --- apache-rat-plugin:0.12:check (default) @ tamaya-all ---
[INFO] Enabled default license matchers.
[INFO] Will parse SCM ignores for exclusions...
[INFO] Parsing exclusions from <https://builds.apache.org/job/Tamaya-Site-Master/ws/.gitignore>
[INFO] Finished adding exclusions from SCM ignore files.
[INFO] 83 implicit excludes (use -debug for more details).
[INFO] Exclude: **/*banner.txt
[INFO] Exclude: banner.txt
[INFO] Exclude: .git
[INFO] Exclude: derby.log
[INFO] Exclude: **/bootstrap-*
[INFO] Exclude: **/js/jquery-*
[INFO] Exclude: **/*.json
[INFO] Exclude: **/*.md
[INFO] Exclude: **/*.md.vm
[INFO] Exclude: src/site/asciidoc/temp-properties-files-for-site/attributes.adoc
[INFO] Exclude: readme/**
[INFO] 48 resources included (use -debug for more details)
[INFO] Rat check: Summary over all files. Unapproved: 0, unknown: 0, generated: 0, approved:
46 licenses.
[INFO]                                                                         
[INFO] >>>>>>>>>>>>>>>>>>>>>>>>>>>>>>>>>>>>>>>>>>>>>>>>>>>>>>>>>>>>>>>>>>>>>>>>
[INFO] Forking Apache Tamaya Build Configuration 0.3-incubating-SNAPSHOT
[INFO] >>>>>>>>>>>>>>>>>>>>>>>>>>>>>>>>>>>>>>>>>>>>>>>>>>>>>>>>>>>>>>>>>>>>>>>>
[INFO] 
[INFO] --- maven-enforcer-plugin:1.4.1:enforce (enforce-versions) @ buildconfigurations ---
[INFO] 
[INFO] --- apache-rat-plugin:0.12:check (default) @ buildconfigurations ---
[INFO] Enabled default license matchers.
[INFO] Will parse SCM ignores for exclusions...
[INFO] Finished adding exclusions from SCM ignore files.
[INFO] 61 implicit excludes (use -debug for more details).
[INFO] Exclude: **/*banner.txt
[INFO] Exclude: banner.txt
[INFO] Exclude: .git
[INFO] Exclude: derby.log
[INFO] Exclude: **/bootstrap-*
[INFO] Exclude: **/js/jquery-*
[INFO] Exclude: **/*.json
[INFO] Exclude: **/*.md
[INFO] Exclude: **/*.md.vm
[INFO] Exclude: src/site/asciidoc/temp-properties-files-for-site/attributes.adoc
[INFO] Exclude: readme/**
[INFO] 3 resources included (use -debug for more details)
[INFO] Rat check: Summary over all files. Unapproved: 0, unknown: 0, generated: 0, approved:
3 licenses.
[INFO]                                                                         
[INFO] >>>>>>>>>>>>>>>>>>>>>>>>>>>>>>>>>>>>>>>>>>>>>>>>>>>>>>>>>>>>>>>>>>>>>>>>
[INFO] Forking Apache Tamaya Code - all 0.3-incubating-SNAPSHOT
[INFO] >>>>>>>>>>>>>>>>>>>>>>>>>>>>>>>>>>>>>>>>>>>>>>>>>>>>>>>>>>>>>>>>>>>>>>>>
[INFO] 
[INFO] --- maven-enforcer-plugin:1.4.1:enforce (enforce-versions) @ tamaya-code ---
[INFO] 
[INFO] --- apache-rat-plugin:0.12:check (default) @ tamaya-code ---
[INFO] Enabled default license matchers.
[INFO] Will parse SCM ignores for exclusions...
[INFO] Finished adding exclusions from SCM ignore files.
[INFO] 63 implicit excludes (use -debug for more details).
[INFO] Exclude: **/*banner.txt
[INFO] Exclude: banner.txt
[INFO] Exclude: .git
[INFO] Exclude: derby.log
[INFO] Exclude: **/bootstrap-*
[INFO] Exclude: **/js/jquery-*
[INFO] Exclude: **/*.json
[INFO] Exclude: **/*.md
[INFO] Exclude: **/*.md.vm
[INFO] Exclude: src/site/asciidoc/temp-properties-files-for-site/attributes.adoc
[INFO] Exclude: readme/**
[INFO] 1 resources included (use -debug for more details)
[INFO] Rat check: Summary over all files. Unapproved: 0, unknown: 0, generated: 0, approved:
1 licenses.
[INFO]                                                                         
[INFO] >>>>>>>>>>>>>>>>>>>>>>>>>>>>>>>>>>>>>>>>>>>>>>>>>>>>>>>>>>>>>>>>>>>>>>>>
[INFO] Forking Apache Tamaya API 0.3-incubating-SNAPSHOT
[INFO] >>>>>>>>>>>>>>>>>>>>>>>>>>>>>>>>>>>>>>>>>>>>>>>>>>>>>>>>>>>>>>>>>>>>>>>>
[INFO] Downloading: https://repo.maven.apache.org/maven2/org/hamcrest/java-hamcrest/2.0.0.0/java-hamcrest-2.0.0.0.pom
[INFO] Downloaded: https://repo.maven.apache.org/maven2/org/hamcrest/java-hamcrest/2.0.0.0/java-hamcrest-2.0.0.0.pom
(2 KB at 160.6 KB/sec)
[INFO] 
[INFO] --- maven-enforcer-plugin:1.4.1:enforce (enforce-versions) @ tamaya-api ---
[INFO] 
[INFO] --- apache-rat-plugin:0.12:check (default) @ tamaya-api ---
[INFO] Enabled default license matchers.
[INFO] Will parse SCM ignores for exclusions...
[INFO] Finished adding exclusions from SCM ignore files.
[INFO] 61 implicit excludes (use -debug for more details).
[INFO] Exclude: **/*banner.txt
[INFO] Exclude: banner.txt
[INFO] Exclude: .git
[INFO] Exclude: derby.log
[INFO] Exclude: **/bootstrap-*
[INFO] Exclude: **/js/jquery-*
[INFO] Exclude: **/*.json
[INFO] Exclude: **/*.md
[INFO] Exclude: **/*.md.vm
[INFO] Exclude: src/site/asciidoc/temp-properties-files-for-site/attributes.adoc
[INFO] Exclude: readme/**
[INFO] 33 resources included (use -debug for more details)
[INFO] Rat check: Summary over all files. Unapproved: 0, unknown: 0, generated: 0, approved:
33 licenses.
[INFO] 
[INFO] --- maven-bundle-plugin:3.2.0:cleanVersions (cleanVersions) @ tamaya-api ---
[INFO]                                                                         
[INFO] >>>>>>>>>>>>>>>>>>>>>>>>>>>>>>>>>>>>>>>>>>>>>>>>>>>>>>>>>>>>>>>>>>>>>>>>
[INFO] Forking Apache Tamaya Core Implementation 0.3-incubating-SNAPSHOT
[INFO] >>>>>>>>>>>>>>>>>>>>>>>>>>>>>>>>>>>>>>>>>>>>>>>>>>>>>>>>>>>>>>>>>>>>>>>>
[INFO] Downloading: http://repository.apache.org/snapshots/org/apache/tamaya/tamaya-api/0.3-incubating-SNAPSHOT/maven-metadata.xml
[INFO] Downloaded: http://repository.apache.org/snapshots/org/apache/tamaya/tamaya-api/0.3-incubating-SNAPSHOT/maven-metadata.xml
(2 KB at 33.7 KB/sec)
[INFO] Downloading: https://repo.maven.apache.org/maven2/org/osgi/org.osgi.compendium/5.0.0/org.osgi.compendium-5.0.0.pom
[INFO] Downloaded: https://repo.maven.apache.org/maven2/org/osgi/org.osgi.compendium/5.0.0/org.osgi.compendium-5.0.0.pom
(2 KB at 150.9 KB/sec)
[INFO] 
[INFO] --- maven-enforcer-plugin:1.4.1:enforce (enforce-versions) @ tamaya-core ---
[INFO] 
[INFO] --- apache-rat-plugin:0.12:check (default) @ tamaya-core ---
[INFO] Enabled default license matchers.
[INFO] Will parse SCM ignores for exclusions...
[INFO] Finished adding exclusions from SCM ignore files.
[INFO] 61 implicit excludes (use -debug for more details).
[INFO] Exclude: **/*banner.txt
[INFO] Exclude: banner.txt
[INFO] Exclude: .git
[INFO] Exclude: derby.log
[INFO] Exclude: **/bootstrap-*
[INFO] Exclude: **/js/jquery-*
[INFO] Exclude: **/*.json
[INFO] Exclude: **/*.md
[INFO] Exclude: **/*.md.vm
[INFO] Exclude: src/site/asciidoc/temp-properties-files-for-site/attributes.adoc
[INFO] Exclude: readme/**
[INFO] 91 resources included (use -debug for more details)
[INFO] Rat check: Summary over all files. Unapproved: 0, unknown: 0, generated: 0, approved:
91 licenses.
[INFO] 
[INFO] --- maven-bundle-plugin:3.2.0:cleanVersions (cleanVersions) @ tamaya-core ---
[INFO]                                                                         
[INFO] >>>>>>>>>>>>>>>>>>>>>>>>>>>>>>>>>>>>>>>>>>>>>>>>>>>>>>>>>>>>>>>>>>>>>>>>
[INFO] Forking Apache Tamaya Documentation 0.3-incubating-SNAPSHOT
[INFO] >>>>>>>>>>>>>>>>>>>>>>>>>>>>>>>>>>>>>>>>>>>>>>>>>>>>>>>>>>>>>>>>>>>>>>>>
[INFO] Downloading: http://rubygems-proxy.torquebox.org/releases/rubygems/asciidoctor-diagram/1.2.1/asciidoctor-diagram-1.2.1.pom
[INFO] Downloaded: http://rubygems-proxy.torquebox.org/releases/rubygems/asciidoctor-diagram/1.2.1/asciidoctor-diagram-1.2.1.pom
(3 KB at 18.6 KB/sec)
[INFO] Downloading: http://rubygems-proxy.torquebox.org/releases/rubygems/asciidoctor-diagram/1.2.1/asciidoctor-diagram-1.2.1.gem
[INFO] Downloading: https://repo.maven.apache.org/maven2/rubygems/asciidoctor-diagram/1.2.1/asciidoctor-diagram-1.2.1.gem
[WARNING] Failed to notify spy hudson.maven.Maven3Builder$JenkinsEventSpy: null
[FINDBUGS] No report found for mojo site
[INFO] ------------------------------------------------------------------------
[INFO] Reactor Summary:
[INFO] 
[INFO] Apache Tamaya ...................................... FAILURE [ 13.020 s]
[INFO] Apache Tamaya Build Configuration .................. SKIPPED
[INFO] Apache Tamaya Code - all ........................... SKIPPED
[INFO] Apache Tamaya API .................................. SKIPPED
[INFO] Apache Tamaya Core Implementation .................. SKIPPED
[INFO] Apache Tamaya Documentation ........................ SKIPPED
[INFO] Apache Tamaya Distribution ......................... SKIPPED
[INFO] ------------------------------------------------------------------------
[INFO] BUILD FAILURE
[INFO] ------------------------------------------------------------------------
[INFO] Total time: 28.063 s
[INFO] Finished at: 2016-10-05T22:21:31+00:00
[INFO] Final Memory: 61M/706M
[INFO] ------------------------------------------------------------------------
[ERROR] Failed to execute goal org.apache.maven.plugins:maven-site-plugin:3.4:site (default-cli)
on project tamaya-all: failed to get report for org.apache.maven.plugins:maven-javadoc-plugin:
Failed to execute goal on project tamaya-docs: Could not resolve dependencies for project
org.apache.tamaya:tamaya-docs:jar:0.3-incubating-SNAPSHOT: Could not transfer artifact rubygems:asciidoctor-diagram:gem:1.2.1
from/to rubygems-proxy-releases (http://rubygems-proxy.torquebox.org/releases): TransferFailedException:
ClientProtocolException: Received redirect response HTTP/1.1 301 Moved Permanently but no
location header -> [Help 1]
[ERROR] 
[ERROR] To see the full stack trace of the errors, re-run Maven with the -e switch.
[ERROR] Re-run Maven using the -X switch to enable full debug logging.
[ERROR] 
[ERROR] For more information about the errors and possible solutions, please read the following
articles:
[ERROR] [Help 1] http://cwiki.apache.org/confluence/display/MAVEN/MojoExecutionException
[JENKINS] Archiving <https://builds.apache.org/job/Tamaya-Site-Master/ws/pom.xml> to
org.apache.tamaya/tamaya-all/0.3-incubating-SNAPSHOT/tamaya-all-0.3-incubating-SNAPSHOT.pom
[JENKINS] Archiving <https://builds.apache.org/job/Tamaya-Site-Master/ws/buildconfigurations/pom.xml>
to org.apache.tamaya/buildconfigurations/0.3-incubating-SNAPSHOT/buildconfigurations-0.3-incubating-SNAPSHOT.pom
[JENKINS] Archiving <https://builds.apache.org/job/Tamaya-Site-Master/ws/code/core/pom.xml>
to org.apache.tamaya/tamaya-core/0.3-incubating-SNAPSHOT/tamaya-core-0.3-incubating-SNAPSHOT.pom
[JENKINS] Archiving <https://builds.apache.org/job/Tamaya-Site-Master/ws/code/api/pom.xml>
to org.apache.tamaya/tamaya-api/0.3-incubating-SNAPSHOT/tamaya-api-0.3-incubating-SNAPSHOT.pom
[JENKINS] Archiving <https://builds.apache.org/job/Tamaya-Site-Master/ws/distribution/pom.xml>
to org.apache.tamaya/tamaya-distribution/0.3-incubating-SNAPSHOT/tamaya-distribution-0.3-incubating-SNAPSHOT.pom
[JENKINS] Archiving <https://builds.apache.org/job/Tamaya-Site-Master/ws/docs/pom.xml>
to org.apache.tamaya/tamaya-docs/0.3-incubating-SNAPSHOT/tamaya-docs-0.3-incubating-SNAPSHOT.pom
[JENKINS] Archiving <https://builds.apache.org/job/Tamaya-Site-Master/ws/code/pom.xml>
to org.apache.tamaya/tamaya-code/0.3-incubating-SNAPSHOT/tamaya-code-0.3-incubating-SNAPSHOT.pom
channel stopped
[Tamaya-Site-Master] $ /bin/bash -xe /tmp/hudson7031208488607462344.sh
+ which sed
/bin/sed
+ sh ./bin/fixSSLinMavenSite.sh jenkins
Will replace http with https in the generated maven site ...
Assuming script is run on CI - starting to replace ...
Where am I?
<https://builds.apache.org/job/Tamaya-Site-Master/ws/>
./bin/fixSSLinMavenSite.sh: 26: cd: can't cd to target/site
Changed to site directory ...
sed: can't read *.html: No such file or directory
DONE - please verify before pushing.

Mime
View raw message