tamaya-commits mailing list archives

Site index · List index
Message view « Date » · « Thread »
Top « Date » · « Thread »
From Apache Jenkins Server <jenk...@builds.apache.org>
Subject Build failed in Jenkins: Tamaya-Site-Master #91
Date Mon, 25 Jul 2016 14:16:44 GMT
See <https://builds.apache.org/job/Tamaya-Site-Master/91/>

------------------------------------------
[...truncated 89900 lines...]
[INFO] Downloading: http://repository.apache.org/snapshots/org/apache/tamaya/tamaya-api/0.3-incubating-SNAPSHOT/maven-metadata.xml
[WARNING] Could not transfer metadata org.apache.tamaya:tamaya-api:0.3-incubating-SNAPSHOT/maven-metadata.xml
from/to Nexus (http://repository.apache.org/snapshots): Failed to transfer file: http://repository.apache.org/snapshots/org/apache/tamaya/tamaya-api/0.3-incubating-SNAPSHOT/maven-metadata.xml.
Return code is: 502 , ReasonPhrase:Proxy Error.
[INFO] Downloading: http://maven.vaadin.com/vaadin-addons/org/apache/tamaya/ext/tamaya-functions/0.3-incubating-SNAPSHOT/maven-metadata.xml
[INFO] Downloading: https://oss.sonatype.org/content/repositories/vaadin-snapshots/org/apache/tamaya/ext/tamaya-functions/0.3-incubating-SNAPSHOT/maven-metadata.xml
[INFO] Downloading: http://repository.apache.org/snapshots/org/apache/tamaya/ext/tamaya-functions/0.3-incubating-SNAPSHOT/maven-metadata.xml
[INFO] Downloaded: http://repository.apache.org/snapshots/org/apache/tamaya/ext/tamaya-functions/0.3-incubating-SNAPSHOT/maven-metadata.xml
(2 KB at 3.2 KB/sec)
[INFO] Downloading: http://maven.vaadin.com/vaadin-addons/org/apache/tamaya/tamaya-core/0.3-incubating-SNAPSHOT/maven-metadata.xml
[INFO] Downloading: https://oss.sonatype.org/content/repositories/vaadin-snapshots/org/apache/tamaya/tamaya-core/0.3-incubating-SNAPSHOT/maven-metadata.xml
[INFO] Downloading: http://repository.apache.org/snapshots/org/apache/tamaya/tamaya-core/0.3-incubating-SNAPSHOT/maven-metadata.xml
[WARNING] Could not transfer metadata org.apache.tamaya:tamaya-core:0.3-incubating-SNAPSHOT/maven-metadata.xml
from/to Nexus (http://repository.apache.org/snapshots): Failed to transfer file: http://repository.apache.org/snapshots/org/apache/tamaya/tamaya-core/0.3-incubating-SNAPSHOT/maven-metadata.xml.
Return code is: 502 , ReasonPhrase:Proxy Error.
[INFO] Downloading: http://maven.vaadin.com/vaadin-addons/org/apache/tamaya/ext/tamaya-spisupport/0.3-incubating-SNAPSHOT/maven-metadata.xml
[INFO] Downloading: http://repository.apache.org/snapshots/org/apache/tamaya/ext/tamaya-spisupport/0.3-incubating-SNAPSHOT/maven-metadata.xml
[INFO] Downloading: https://oss.sonatype.org/content/repositories/vaadin-snapshots/org/apache/tamaya/ext/tamaya-spisupport/0.3-incubating-SNAPSHOT/maven-metadata.xml
[INFO] Downloaded: http://repository.apache.org/snapshots/org/apache/tamaya/ext/tamaya-spisupport/0.3-incubating-SNAPSHOT/maven-metadata.xml
(2 KB at 3.2 KB/sec)
[INFO] Downloading: http://maven.vaadin.com/vaadin-addons/com/vaadin/vaadin-server/7.6.4/vaadin-server-7.6.4.pom
[INFO] Downloading: https://repo.maven.apache.org/maven2/com/vaadin/vaadin-server/7.6.4/vaadin-server-7.6.4.pom
[INFO] Downloaded: https://repo.maven.apache.org/maven2/com/vaadin/vaadin-server/7.6.4/vaadin-server-7.6.4.pom
(6 KB at 85.7 KB/sec)
[INFO] Downloading: http://maven.vaadin.com/vaadin-addons/com/vaadin/vaadin-sass-compiler/0.9.13/vaadin-sass-compiler-0.9.13.pom
[INFO] Downloading: https://repo.maven.apache.org/maven2/com/vaadin/vaadin-sass-compiler/0.9.13/vaadin-sass-compiler-0.9.13.pom
[INFO] Downloaded: https://repo.maven.apache.org/maven2/com/vaadin/vaadin-sass-compiler/0.9.13/vaadin-sass-compiler-0.9.13.pom
(12 KB at 205.1 KB/sec)
[INFO] Downloading: http://maven.vaadin.com/vaadin-addons/com/vaadin/external/flute/flute/1.3.0.gg2/flute-1.3.0.gg2.pom
[INFO] Downloading: https://repo.maven.apache.org/maven2/com/vaadin/external/flute/flute/1.3.0.gg2/flute-1.3.0.gg2.pom
[INFO] Downloaded: https://repo.maven.apache.org/maven2/com/vaadin/external/flute/flute/1.3.0.gg2/flute-1.3.0.gg2.pom
(3 KB at 44.5 KB/sec)
[INFO] Downloading: http://maven.vaadin.com/vaadin-addons/com/yahoo/platform/yui/yuicompressor/2.4.8/yuicompressor-2.4.8.pom
[INFO] Downloading: https://repo.maven.apache.org/maven2/com/yahoo/platform/yui/yuicompressor/2.4.8/yuicompressor-2.4.8.pom
[INFO] Downloaded: https://repo.maven.apache.org/maven2/com/yahoo/platform/yui/yuicompressor/2.4.8/yuicompressor-2.4.8.pom
(2 KB at 33.9 KB/sec)
[INFO] Downloading: http://maven.vaadin.com/vaadin-addons/com/vaadin/vaadin-shared/7.6.4/vaadin-shared-7.6.4.pom
[INFO] Downloading: https://repo.maven.apache.org/maven2/com/vaadin/vaadin-shared/7.6.4/vaadin-shared-7.6.4.pom
[INFO] Downloaded: https://repo.maven.apache.org/maven2/com/vaadin/vaadin-shared/7.6.4/vaadin-shared-7.6.4.pom
(5 KB at 55.3 KB/sec)
[INFO] Downloading: http://maven.vaadin.com/vaadin-addons/com/vaadin/external/streamhtmlparser/streamhtmlparser-jsilver/0.0.10.vaadin1/streamhtmlparser-jsilver-0.0.10.vaadin1.pom
[INFO] Downloading: https://repo.maven.apache.org/maven2/com/vaadin/external/streamhtmlparser/streamhtmlparser-jsilver/0.0.10.vaadin1/streamhtmlparser-jsilver-0.0.10.vaadin1.pom
[INFO] Downloaded: https://repo.maven.apache.org/maven2/com/vaadin/external/streamhtmlparser/streamhtmlparser-jsilver/0.0.10.vaadin1/streamhtmlparser-jsilver-0.0.10.vaadin1.pom
(3 KB at 52.3 KB/sec)
[INFO] Downloading: http://maven.vaadin.com/vaadin-addons/com/vaadin/external/google/guava/16.0.1.vaadin1/guava-16.0.1.vaadin1.pom
[INFO] Downloading: https://repo.maven.apache.org/maven2/com/vaadin/external/google/guava/16.0.1.vaadin1/guava-16.0.1.vaadin1.pom
[INFO] Downloaded: https://repo.maven.apache.org/maven2/com/vaadin/external/google/guava/16.0.1.vaadin1/guava-16.0.1.vaadin1.pom
(3 KB at 53.6 KB/sec)
[INFO] Downloading: http://maven.vaadin.com/vaadin-addons/com/vaadin/vaadin-push/7.6.4/vaadin-push-7.6.4.pom
[INFO] Downloading: https://repo.maven.apache.org/maven2/com/vaadin/vaadin-push/7.6.4/vaadin-push-7.6.4.pom
[INFO] Downloaded: https://repo.maven.apache.org/maven2/com/vaadin/vaadin-push/7.6.4/vaadin-push-7.6.4.pom
(4 KB at 69.1 KB/sec)
[INFO] Downloading: http://maven.vaadin.com/vaadin-addons/com/vaadin/external/atmosphere/atmosphere-runtime/2.2.7.vaadin1/atmosphere-runtime-2.2.7.vaadin1.pom
[INFO] Downloading: https://repo.maven.apache.org/maven2/com/vaadin/external/atmosphere/atmosphere-runtime/2.2.7.vaadin1/atmosphere-runtime-2.2.7.vaadin1.pom
[INFO] Downloaded: https://repo.maven.apache.org/maven2/com/vaadin/external/atmosphere/atmosphere-runtime/2.2.7.vaadin1/atmosphere-runtime-2.2.7.vaadin1.pom
(11 KB at 183.7 KB/sec)
[INFO] Downloading: http://maven.vaadin.com/vaadin-addons/com/vaadin/external/atmosphere/atmosphere-project/2.2.7.vaadin1/atmosphere-project-2.2.7.vaadin1.pom
[INFO] Downloading: https://repo.maven.apache.org/maven2/com/vaadin/external/atmosphere/atmosphere-project/2.2.7.vaadin1/atmosphere-project-2.2.7.vaadin1.pom
[INFO] Downloaded: https://repo.maven.apache.org/maven2/com/vaadin/external/atmosphere/atmosphere-project/2.2.7.vaadin1/atmosphere-project-2.2.7.vaadin1.pom
(22 KB at 376.0 KB/sec)
[INFO] Downloading: http://maven.vaadin.com/vaadin-addons/com/vaadin/external/slf4j/vaadin-slf4j-jdk14/1.6.1/vaadin-slf4j-jdk14-1.6.1.pom
[INFO] Downloading: https://repo.maven.apache.org/maven2/com/vaadin/external/slf4j/vaadin-slf4j-jdk14/1.6.1/vaadin-slf4j-jdk14-1.6.1.pom
[INFO] Downloaded: https://repo.maven.apache.org/maven2/com/vaadin/external/slf4j/vaadin-slf4j-jdk14/1.6.1/vaadin-slf4j-jdk14-1.6.1.pom
(4 KB at 59.5 KB/sec)
[INFO] Downloading: http://maven.vaadin.com/vaadin-addons/com/vaadin/vaadin-client-compiled/7.6.4/vaadin-client-compiled-7.6.4.pom
[INFO] Downloading: https://repo.maven.apache.org/maven2/com/vaadin/vaadin-client-compiled/7.6.4/vaadin-client-compiled-7.6.4.pom
[INFO] Downloaded: https://repo.maven.apache.org/maven2/com/vaadin/vaadin-client-compiled/7.6.4/vaadin-client-compiled-7.6.4.pom
(4 KB at 61.6 KB/sec)
[INFO] Downloading: http://maven.vaadin.com/vaadin-addons/com/vaadin/vaadin-themes/7.6.4/vaadin-themes-7.6.4.pom
[INFO] Downloading: https://repo.maven.apache.org/maven2/com/vaadin/vaadin-themes/7.6.4/vaadin-themes-7.6.4.pom
[INFO] Downloaded: https://repo.maven.apache.org/maven2/com/vaadin/vaadin-themes/7.6.4/vaadin-themes-7.6.4.pom
(4 KB at 58.2 KB/sec)
[INFO] Downloading: http://maven.vaadin.com/vaadin-addons/org/apache/tomcat/embed/tomcat-embed-core/7.0.57/tomcat-embed-core-7.0.57.pom
[INFO] Downloading: https://repo.maven.apache.org/maven2/org/apache/tomcat/embed/tomcat-embed-core/7.0.57/tomcat-embed-core-7.0.57.pom
[INFO] Downloaded: https://repo.maven.apache.org/maven2/org/apache/tomcat/embed/tomcat-embed-core/7.0.57/tomcat-embed-core-7.0.57.pom
(2 KB at 33.0 KB/sec)
[INFO] Downloading: http://maven.vaadin.com/vaadin-addons/org/apache/tomcat/embed/tomcat-embed-jasper/7.0.57/tomcat-embed-jasper-7.0.57.pom
[INFO] Downloading: https://repo.maven.apache.org/maven2/org/apache/tomcat/embed/tomcat-embed-jasper/7.0.57/tomcat-embed-jasper-7.0.57.pom
[INFO] Downloaded: https://repo.maven.apache.org/maven2/org/apache/tomcat/embed/tomcat-embed-jasper/7.0.57/tomcat-embed-jasper-7.0.57.pom
(2 KB at 33.7 KB/sec)
[INFO] Downloading: http://maven.vaadin.com/vaadin-addons/org/apache/tomcat/embed/tomcat-embed-el/7.0.57/tomcat-embed-el-7.0.57.pom
[INFO] Downloading: https://repo.maven.apache.org/maven2/org/apache/tomcat/embed/tomcat-embed-el/7.0.57/tomcat-embed-el-7.0.57.pom
[INFO] Downloaded: https://repo.maven.apache.org/maven2/org/apache/tomcat/embed/tomcat-embed-el/7.0.57/tomcat-embed-el-7.0.57.pom
(2 KB at 10.8 KB/sec)
[INFO] Downloading: http://maven.vaadin.com/vaadin-addons/org/apache/tomcat/embed/tomcat-embed-logging-juli/7.0.57/tomcat-embed-logging-juli-7.0.57.pom
[INFO] Downloading: https://repo.maven.apache.org/maven2/org/apache/tomcat/embed/tomcat-embed-logging-juli/7.0.57/tomcat-embed-logging-juli-7.0.57.pom
[INFO] Downloaded: https://repo.maven.apache.org/maven2/org/apache/tomcat/embed/tomcat-embed-logging-juli/7.0.57/tomcat-embed-logging-juli-7.0.57.pom
(2 KB at 23.8 KB/sec)
[WARNING] Failure to transfer org.apache.tamaya:tamaya-api:0.3-incubating-SNAPSHOT/maven-metadata.xml
from http://repository.apache.org/snapshots was cached in the local repository, resolution
will not be reattempted until the update interval of Nexus has elapsed or updates are forced.
Original error: Could not transfer metadata org.apache.tamaya:tamaya-api:0.3-incubating-SNAPSHOT/maven-metadata.xml
from/to Nexus (http://repository.apache.org/snapshots): Failed to transfer file: http://repository.apache.org/snapshots/org/apache/tamaya/tamaya-api/0.3-incubating-SNAPSHOT/maven-metadata.xml.
Return code is: 502 , ReasonPhrase:Proxy Error.
[INFO] Downloading: http://maven.vaadin.com/vaadin-addons/org/apache/tamaya/tamaya-api/0.3-incubating-SNAPSHOT/tamaya-api-0.3-incubating-SNAPSHOT.jar
[INFO] Downloading: http://maven.vaadin.com/vaadin-addons/com/vaadin/vaadin-server/7.6.4/vaadin-server-7.6.4.jar
[INFO] Downloading: http://maven.vaadin.com/vaadin-addons/com/vaadin/vaadin-sass-compiler/0.9.13/vaadin-sass-compiler-0.9.13.jar
[INFO] Downloading: http://maven.vaadin.com/vaadin-addons/com/vaadin/external/flute/flute/1.3.0.gg2/flute-1.3.0.gg2.jar
[INFO] Downloading: http://maven.vaadin.com/vaadin-addons/com/yahoo/platform/yui/yuicompressor/2.4.8/yuicompressor-2.4.8.jar
[INFO] Downloading: http://maven.vaadin.com/vaadin-addons/com/vaadin/vaadin-shared/7.6.4/vaadin-shared-7.6.4.jar
[INFO] Downloading: http://maven.vaadin.com/vaadin-addons/com/vaadin/external/streamhtmlparser/streamhtmlparser-jsilver/0.0.10.vaadin1/streamhtmlparser-jsilver-0.0.10.vaadin1.jar
[INFO] Downloading: http://maven.vaadin.com/vaadin-addons/com/vaadin/external/google/guava/16.0.1.vaadin1/guava-16.0.1.vaadin1.jar
[INFO] Downloading: http://maven.vaadin.com/vaadin-addons/org/jsoup/jsoup/1.8.3/jsoup-1.8.3.jar
[INFO] Downloading: http://maven.vaadin.com/vaadin-addons/com/vaadin/vaadin-push/7.6.4/vaadin-push-7.6.4.jar
[INFO] Downloading: http://maven.vaadin.com/vaadin-addons/com/vaadin/external/atmosphere/atmosphere-runtime/2.2.7.vaadin1/atmosphere-runtime-2.2.7.vaadin1.jar
[INFO] Downloading: http://maven.vaadin.com/vaadin-addons/com/vaadin/external/slf4j/vaadin-slf4j-jdk14/1.6.1/vaadin-slf4j-jdk14-1.6.1.jar
[INFO] Downloading: http://maven.vaadin.com/vaadin-addons/com/vaadin/vaadin-client-compiled/7.6.4/vaadin-client-compiled-7.6.4.jar
[INFO] Downloading: http://maven.vaadin.com/vaadin-addons/com/vaadin/vaadin-themes/7.6.4/vaadin-themes-7.6.4.jar
[INFO] Downloading: http://maven.vaadin.com/vaadin-addons/org/apache/tomcat/embed/tomcat-embed-core/7.0.57/tomcat-embed-core-7.0.57.jar
[INFO] Downloading: http://maven.vaadin.com/vaadin-addons/org/apache/tomcat/embed/tomcat-embed-jasper/7.0.57/tomcat-embed-jasper-7.0.57.jar
[INFO] Downloading: http://maven.vaadin.com/vaadin-addons/org/apache/tomcat/embed/tomcat-embed-el/7.0.57/tomcat-embed-el-7.0.57.jar
[INFO] Downloading: http://maven.vaadin.com/vaadin-addons/org/apache/tomcat/embed/tomcat-embed-logging-juli/7.0.57/tomcat-embed-logging-juli-7.0.57.jar
[INFO] Downloading: https://oss.sonatype.org/content/repositories/vaadin-snapshots/org/apache/tamaya/tamaya-api/0.3-incubating-SNAPSHOT/tamaya-api-0.3-incubating-SNAPSHOT.jar
[INFO] Downloading: http://repository.apache.org/snapshots/org/apache/tamaya/tamaya-api/0.3-incubating-SNAPSHOT/tamaya-api-0.3-incubating-SNAPSHOT.jar
[INFO] Downloading: http://repository.apache.org/snapshots/org/apache/tamaya/ext/tamaya-functions/0.3-incubating-SNAPSHOT/tamaya-functions-0.3-incubating-20160722.002802-106.jar
[INFO] Downloading: http://repository.apache.org/snapshots/org/apache/tamaya/ext/tamaya-spisupport/0.3-incubating-SNAPSHOT/tamaya-spisupport-0.3-incubating-20160722.002212-106.jar
[INFO] Downloaded: http://repository.apache.org/snapshots/org/apache/tamaya/ext/tamaya-spisupport/0.3-incubating-SNAPSHOT/tamaya-spisupport-0.3-incubating-20160722.002212-106.jar
(37 KB at 3.1 KB/sec)
[INFO] Downloaded: http://repository.apache.org/snapshots/org/apache/tamaya/ext/tamaya-functions/0.3-incubating-SNAPSHOT/tamaya-functions-0.3-incubating-20160722.002802-106.jar
(51 KB at 3.3 KB/sec)
[INFO] Downloading: https://repo.maven.apache.org/maven2/com/vaadin/vaadin-server/7.6.4/vaadin-server-7.6.4.jar
[INFO] Downloading: https://repo.maven.apache.org/maven2/com/vaadin/vaadin-sass-compiler/0.9.13/vaadin-sass-compiler-0.9.13.jar
[INFO] Downloading: https://repo.maven.apache.org/maven2/com/vaadin/external/flute/flute/1.3.0.gg2/flute-1.3.0.gg2.jar
[INFO] Downloading: https://repo.maven.apache.org/maven2/com/yahoo/platform/yui/yuicompressor/2.4.8/yuicompressor-2.4.8.jar
[INFO] Downloading: https://repo.maven.apache.org/maven2/com/vaadin/vaadin-shared/7.6.4/vaadin-shared-7.6.4.jar
[INFO] Downloaded: https://repo.maven.apache.org/maven2/com/vaadin/external/flute/flute/1.3.0.gg2/flute-1.3.0.gg2.jar
(78 KB at 335.9 KB/sec)
[INFO] Downloading: https://repo.maven.apache.org/maven2/com/vaadin/external/streamhtmlparser/streamhtmlparser-jsilver/0.0.10.vaadin1/streamhtmlparser-jsilver-0.0.10.vaadin1.jar
[INFO] Downloaded: https://repo.maven.apache.org/maven2/com/vaadin/vaadin-sass-compiler/0.9.13/vaadin-sass-compiler-0.9.13.jar
(521 KB at 2039.7 KB/sec)
[INFO] Downloading: https://repo.maven.apache.org/maven2/com/vaadin/external/google/guava/16.0.1.vaadin1/guava-16.0.1.vaadin1.jar
[INFO] Downloaded: https://repo.maven.apache.org/maven2/com/yahoo/platform/yui/yuicompressor/2.4.8/yuicompressor-2.4.8.jar
(770 KB at 2869.6 KB/sec)
[INFO] Downloading: https://repo.maven.apache.org/maven2/org/jsoup/jsoup/1.8.3/jsoup-1.8.3.jar
[INFO] Downloaded: https://repo.maven.apache.org/maven2/com/vaadin/external/streamhtmlparser/streamhtmlparser-jsilver/0.0.10.vaadin1/streamhtmlparser-jsilver-0.0.10.vaadin1.jar
(39 KB at 321.8 KB/sec)
[INFO] Downloading: https://repo.maven.apache.org/maven2/com/vaadin/vaadin-push/7.6.4/vaadin-push-7.6.4.jar
[INFO] Downloaded: https://repo.maven.apache.org/maven2/org/jsoup/jsoup/1.8.3/jsoup-1.8.3.jar
(308 KB at 1769.7 KB/sec)
[INFO] Downloading: https://repo.maven.apache.org/maven2/com/vaadin/external/atmosphere/atmosphere-runtime/2.2.7.vaadin1/atmosphere-runtime-2.2.7.vaadin1.jar
[INFO] Downloaded: https://repo.maven.apache.org/maven2/com/vaadin/vaadin-push/7.6.4/vaadin-push-7.6.4.jar
(393 KB at 1833.6 KB/sec)
[INFO] Downloading: https://repo.maven.apache.org/maven2/com/vaadin/external/slf4j/vaadin-slf4j-jdk14/1.6.1/vaadin-slf4j-jdk14-1.6.1.jar
[INFO] Downloaded: https://repo.maven.apache.org/maven2/com/vaadin/external/google/guava/16.0.1.vaadin1/guava-16.0.1.vaadin1.jar
(2253 KB at 8499.7 KB/sec)
[INFO] Downloading: https://repo.maven.apache.org/maven2/com/vaadin/vaadin-client-compiled/7.6.4/vaadin-client-compiled-7.6.4.jar
[INFO] Downloaded: https://repo.maven.apache.org/maven2/com/vaadin/external/atmosphere/atmosphere-runtime/2.2.7.vaadin1/atmosphere-runtime-2.2.7.vaadin1.jar
(756 KB at 2758.0 KB/sec)
[INFO] Downloading: https://repo.maven.apache.org/maven2/com/vaadin/vaadin-themes/7.6.4/vaadin-themes-7.6.4.jar
[INFO] Downloaded: https://repo.maven.apache.org/maven2/com/vaadin/external/slf4j/vaadin-slf4j-jdk14/1.6.1/vaadin-slf4j-jdk14-1.6.1.jar
(35 KB at 117.5 KB/sec)
[INFO] Downloading: https://repo.maven.apache.org/maven2/org/apache/tomcat/embed/tomcat-embed-core/7.0.57/tomcat-embed-core-7.0.57.jar
[INFO] Downloaded: https://repo.maven.apache.org/maven2/com/vaadin/vaadin-shared/7.6.4/vaadin-shared-7.6.4.jar
(2328 KB at 4672.8 KB/sec)
[INFO] Downloading: https://repo.maven.apache.org/maven2/org/apache/tomcat/embed/tomcat-embed-jasper/7.0.57/tomcat-embed-jasper-7.0.57.jar
[INFO] Downloaded: https://repo.maven.apache.org/maven2/com/vaadin/vaadin-client-compiled/7.6.4/vaadin-client-compiled-7.6.4.jar
(932 KB at 2395.6 KB/sec)
[INFO] Downloading: https://repo.maven.apache.org/maven2/org/apache/tomcat/embed/tomcat-embed-el/7.0.57/tomcat-embed-el-7.0.57.jar
[INFO] Downloaded: https://repo.maven.apache.org/maven2/com/vaadin/vaadin-server/7.6.4/vaadin-server-7.6.4.jar
(3387 KB at 5551.4 KB/sec)
[INFO] Downloading: https://repo.maven.apache.org/maven2/org/apache/tomcat/embed/tomcat-embed-logging-juli/7.0.57/tomcat-embed-logging-juli-7.0.57.jar
[INFO] Downloaded: https://repo.maven.apache.org/maven2/org/apache/tomcat/embed/tomcat-embed-jasper/7.0.57/tomcat-embed-jasper-7.0.57.jar
(671 KB at 1332.4 KB/sec)
[INFO] Downloaded: https://repo.maven.apache.org/maven2/org/apache/tomcat/embed/tomcat-embed-core/7.0.57/tomcat-embed-core-7.0.57.jar
(2537 KB at 5032.9 KB/sec)
[INFO] Downloaded: https://repo.maven.apache.org/maven2/org/apache/tomcat/embed/tomcat-embed-el/7.0.57/tomcat-embed-el-7.0.57.jar
(172 KB at 330.3 KB/sec)
[INFO] Downloaded: https://repo.maven.apache.org/maven2/org/apache/tomcat/embed/tomcat-embed-logging-juli/7.0.57/tomcat-embed-logging-juli-7.0.57.jar
(38 KB at 65.9 KB/sec)
[INFO] Downloaded: https://repo.maven.apache.org/maven2/com/vaadin/vaadin-themes/7.6.4/vaadin-themes-7.6.4.jar
(7442 KB at 11395.2 KB/sec)
[WARNING] Failed to notify spy hudson.maven.Maven3Builder$JenkinsEventSpy: null
[FINDBUGS] No report found for mojo site
[INFO] ------------------------------------------------------------------------
[INFO] Reactor Summary:
[INFO] 
[INFO] Apache Tamaya ...................................... FAILURE [ 46.622 s]
[INFO] Apache Tamaya Build Configuration .................. SKIPPED
[INFO] Apache Tamaya Code - all ........................... SKIPPED
[INFO] Apache Tamaya API .................................. SKIPPED
[INFO] Apache Tamaya Core Implementation .................. SKIPPED
[INFO] Apache Tamaya Extension Modules - all .............. SKIPPED
[INFO] Apache Tamaya Modules - Resource Services .......... SKIPPED
[INFO] Apache Tamaya Modules - Formats .................... SKIPPED
[INFO] Apache Tamaya Modules - Common Support Classes ..... SKIPPED
[INFO] Apache Tamaya Modules - JSON Support ............... SKIPPED
[INFO] Apache Tamaya Modules - Builder .................... SKIPPED
[INFO] Apache Tamaya Modules - Classloader Support ........ SKIPPED
[INFO] Apache Tamaya Modules - Collections Support ........ SKIPPED
[INFO] Apache Tamaya Modules - Common Functional Extensions SKIPPED
[INFO] Apache Tamaya Modules - UI ......................... SKIPPED
[INFO] Apache Tamaya Modules - Event and dynamic Update Extensions SKIPPED
[INFO] Apache Tamaya Modules - Adaptive Configuration Filtering SKIPPED
[INFO] Apache Tamaya Modules - Injection Support API ...... SKIPPED
[INFO] Apache Tamaya Modules - Resolver Services .......... SKIPPED
[INFO] Apache Tamaya Modules - Injection Support .......... SKIPPED
[INFO] Apache Tamaya Integration - all .................... SKIPPED
[INFO] Apache Tamaya Integration - Spring ................. SKIPPED
[INFO] Apache Tamaya Integration - CDI (Using SE Injection) SKIPPED
[INFO] Apache Tamaya Integration - CDI (Java EE) .......... SKIPPED
[INFO] Apache Tamaya Integration - OSGi Services :: Tamaya Config SKIPPED
[INFO] Apache Tamaya Integration - Apache Camel ........... SKIPPED
[INFO] Apache Tamaya Modules - Mutable Configuration Support SKIPPED
[INFO] Apache Tamaya Integration - etcd ................... SKIPPED
[INFO] Apache Tamaya Integration - consul ................. SKIPPED
[INFO] Apache Tamaya Modules - Java Management Extensions . SKIPPED
[INFO] Apache Tamaya Modules - Configuration Model Infrastructure SKIPPED
[INFO] Apache Tamaya Modules - Optional Configuration Backend SKIPPED
[INFO] Apache Tamaya Modules - YAML Support ............... SKIPPED
[INFO] Apache Tamaya Integration - Karaf Features ......... SKIPPED
[INFO] Apache Tamaya Modules - Server Extension ........... SKIPPED
[INFO] Apache Tamaya Documentation ........................ SKIPPED
[INFO] Apache Tamaya Example - all ........................ SKIPPED
[INFO] Apache Tamaya Example: Minimal Version ............. SKIPPED
[INFO] Apache Tamaya Example: Simple Property Source Version SKIPPED
[INFO] Apache Tamaya Example: Resource Location ........... SKIPPED
[INFO] Apache Tamaya Example: Value Resolution ............ SKIPPED
[INFO] Apache Tamaya Example: File Observer ............... SKIPPED
[INFO] Apache Tamaya Example: Configuration Injection ..... SKIPPED
[INFO] Apache Tamaya Example: Builder ..................... SKIPPED
[INFO] Apache Tamaya Example: Remote ...................... SKIPPED
[INFO] Apache Tamaya Example: Remote (Server) ............. SKIPPED
[INFO] Apache Tamaya Example: Remote (Client) ............. SKIPPED
[INFO] Apache Tamaya Distribution ......................... SKIPPED
[INFO] ------------------------------------------------------------------------
[INFO] BUILD FAILURE
[INFO] ------------------------------------------------------------------------
[INFO] Total time: 01:11 min
[INFO] Finished at: 2016-07-25T14:15:51+00:00
[INFO] Final Memory: 78M/710M
[INFO] ------------------------------------------------------------------------
[ERROR] Failed to execute goal org.apache.maven.plugins:maven-site-plugin:3.4:site (default-cli)
on project tamaya-all: failed to get report for org.apache.maven.plugins:maven-javadoc-plugin:
Failed to execute goal on project tamaya-ui: Could not resolve dependencies for project org.apache.tamaya.ext:tamaya-ui:jar:0.3-incubating-SNAPSHOT:
Could not find artifact org.apache.tamaya:tamaya-api:jar:0.3-incubating-SNAPSHOT in vaadin-addons
(http://maven.vaadin.com/vaadin-addons) -> [Help 1]
[ERROR] 
[ERROR] To see the full stack trace of the errors, re-run Maven with the -e switch.
[ERROR] Re-run Maven using the -X switch to enable full debug logging.
[ERROR] 
[ERROR] For more information about the errors and possible solutions, please read the following
articles:
[ERROR] [Help 1] http://cwiki.apache.org/confluence/display/MAVEN/MojoExecutionException
[JENKINS] Archiving <https://builds.apache.org/job/Tamaya-Site-Master/ws/modules/injection/pom.xml>
to org.apache.tamaya.ext/tamaya-injection/0.3-incubating-SNAPSHOT/tamaya-injection-0.3-incubating-SNAPSHOT.pom
[JENKINS] Archiving <https://builds.apache.org/job/Tamaya-Site-Master/ws/examples/6-fileobserver-example/pom.xml>
to org.apache.tamaya.examples/tamaya-example-fileobserver/0.3-incubating-SNAPSHOT/tamaya-example-fileobserver-0.3-incubating-SNAPSHOT.pom
[JENKINS] Archiving <https://builds.apache.org/job/Tamaya-Site-Master/ws/modules/integration/osgi/pom.xml>
to org.apache.tamaya.ext/tamaya-osgi/0.3-incubating-SNAPSHOT/tamaya-osgi-0.3-incubating-SNAPSHOT.pom
[JENKINS] Archiving <https://builds.apache.org/job/Tamaya-Site-Master/ws/examples/8-remote-example/pom.xml>
to org.apache.tamaya.examples/tamaya-example-remote/0.3-incubating-SNAPSHOT/tamaya-example-remote-0.3-incubating-SNAPSHOT.pom
[JENKINS] Archiving <https://builds.apache.org/job/Tamaya-Site-Master/ws/modules/json/pom.xml>
to org.apache.tamaya.ext/tamaya-json/0.3-incubating-SNAPSHOT/tamaya-json-0.3-incubating-SNAPSHOT.pom
[JENKINS] Archiving <https://builds.apache.org/job/Tamaya-Site-Master/ws/code/pom.xml>
to org.apache.tamaya/tamaya-code/0.3-incubating-SNAPSHOT/tamaya-code-0.3-incubating-SNAPSHOT.pom
[JENKINS] Archiving <https://builds.apache.org/job/Tamaya-Site-Master/ws/modules/mutable-config/pom.xml>
to org.apache.tamaya.ext/tamaya-mutable-config/0.3-incubating-SNAPSHOT/tamaya-mutable-config-0.3-incubating-SNAPSHOT.pom
[JENKINS] Archiving <https://builds.apache.org/job/Tamaya-Site-Master/ws/modules/integration/camel/pom.xml>
to org.apache.tamaya.ext/tamaya-camel/0.3-incubating-SNAPSHOT/tamaya-camel-0.3-incubating-SNAPSHOT.pom
[JENKINS] Archiving <https://builds.apache.org/job/Tamaya-Site-Master/ws/examples/7-builder-example/pom.xml>
to org.apache.tamaya.examples/tamaya-example-builder/0.3-incubating-SNAPSHOT/tamaya-example-builder-0.3-incubating-SNAPSHOT.pom
[JENKINS] Archiving <https://builds.apache.org/job/Tamaya-Site-Master/ws/modules/spi-support/pom.xml>
to org.apache.tamaya.ext/tamaya-spisupport/0.3-incubating-SNAPSHOT/tamaya-spisupport-0.3-incubating-SNAPSHOT.pom
[JENKINS] Archiving <https://builds.apache.org/job/Tamaya-Site-Master/ws/examples/1-minimal-example/pom.xml>
to org.apache.tamaya.examples/tamaya-example-minimal/0.3-incubating-SNAPSHOT/tamaya-example-minimal-0.3-incubating-SNAPSHOT.pom
[JENKINS] Archiving <https://builds.apache.org/job/Tamaya-Site-Master/ws/buildconfigurations/pom.xml>
to org.apache.tamaya/buildconfigurations/0.3-incubating-SNAPSHOT/buildconfigurations-0.3-incubating-SNAPSHOT.pom
[JENKINS] Archiving <https://builds.apache.org/job/Tamaya-Site-Master/ws/examples/3-resources-example/pom.xml>
to org.apache.tamaya.examples/tamaya-example-resources/0.3-incubating-SNAPSHOT/tamaya-example-resources-0.3-incubating-SNAPSHOT.pom
[JENKINS] Archiving <https://builds.apache.org/job/Tamaya-Site-Master/ws/modules/integration/karaf/pom.xml>
to org.apache.tamaya.ext/tamaya-karaf/0.3-incubating-SNAPSHOT/tamaya-karaf-0.3-incubating-SNAPSHOT.pom
[JENKINS] Archiving <https://builds.apache.org/job/Tamaya-Site-Master/ws/examples/8-remote-example/server/pom.xml>
to org.apache.tamaya.examples/tamaya-example-remote-server/0.3-incubating-SNAPSHOT/tamaya-example-remote-server-0.3-incubating-SNAPSHOT.pom
[JENKINS] Archiving <https://builds.apache.org/job/Tamaya-Site-Master/ws/modules/collections/pom.xml>
to org.apache.tamaya.ext/tamaya-collections/0.3-incubating-SNAPSHOT/tamaya-collections-0.3-incubating-SNAPSHOT.pom
[JENKINS] Archiving <https://builds.apache.org/job/Tamaya-Site-Master/ws/examples/pom.xml>
to org.apache.tamaya.ext/tamaya-examples/0.3-incubating-SNAPSHOT/tamaya-examples-0.3-incubating-SNAPSHOT.pom
[JENKINS] Archiving <https://builds.apache.org/job/Tamaya-Site-Master/ws/examples/8-remote-example/client/pom.xml>
to org.apache.tamaya.examples/tamaya-example-remote-client/0.3-incubating-SNAPSHOT/tamaya-example-remote-client-0.3-incubating-SNAPSHOT.pom
[JENKINS] Archiving <https://builds.apache.org/job/Tamaya-Site-Master/ws/modules/optional/pom.xml>
to org.apache.tamaya.ext/tamaya-optional/0.3-incubating-SNAPSHOT/tamaya-optional-0.3-incubating-SNAPSHOT.pom
[JENKINS] Archiving <https://builds.apache.org/job/Tamaya-Site-Master/ws/modules/filter/pom.xml>
to org.apache.tamaya.ext/tamaya-filter/0.3-incubating-SNAPSHOT/tamaya-filter-0.3-incubating-SNAPSHOT.pom
[JENKINS] Archiving <https://builds.apache.org/job/Tamaya-Site-Master/ws/modules/injection-api/pom.xml>
to org.apache.tamaya.ext/tamaya-injection-api/0.3-incubating-SNAPSHOT/tamaya-injection-api-0.3-incubating-SNAPSHOT.pom
[JENKINS] Archiving <https://builds.apache.org/job/Tamaya-Site-Master/ws/modules/integration/cdi-se/pom.xml>
to org.apache.tamaya.ext/tamaya-cdi-se/0.3-incubating-SNAPSHOT/tamaya-cdi-se-0.3-incubating-SNAPSHOT.pom
[JENKINS] Archiving <https://builds.apache.org/job/Tamaya-Site-Master/ws/examples/2-simple-propertysource-example/pom.xml>
to org.apache.tamaya.examples/tamaya-example-simple-propertysource/0.3-incubating-SNAPSHOT/tamaya-example-simple-propertysource-0.3-incubating-SNAPSHOT.pom
[JENKINS] Archiving <https://builds.apache.org/job/Tamaya-Site-Master/ws/modules/resources/pom.xml>
to org.apache.tamaya.ext/tamaya-resources/0.3-incubating-SNAPSHOT/tamaya-resources-0.3-incubating-SNAPSHOT.pom
[JENKINS] Archiving <https://builds.apache.org/job/Tamaya-Site-Master/ws/modules/model/pom.xml>
to org.apache.tamaya.ext/tamaya-model/0.3-incubating-SNAPSHOT/tamaya-model-0.3-incubating-SNAPSHOT.pom
[JENKINS] Archiving <https://builds.apache.org/job/Tamaya-Site-Master/ws/modules/management/pom.xml>
to org.apache.tamaya.ext/tamaya-management/0.3-incubating-SNAPSHOT/tamaya-management-0.3-incubating-SNAPSHOT.pom
[JENKINS] Archiving <https://builds.apache.org/job/Tamaya-Site-Master/ws/modules/integration/etcd/pom.xml>
to org.apache.tamaya.ext/tamaya-etcd/0.3-incubating-SNAPSHOT/tamaya-etcd-0.3-incubating-SNAPSHOT.pom
[JENKINS] Archiving <https://builds.apache.org/job/Tamaya-Site-Master/ws/modules/yaml/pom.xml>
to org.apache.tamaya.ext/tamaya-yaml/0.3-incubating-SNAPSHOT/tamaya-yaml-0.3-incubating-SNAPSHOT.pom
[JENKINS] Archiving <https://builds.apache.org/job/Tamaya-Site-Master/ws/distribution/pom.xml>
to org.apache.tamaya/tamaya-distribution/0.3-incubating-SNAPSHOT/tamaya-distribution-0.3-incubating-SNAPSHOT.pom
[JENKINS] Archiving <https://builds.apache.org/job/Tamaya-Site-Master/ws/modules/integration/spring/pom.xml>
to org.apache.tamaya.ext/tamaya-spring/0.3-incubating-SNAPSHOT/tamaya-spring-0.3-incubating-SNAPSHOT.pom
[JENKINS] Archiving <https://builds.apache.org/job/Tamaya-Site-Master/ws/examples/4-resolver-example/pom.xml>
to org.apache.tamaya.examples/tamaya-example-resolver/0.3-incubating-SNAPSHOT/tamaya-example-resolver-0.3-incubating-SNAPSHOT.pom
[JENKINS] Archiving <https://builds.apache.org/job/Tamaya-Site-Master/ws/modules/events/pom.xml>
to org.apache.tamaya.ext/tamaya-events/0.3-incubating-SNAPSHOT/tamaya-events-0.3-incubating-SNAPSHOT.pom
[JENKINS] Archiving <https://builds.apache.org/job/Tamaya-Site-Master/ws/modules/formats/pom.xml>
to org.apache.tamaya.ext/tamaya-formats/0.3-incubating-SNAPSHOT/tamaya-formats-0.3-incubating-SNAPSHOT.pom
[JENKINS] Archiving <https://builds.apache.org/job/Tamaya-Site-Master/ws/examples/5-injection-example/pom.xml>
to org.apache.tamaya.examples/tamaya-example-injection/0.3-incubating-SNAPSHOT/tamaya-example-injection-0.3-incubating-SNAPSHOT.pom
[JENKINS] Archiving <https://builds.apache.org/job/Tamaya-Site-Master/ws/modules/ui/pom.xml>
to org.apache.tamaya.ext/tamaya-ui/0.3-incubating-SNAPSHOT/tamaya-ui-0.3-incubating-SNAPSHOT.pom
[JENKINS] Archiving <https://builds.apache.org/job/Tamaya-Site-Master/ws/modules/pom.xml>
to org.apache.tamaya.ext/tamaya-extensions/0.3-incubating-SNAPSHOT/tamaya-extensions-0.3-incubating-SNAPSHOT.pom
[JENKINS] Archiving <https://builds.apache.org/job/Tamaya-Site-Master/ws/code/api/pom.xml>
to org.apache.tamaya/tamaya-api/0.3-incubating-SNAPSHOT/tamaya-api-0.3-incubating-SNAPSHOT.pom
[JENKINS] Archiving <https://builds.apache.org/job/Tamaya-Site-Master/ws/modules/server/pom.xml>
to org.apache.tamaya.ext/tamaya-server/0.3-incubating-SNAPSHOT/tamaya-server-0.3-incubating-SNAPSHOT.pom
[JENKINS] Archiving <https://builds.apache.org/job/Tamaya-Site-Master/ws/modules/classloader-support/pom.xml>
to org.apache.tamaya.ext/tamaya-classloader-support/0.3-incubating-SNAPSHOT/tamaya-classloader-support-0.3-incubating-SNAPSHOT.pom
[JENKINS] Archiving <https://builds.apache.org/job/Tamaya-Site-Master/ws/modules/functions/pom.xml>
to org.apache.tamaya.ext/tamaya-functions/0.3-incubating-SNAPSHOT/tamaya-functions-0.3-incubating-SNAPSHOT.pom
[JENKINS] Archiving <https://builds.apache.org/job/Tamaya-Site-Master/ws/modules/integration/consul/pom.xml>
to org.apache.tamaya.ext/tamaya-consul/0.3-incubating-SNAPSHOT/tamaya-consul-0.3-incubating-SNAPSHOT.pom
[JENKINS] Archiving <https://builds.apache.org/job/Tamaya-Site-Master/ws/modules/resolver/pom.xml>
to org.apache.tamaya.ext/tamaya-resolver/0.3-incubating-SNAPSHOT/tamaya-resolver-0.3-incubating-SNAPSHOT.pom
[JENKINS] Archiving <https://builds.apache.org/job/Tamaya-Site-Master/ws/modules/integration/pom.xml>
to org.apache.tamaya.ext/tamaya-integration/0.3-incubating-SNAPSHOT/tamaya-integration-0.3-incubating-SNAPSHOT.pom
[JENKINS] Archiving <https://builds.apache.org/job/Tamaya-Site-Master/ws/code/core/pom.xml>
to org.apache.tamaya/tamaya-core/0.3-incubating-SNAPSHOT/tamaya-core-0.3-incubating-SNAPSHOT.pom
[JENKINS] Archiving <https://builds.apache.org/job/Tamaya-Site-Master/ws/pom.xml> to
org.apache.tamaya/tamaya-all/0.3-incubating-SNAPSHOT/tamaya-all-0.3-incubating-SNAPSHOT.pom
Compressed 37.35 KB of artifacts by 85.7% relative to #90
[JENKINS] Archiving <https://builds.apache.org/job/Tamaya-Site-Master/ws/modules/builder/pom.xml>
to org.apache.tamaya.ext/tamaya-builder/0.3-incubating-SNAPSHOT/tamaya-builder-0.3-incubating-SNAPSHOT.pom
[JENKINS] Archiving <https://builds.apache.org/job/Tamaya-Site-Master/ws/modules/integration/cdi/pom.xml>
to org.apache.tamaya.ext/tamaya-cdi/0.3-incubating-SNAPSHOT/tamaya-cdi-0.3-incubating-SNAPSHOT.pom
[JENKINS] Archiving <https://builds.apache.org/job/Tamaya-Site-Master/ws/docs/pom.xml>
to org.apache.tamaya/tamaya-docs/0.3-incubating-SNAPSHOT/tamaya-docs-0.3-incubating-SNAPSHOT.pom
channel stopped
[Tamaya-Site-Master] $ /bin/bash -xe /tmp/hudson931068377417066631.sh
+ sh ./bin/fixSSLinMavenSite.sh jenkins
Will replace http with https in the generated maven site ...
Assuming script is run on CI - starting to replace ...
./bin/fixSSLinMavenSite.sh: 24: cd: can't cd to target/site
Changed to site directory ...
sed: can't read *.html: No such file or directory
DONE - please verify before pushing.

Mime
View raw message