tamaya-commits mailing list archives

Site index · List index
Message view « Date » · « Thread »
Top « Date » · « Thread »
From Apache Jenkins Server <jenk...@builds.apache.org>
Subject Build failed in Jenkins: Tamaya-Master-branch #545
Date Mon, 25 Apr 2016 18:42:04 GMT
See <https://builds.apache.org/job/Tamaya-Master-branch/545/changes>

Changes:

[plexus] Overhauled the release guide.

------------------------------------------
[...truncated 2998 lines...]
[INFO] >>> maven-source-plugin:2.4:jar (source-jar) > generate-sources @ tamaya-all
>>>
[INFO] 
[INFO] --- maven-enforcer-plugin:1.4:enforce (enforce-versions) @ tamaya-all ---
[INFO] 
[INFO] --- apache-rat-plugin:0.11:check (default) @ tamaya-all ---
[INFO] 57 implicit excludes (use -debug for more details).
[INFO] Exclude: **/*banner.txt
[INFO] Exclude: banner.txt
[INFO] Exclude: .git
[INFO] Exclude: derby.log
[INFO] Exclude: **/bootstrap-*
[INFO] Exclude: **/js/jquery-*
[INFO] Exclude: **/*.json
[INFO] Exclude: **/*.md
[INFO] Exclude: **/*.md.vm
[INFO] Exclude: src/site/asciidoc/temp-properties-files-for-site/attributes.adoc
[INFO] 47 resources included (use -debug for more details)
[INFO] Rat check: Summary of files. Unapproved: 0 unknown: 0 generated: 0 approved: 46 licence.
[WARNING] Failed to getClass for org.apache.maven.plugin.source.SourceJarMojo
[INFO] 
[INFO] <<< maven-source-plugin:2.4:jar (source-jar) < generate-sources @ tamaya-all
<<<
[INFO] 
[INFO] --- maven-source-plugin:2.4:jar (source-jar) @ tamaya-all ---
[INFO] Downloading: https://repo.maven.apache.org/maven2/org/codehaus/plexus/plexus-archiver/2.6.3/plexus-archiver-2.6.3.pom
[INFO] Downloaded: https://repo.maven.apache.org/maven2/org/codehaus/plexus/plexus-archiver/2.6.3/plexus-archiver-2.6.3.pom
(4 KB at 348.0 KB/sec)
[INFO] Downloading: https://repo.maven.apache.org/maven2/org/codehaus/plexus/plexus-utils/3.0.18/plexus-utils-3.0.18.pom
[INFO] Downloaded: https://repo.maven.apache.org/maven2/org/codehaus/plexus/plexus-utils/3.0.18/plexus-utils-3.0.18.pom
(4 KB at 301.4 KB/sec)
[INFO] Downloading: https://repo.maven.apache.org/maven2/org/codehaus/plexus/plexus-io/2.1.3/plexus-io-2.1.3.pom
[INFO] Downloaded: https://repo.maven.apache.org/maven2/org/codehaus/plexus/plexus-io/2.1.3/plexus-io-2.1.3.pom
(3 KB at 219.2 KB/sec)
[INFO] Downloading: https://repo.maven.apache.org/maven2/org/apache/commons/commons-compress/1.8.1/commons-compress-1.8.1.pom
[INFO] Downloaded: https://repo.maven.apache.org/maven2/org/apache/commons/commons-compress/1.8.1/commons-compress-1.8.1.pom
(12 KB at 1116.4 KB/sec)
[INFO] Downloading: https://repo.maven.apache.org/maven2/org/apache/commons/commons-parent/33/commons-parent-33.pom
[INFO] Downloaded: https://repo.maven.apache.org/maven2/org/apache/commons/commons-parent/33/commons-parent-33.pom
(52 KB at 4713.1 KB/sec)
[INFO] Downloading: https://repo.maven.apache.org/maven2/org/apache/maven/maven-core/2.0.6/maven-core-2.0.6.jar
[INFO] Downloading: https://repo.maven.apache.org/maven2/org/apache/maven/maven-plugin-parameter-documenter/2.0.6/maven-plugin-parameter-documenter-2.0.6.jar
[INFO] Downloading: https://repo.maven.apache.org/maven2/org/apache/maven/maven-plugin-descriptor/2.0.6/maven-plugin-descriptor-2.0.6.jar
[INFO] Downloading: https://repo.maven.apache.org/maven2/org/apache/maven/maven-error-diagnostics/2.0.6/maven-error-diagnostics-2.0.6.jar
[INFO] Downloading: https://repo.maven.apache.org/maven2/org/codehaus/plexus/plexus-archiver/2.6.3/plexus-archiver-2.6.3.jar
[INFO] Downloaded: https://repo.maven.apache.org/maven2/org/apache/maven/maven-error-diagnostics/2.0.6/maven-error-diagnostics-2.0.6.jar
(14 KB at 830.8 KB/sec)
[INFO] Downloading: https://repo.maven.apache.org/maven2/org/codehaus/plexus/plexus-io/2.1.3/plexus-io-2.1.3.jar
[INFO] Downloaded: https://repo.maven.apache.org/maven2/org/apache/maven/maven-plugin-parameter-documenter/2.0.6/maven-plugin-parameter-documenter-2.0.6.jar
(21 KB at 1192.3 KB/sec)
[INFO] Downloading: https://repo.maven.apache.org/maven2/org/apache/commons/commons-compress/1.8.1/commons-compress-1.8.1.jar
[INFO] Downloaded: https://repo.maven.apache.org/maven2/org/apache/maven/maven-core/2.0.6/maven-core-2.0.6.jar
(149 KB at 7792.8 KB/sec)
[INFO] Downloaded: https://repo.maven.apache.org/maven2/org/apache/maven/maven-plugin-descriptor/2.0.6/maven-plugin-descriptor-2.0.6.jar
(37 KB at 2000.4 KB/sec)
[INFO] Downloading: https://repo.maven.apache.org/maven2/org/codehaus/plexus/plexus-utils/3.0.18/plexus-utils-3.0.18.jar
[INFO] Downloaded: https://repo.maven.apache.org/maven2/org/codehaus/plexus/plexus-archiver/2.6.3/plexus-archiver-2.6.3.jar
(129 KB at 5830.5 KB/sec)
[INFO] Downloaded: https://repo.maven.apache.org/maven2/org/codehaus/plexus/plexus-io/2.1.3/plexus-io-2.1.3.jar
(65 KB at 2163.0 KB/sec)
[INFO] Downloaded: https://repo.maven.apache.org/maven2/org/codehaus/plexus/plexus-utils/3.0.18/plexus-utils-3.0.18.jar
(238 KB at 7910.2 KB/sec)
[INFO] Downloaded: https://repo.maven.apache.org/maven2/org/apache/commons/commons-compress/1.8.1/commons-compress-1.8.1.jar
(357 KB at 9916.2 KB/sec)
[INFO] 
[INFO] --- maven-failsafe-plugin:2.18.1:integration-test (default) @ tamaya-all ---
[INFO] No tests to run.
[JENKINS] Recording test results
[INFO] 
[INFO] --- maven-failsafe-plugin:2.18.1:verify (default) @ tamaya-all ---
[INFO] No tests to run.
[JENKINS] Recording test results[INFO] 
[INFO] --- maven-install-plugin:2.5.2:install (default-install) @ tamaya-all ---

[INFO] Installing <https://builds.apache.org/job/Tamaya-Master-branch/ws/pom.xml> to
/home/jenkins/jenkins-slave/maven-repositories/0/org/apache/tamaya/tamaya-all/0.3-incubating-SNAPSHOT/tamaya-all-0.3-incubating-SNAPSHOT.pom
[INFO] Installing <https://builds.apache.org/job/Tamaya-Master-branch/ws/target/feature/feature.xml>
to /home/jenkins/jenkins-slave/maven-repositories/0/org/apache/tamaya/tamaya-all/0.3-incubating-SNAPSHOT/tamaya-all-0.3-incubating-SNAPSHOT-features.xml
[INFO] Installing <https://builds.apache.org/job/Tamaya-Master-branch/ws/target/tamaya-all-0.3-incubating-SNAPSHOT-site.xml>
to /home/jenkins/jenkins-slave/maven-repositories/0/org/apache/tamaya/tamaya-all/0.3-incubating-SNAPSHOT/tamaya-all-0.3-incubating-SNAPSHOT-site.xml
[INFO] 
[INFO] --- maven-enforcer-plugin:1.4:enforce (enforce-versions) @ tamaya-all ---
[INFO] 
[INFO] --- apache-rat-plugin:0.11:check (default) @ tamaya-all ---
[INFO] 57 implicit excludes (use -debug for more details).
[INFO] Exclude: **/*banner.txt
[INFO] Exclude: banner.txt
[INFO] Exclude: .git
[INFO] Exclude: derby.log
[INFO] Exclude: **/bootstrap-*
[INFO] Exclude: **/js/jquery-*
[INFO] Exclude: **/*.json
[INFO] Exclude: **/*.md
[INFO] Exclude: **/*.md.vm
[INFO] Exclude: src/site/asciidoc/temp-properties-files-for-site/attributes.adoc
[INFO] 47 resources included (use -debug for more details)
[INFO] Rat check: Summary of files. Unapproved: 0 unknown: 0 generated: 0 approved: 46 licence.
[INFO] 
[INFO] --- maven-remote-resources-plugin:1.5:process (default) @ tamaya-all ---
[INFO] 
[INFO] --- karaf-maven-plugin:4.0.3:features-generate-descriptor (generate) @ tamaya-all ---
[INFO] Generating feature descriptor file <https://builds.apache.org/job/Tamaya-Master-branch/ws/target/feature/feature.xml>
[INFO] ...done!
[INFO] 
[INFO] --- maven-site-plugin:3.4:attach-descriptor (attach-descriptor) @ tamaya-all ---
[INFO] 
[INFO] --- maven-javadoc-plugin:2.9.1:jar (attach-javadocs) @ tamaya-all ---
[INFO] Not executing Javadoc as the project is not a Java classpath-capable package
[INFO] 
[INFO] >>> maven-source-plugin:2.4:jar (source-jar) > generate-sources @ tamaya-all
>>>
[INFO] 
[INFO] --- maven-enforcer-plugin:1.4:enforce (enforce-versions) @ tamaya-all ---
[INFO] 
[INFO] --- apache-rat-plugin:0.11:check (default) @ tamaya-all ---
[INFO] 57 implicit excludes (use -debug for more details).
[INFO] Exclude: **/*banner.txt
[INFO] Exclude: banner.txt
[INFO] Exclude: .git
[INFO] Exclude: derby.log
[INFO] Exclude: **/bootstrap-*
[INFO] Exclude: **/js/jquery-*
[INFO] Exclude: **/*.json
[INFO] Exclude: **/*.md
[INFO] Exclude: **/*.md.vm
[INFO] Exclude: src/site/asciidoc/temp-properties-files-for-site/attributes.adoc
[INFO] 47 resources included (use -debug for more details)
[INFO] Rat check: Summary of files. Unapproved: 0 unknown: 0 generated: 0 approved: 46 licence.
[WARNING] Failed to getClass for org.apache.maven.plugin.source.SourceJarMojo
[INFO] 
[INFO] <<< maven-source-plugin:2.4:jar (source-jar) < generate-sources @ tamaya-all
<<<
[INFO] 
[INFO] --- maven-source-plugin:2.4:jar (source-jar) @ tamaya-all ---
[INFO] 
[INFO] --- maven-failsafe-plugin:2.18.1:integration-test (default) @ tamaya-all ---
[INFO] No tests to run.
[INFO] Skipping execution of surefire because it has already been run for this configuration
[JENKINS] Recording test results
[INFO] 
[INFO] --- maven-failsafe-plugin:2.18.1:verify (default) @ tamaya-all ---
[INFO] No tests to run.
[JENKINS] Recording test results
[INFO] 
[INFO] --- maven-install-plugin:2.5.2:install (default-install) @ tamaya-all ---
[INFO] Installing <https://builds.apache.org/job/Tamaya-Master-branch/ws/pom.xml> to
/home/jenkins/jenkins-slave/maven-repositories/0/org/apache/tamaya/tamaya-all/0.3-incubating-SNAPSHOT/tamaya-all-0.3-incubating-SNAPSHOT.pom
[INFO] Installing <https://builds.apache.org/job/Tamaya-Master-branch/ws/target/feature/feature.xml>
to /home/jenkins/jenkins-slave/maven-repositories/0/org/apache/tamaya/tamaya-all/0.3-incubating-SNAPSHOT/tamaya-all-0.3-incubating-SNAPSHOT-features.xml
[INFO] Installing <https://builds.apache.org/job/Tamaya-Master-branch/ws/target/tamaya-all-0.3-incubating-SNAPSHOT-site.xml>
to /home/jenkins/jenkins-slave/maven-repositories/0/org/apache/tamaya/tamaya-all/0.3-incubating-SNAPSHOT/tamaya-all-0.3-incubating-SNAPSHOT-site.xml
[INFO] Installing <https://builds.apache.org/job/Tamaya-Master-branch/ws/target/feature/feature.xml>
to /home/jenkins/jenkins-slave/maven-repositories/0/org/apache/tamaya/tamaya-all/0.3-incubating-SNAPSHOT/tamaya-all-0.3-incubating-SNAPSHOT-features.xml
[INFO] Installing <https://builds.apache.org/job/Tamaya-Master-branch/ws/target/tamaya-all-0.3-incubating-SNAPSHOT-site.xml>
to /home/jenkins/jenkins-slave/maven-repositories/0/org/apache/tamaya/tamaya-all/0.3-incubating-SNAPSHOT/tamaya-all-0.3-incubating-SNAPSHOT-site.xml
[INFO] 
[INFO] --- maven-deploy-plugin:2.8.2:deploy (default-deploy) @ tamaya-all ---
[INFO] Downloading: https://repository.apache.org/content/repositories/snapshots/org/apache/tamaya/tamaya-all/0.3-incubating-SNAPSHOT/maven-metadata.xml
[INFO] Downloaded: https://repository.apache.org/content/repositories/snapshots/org/apache/tamaya/tamaya-all/0.3-incubating-SNAPSHOT/maven-metadata.xml
(2 KB at 0.7 KB/sec)
[INFO] Uploading: https://repository.apache.org/content/repositories/snapshots/org/apache/tamaya/tamaya-all/0.3-incubating-SNAPSHOT/tamaya-all-0.3-incubating-20160425.184114-11.pom
[INFO] ------------------------------------------------------------------------
[INFO] Reactor Summary:
[INFO] 
[INFO] Apache Tamaya ...................................... FAILURE [ 40.761 s]
[INFO] Apache Tamaya Build Configuration .................. SKIPPED
[INFO] Apache Tamaya Code - all ........................... SKIPPED
[INFO] Apache Tamaya API .................................. SKIPPED
[INFO] Apache Tamaya Core Implementation .................. SKIPPED
[INFO] Apache Tamaya Extension Modules - all .............. SKIPPED
[INFO] Apache Tamaya Modules - Resource Services .......... SKIPPED
[INFO] Apache Tamaya Modules - Formats .................... SKIPPED
[INFO] Apache Tamaya Modules - Common Support Classes ..... SKIPPED
[INFO] Apache Tamaya Modules - JSON Support ............... SKIPPED
[INFO] Apache Tamaya Modules - Builder .................... SKIPPED
[INFO] Apache Tamaya Modules - Classloader Support ........ SKIPPED
[INFO] Apache Tamaya Modules - Collections Support ........ SKIPPED
[INFO] Apache Tamaya Modules - Common Functional Extensions SKIPPED
[INFO] Apache Tamaya Modules - UI ......................... SKIPPED
[INFO] Apache Tamaya Modules - Event and dynamic Update Extensions SKIPPED
[INFO] Apache Tamaya Modules - Adaptive Configuration Filtering SKIPPED
[INFO] Apache Tamaya Modules - Injection Support API ...... SKIPPED
[INFO] Apache Tamaya Modules - Resolver Services .......... SKIPPED
[INFO] Apache Tamaya Modules - Injection Support .......... SKIPPED
[INFO] Apache Tamaya Integration - all .................... SKIPPED
[INFO] Apache Tamaya Integration - Spring ................. SKIPPED
[INFO] Apache Tamaya Integration - CDI (Using SE Injection) SKIPPED
[INFO] Apache Tamaya Integration - CDI (Java EE) .......... SKIPPED
[INFO] Apache Tamaya Integration - OSGi Services :: Tamaya Config SKIPPED
[INFO] Apache Tamaya Integration - Apache Camel ........... SKIPPED
[INFO] Apache Tamaya Modules - Mutable Configuration Support SKIPPED
[INFO] Apache Tamaya Integration - etcd ................... SKIPPED
[INFO] Apache Tamaya Integration - consul ................. SKIPPED
[INFO] Apache Tamaya Modules - Java Management Extensions . SKIPPED
[INFO] Apache Tamaya Modules - Configuration Model Infrastructure SKIPPED
[INFO] Apache Tamaya Modules - Optional Configuration Backend SKIPPED
[INFO] Apache Tamaya Modules - Server Extension ........... SKIPPED
[INFO] Apache Tamaya Modules - YAML Support ............... SKIPPED
[INFO] Apache Tamaya Documentation ........................ SKIPPED
[INFO] Apache Tamaya Example - all ........................ SKIPPED
[INFO] Apache Tamaya Example: Minimal Version ............. SKIPPED
[INFO] Apache Tamaya Example: Simple Property Source Version SKIPPED
[INFO] Apache Tamaya Example: Resource Location ........... SKIPPED
[INFO] Apache Tamaya Example: Value Resolution ............ SKIPPED
[INFO] Apache Tamaya Example: File Observer ............... SKIPPED
[INFO] Apache Tamaya Example: Configuration Injection ..... SKIPPED
[INFO] Apache Tamaya Example: Builder ..................... SKIPPED
[INFO] Apache Tamaya Example: Remote ...................... SKIPPED
[INFO] Apache Tamaya Example: Remote (Server) ............. SKIPPED
[INFO] Apache Tamaya Example: Remote (Client) ............. SKIPPED
[INFO] Apache Tamaya Distribution ......................... SKIPPED
[INFO] ------------------------------------------------------------------------
[INFO] BUILD FAILURE
[INFO] ------------------------------------------------------------------------
[INFO] Total time: 01:08 min
[INFO] Finished at: 2016-04-25T18:41:35+00:00
[INFO] Final Memory: 60M/718M
[INFO] ------------------------------------------------------------------------
[ERROR] Failed to execute goal org.apache.maven.plugins:maven-deploy-plugin:2.8.2:deploy (default-deploy)
on project tamaya-all: Failed to deploy artifacts: Could not transfer artifact org.apache.tamaya:tamaya-all:pom:0.3-incubating-20160425.184114-11
from/to apache.snapshots.https (https://repository.apache.org/content/repositories/snapshots):
Failed to transfer file: https://repository.apache.org/content/repositories/snapshots/org/apache/tamaya/tamaya-all/0.3-incubating-SNAPSHOT/tamaya-all-0.3-incubating-20160425.184114-11.pom.
Return code is: 401, ReasonPhrase: Unauthorized. -> [Help 1]
[ERROR] 
[ERROR] To see the full stack trace of the errors, re-run Maven with the -e switch.
[ERROR] Re-run Maven using the -X switch to enable full debug logging.
[ERROR] 
[ERROR] For more information about the errors and possible solutions, please read the following
articles:
[ERROR] [Help 1] http://cwiki.apache.org/confluence/display/MAVEN/MojoExecutionException
[JENKINS] Archiving <https://builds.apache.org/job/Tamaya-Master-branch/ws/modules/injection/pom.xml>
to org.apache.tamaya.ext/tamaya-injection/0.3-incubating-SNAPSHOT/tamaya-injection-0.3-incubating-SNAPSHOT.pom
[JENKINS] Archiving <https://builds.apache.org/job/Tamaya-Master-branch/ws/examples/6-fileobserver-example/pom.xml>
to org.apache.tamaya.examples/tamaya-example-fileobserver/0.3-incubating-SNAPSHOT/tamaya-example-fileobserver-0.3-incubating-SNAPSHOT.pom
[JENKINS] Archiving <https://builds.apache.org/job/Tamaya-Master-branch/ws/modules/integration/osgi/pom.xml>
to org.apache.tamaya.ext/tamaya-osgi/0.3-incubating-SNAPSHOT/tamaya-osgi-0.3-incubating-SNAPSHOT.pom
[JENKINS] Archiving <https://builds.apache.org/job/Tamaya-Master-branch/ws/examples/8-remote-example/pom.xml>
to org.apache.tamaya.examples/tamaya-example-remote/0.3-incubating-SNAPSHOT/tamaya-example-remote-0.3-incubating-SNAPSHOT.pom
[JENKINS] Archiving <https://builds.apache.org/job/Tamaya-Master-branch/ws/code/pom.xml>
to org.apache.tamaya/tamaya-code/0.3-incubating-SNAPSHOT/tamaya-code-0.3-incubating-SNAPSHOT.pom
[JENKINS] Archiving <https://builds.apache.org/job/Tamaya-Master-branch/ws/modules/json/pom.xml>
to org.apache.tamaya.ext/tamaya-json/0.3-incubating-SNAPSHOT/tamaya-json-0.3-incubating-SNAPSHOT.pom
[JENKINS] Archiving <https://builds.apache.org/job/Tamaya-Master-branch/ws/modules/mutable-config/pom.xml>
to org.apache.tamaya.ext/tamaya-mutable-config/0.3-incubating-SNAPSHOT/tamaya-mutable-config-0.3-incubating-SNAPSHOT.pom
[JENKINS] Archiving <https://builds.apache.org/job/Tamaya-Master-branch/ws/modules/integration/camel/pom.xml>
to org.apache.tamaya.ext/tamaya-camel/0.3-incubating-SNAPSHOT/tamaya-camel-0.3-incubating-SNAPSHOT.pom
[JENKINS] Archiving <https://builds.apache.org/job/Tamaya-Master-branch/ws/examples/7-builder-example/pom.xml>
to org.apache.tamaya.examples/tamaya-example-builder/0.3-incubating-SNAPSHOT/tamaya-example-builder-0.3-incubating-SNAPSHOT.pom
[JENKINS] Archiving <https://builds.apache.org/job/Tamaya-Master-branch/ws/modules/spi-support/pom.xml>
to org.apache.tamaya.ext/tamaya-spisupport/0.3-incubating-SNAPSHOT/tamaya-spisupport-0.3-incubating-SNAPSHOT.pom
[JENKINS] Archiving <https://builds.apache.org/job/Tamaya-Master-branch/ws/examples/1-minimal-example/pom.xml>
to org.apache.tamaya.examples/tamaya-example-minimal/0.3-incubating-SNAPSHOT/tamaya-example-minimal-0.3-incubating-SNAPSHOT.pom
[JENKINS] Archiving <https://builds.apache.org/job/Tamaya-Master-branch/ws/buildconfigurations/pom.xml>
to org.apache.tamaya/buildconfigurations/0.3-incubating-SNAPSHOT/buildconfigurations-0.3-incubating-SNAPSHOT.pom
[JENKINS] Archiving <https://builds.apache.org/job/Tamaya-Master-branch/ws/examples/3-resources-example/pom.xml>
to org.apache.tamaya.examples/tamaya-example-resources/0.3-incubating-SNAPSHOT/tamaya-example-resources-0.3-incubating-SNAPSHOT.pom
[JENKINS] Archiving <https://builds.apache.org/job/Tamaya-Master-branch/ws/examples/8-remote-example/server/pom.xml>
to org.apache.tamaya.examples/tamaya-example-remote-server/0.3-incubating-SNAPSHOT/tamaya-example-remote-server-0.3-incubating-SNAPSHOT.pom
[JENKINS] Archiving <https://builds.apache.org/job/Tamaya-Master-branch/ws/modules/collections/pom.xml>
to org.apache.tamaya.ext/tamaya-collections/0.3-incubating-SNAPSHOT/tamaya-collections-0.3-incubating-SNAPSHOT.pom
[JENKINS] Archiving <https://builds.apache.org/job/Tamaya-Master-branch/ws/examples/pom.xml>
to org.apache.tamaya.ext/tamaya-examples/0.3-incubating-SNAPSHOT/tamaya-examples-0.3-incubating-SNAPSHOT.pom
[JENKINS] Archiving <https://builds.apache.org/job/Tamaya-Master-branch/ws/examples/8-remote-example/client/pom.xml>
to org.apache.tamaya.examples/tamaya-example-remote-client/0.3-incubating-SNAPSHOT/tamaya-example-remote-client-0.3-incubating-SNAPSHOT.pom
[JENKINS] Archiving <https://builds.apache.org/job/Tamaya-Master-branch/ws/modules/optional/pom.xml>
to org.apache.tamaya.ext/tamaya-optional/0.3-incubating-SNAPSHOT/tamaya-optional-0.3-incubating-SNAPSHOT.pom
[JENKINS] Archiving <https://builds.apache.org/job/Tamaya-Master-branch/ws/modules/filter/pom.xml>
to org.apache.tamaya.ext/tamaya-filter/0.3-incubating-SNAPSHOT/tamaya-filter-0.3-incubating-SNAPSHOT.pom
[JENKINS] Archiving <https://builds.apache.org/job/Tamaya-Master-branch/ws/modules/injection-api/pom.xml>
to org.apache.tamaya.ext/tamaya-injection-api/0.3-incubating-SNAPSHOT/tamaya-injection-api-0.3-incubating-SNAPSHOT.pom
[JENKINS] Archiving <https://builds.apache.org/job/Tamaya-Master-branch/ws/modules/integration/cdi-se/pom.xml>
to org.apache.tamaya.ext/tamaya-cdi-se/0.3-incubating-SNAPSHOT/tamaya-cdi-se-0.3-incubating-SNAPSHOT.pom
[JENKINS] Archiving <https://builds.apache.org/job/Tamaya-Master-branch/ws/examples/2-simple-propertysource-example/pom.xml>
to org.apache.tamaya.examples/tamaya-example-simple-propertysource/0.3-incubating-SNAPSHOT/tamaya-example-simple-propertysource-0.3-incubating-SNAPSHOT.pom
[JENKINS] Archiving <https://builds.apache.org/job/Tamaya-Master-branch/ws/modules/resources/pom.xml>
to org.apache.tamaya.ext/tamaya-resources/0.3-incubating-SNAPSHOT/tamaya-resources-0.3-incubating-SNAPSHOT.pom
[JENKINS] Archiving <https://builds.apache.org/job/Tamaya-Master-branch/ws/modules/model/pom.xml>
to org.apache.tamaya.ext/tamaya-model/0.3-incubating-SNAPSHOT/tamaya-model-0.3-incubating-SNAPSHOT.pom
[JENKINS] Archiving <https://builds.apache.org/job/Tamaya-Master-branch/ws/modules/management/pom.xml>
to org.apache.tamaya.ext/tamaya-management/0.3-incubating-SNAPSHOT/tamaya-management-0.3-incubating-SNAPSHOT.pom
[JENKINS] Archiving <https://builds.apache.org/job/Tamaya-Master-branch/ws/modules/integration/etcd/pom.xml>
to org.apache.tamaya.ext/tamaya-etcd/0.3-incubating-SNAPSHOT/tamaya-etcd-0.3-incubating-SNAPSHOT.pom
[JENKINS] Archiving <https://builds.apache.org/job/Tamaya-Master-branch/ws/modules/yaml/pom.xml>
to org.apache.tamaya.ext/tamaya-yaml/0.3-incubating-SNAPSHOT/tamaya-yaml-0.3-incubating-SNAPSHOT.pom
[JENKINS] Archiving <https://builds.apache.org/job/Tamaya-Master-branch/ws/distribution/pom.xml>
to org.apache.tamaya/tamaya-distribution/0.3-incubating-SNAPSHOT/tamaya-distribution-0.3-incubating-SNAPSHOT.pom
[JENKINS] Archiving <https://builds.apache.org/job/Tamaya-Master-branch/ws/modules/integration/spring/pom.xml>
to org.apache.tamaya.ext/tamaya-spring/0.3-incubating-SNAPSHOT/tamaya-spring-0.3-incubating-SNAPSHOT.pom
[JENKINS] Archiving <https://builds.apache.org/job/Tamaya-Master-branch/ws/examples/4-resolver-example/pom.xml>
to org.apache.tamaya.examples/tamaya-example-resolver/0.3-incubating-SNAPSHOT/tamaya-example-resolver-0.3-incubating-SNAPSHOT.pom
[JENKINS] Archiving <https://builds.apache.org/job/Tamaya-Master-branch/ws/modules/events/pom.xml>
to org.apache.tamaya.ext/tamaya-events/0.3-incubating-SNAPSHOT/tamaya-events-0.3-incubating-SNAPSHOT.pom
[JENKINS] Archiving <https://builds.apache.org/job/Tamaya-Master-branch/ws/modules/formats/pom.xml>
to org.apache.tamaya.ext/tamaya-formats/0.3-incubating-SNAPSHOT/tamaya-formats-0.3-incubating-SNAPSHOT.pom
[JENKINS] Archiving <https://builds.apache.org/job/Tamaya-Master-branch/ws/examples/5-injection-example/pom.xml>
to org.apache.tamaya.examples/tamaya-example-injection/0.3-incubating-SNAPSHOT/tamaya-example-injection-0.3-incubating-SNAPSHOT.pom
[JENKINS] Archiving <https://builds.apache.org/job/Tamaya-Master-branch/ws/modules/ui/pom.xml>
to org.apache.tamaya.ext/tamaya-ui/0.3-incubating-SNAPSHOT/tamaya-ui-0.3-incubating-SNAPSHOT.pom
[JENKINS] Archiving <https://builds.apache.org/job/Tamaya-Master-branch/ws/modules/pom.xml>
to org.apache.tamaya.ext/tamaya-extensions/0.3-incubating-SNAPSHOT/tamaya-extensions-0.3-incubating-SNAPSHOT.pom
[JENKINS] Archiving <https://builds.apache.org/job/Tamaya-Master-branch/ws/code/api/pom.xml>
to org.apache.tamaya/tamaya-api/0.3-incubating-SNAPSHOT/tamaya-api-0.3-incubating-SNAPSHOT.pom
[JENKINS] Archiving <https://builds.apache.org/job/Tamaya-Master-branch/ws/modules/server/pom.xml>
to org.apache.tamaya.ext/tamaya-server/0.3-incubating-SNAPSHOT/tamaya-server-0.3-incubating-SNAPSHOT.pom
[JENKINS] Archiving <https://builds.apache.org/job/Tamaya-Master-branch/ws/modules/classloader-support/pom.xml>
to org.apache.tamaya.ext/tamaya-classloader-support/0.3-incubating-SNAPSHOT/tamaya-classloader-support-0.3-incubating-SNAPSHOT.pom
[JENKINS] Archiving <https://builds.apache.org/job/Tamaya-Master-branch/ws/modules/functions/pom.xml>
to org.apache.tamaya.ext/tamaya-functions/0.3-incubating-SNAPSHOT/tamaya-functions-0.3-incubating-SNAPSHOT.pom
[JENKINS] Archiving <https://builds.apache.org/job/Tamaya-Master-branch/ws/modules/integration/consul/pom.xml>
to org.apache.tamaya.ext/tamaya-consul/0.3-incubating-SNAPSHOT/tamaya-consul-0.3-incubating-SNAPSHOT.pom
[JENKINS] Archiving <https://builds.apache.org/job/Tamaya-Master-branch/ws/modules/resolver/pom.xml>
to org.apache.tamaya.ext/tamaya-resolver/0.3-incubating-SNAPSHOT/tamaya-resolver-0.3-incubating-SNAPSHOT.pom
[JENKINS] Archiving <https://builds.apache.org/job/Tamaya-Master-branch/ws/modules/integration/pom.xml>
to org.apache.tamaya.ext/tamaya-integration/0.3-incubating-SNAPSHOT/tamaya-integration-0.3-incubating-SNAPSHOT.pom
[JENKINS] Archiving <https://builds.apache.org/job/Tamaya-Master-branch/ws/code/core/pom.xml>
to org.apache.tamaya/tamaya-core/0.3-incubating-SNAPSHOT/tamaya-core-0.3-incubating-SNAPSHOT.pom
[JENKINS] Archiving <https://builds.apache.org/job/Tamaya-Master-branch/ws/pom.xml>
to org.apache.tamaya/tamaya-all/0.3-incubating-SNAPSHOT/tamaya-all-0.3-incubating-SNAPSHOT.pom
[JENKINS] Archiving <https://builds.apache.org/job/Tamaya-Master-branch/ws/target/feature/feature.xml>
to org.apache.tamaya/tamaya-all/0.3-incubating-SNAPSHOT/tamaya-all-0.3-incubating-SNAPSHOT-features.xml
[JENKINS] Archiving <https://builds.apache.org/job/Tamaya-Master-branch/ws/target/tamaya-all-0.3-incubating-SNAPSHOT-site.xml>
to org.apache.tamaya/tamaya-all/0.3-incubating-SNAPSHOT/tamaya-all-0.3-incubating-SNAPSHOT-site.xml
[JENKINS] Archiving <https://builds.apache.org/job/Tamaya-Master-branch/ws/modules/builder/pom.xml>
to org.apache.tamaya.ext/tamaya-builder/0.3-incubating-SNAPSHOT/tamaya-builder-0.3-incubating-SNAPSHOT.pom
[JENKINS] Archiving <https://builds.apache.org/job/Tamaya-Master-branch/ws/modules/integration/cdi/pom.xml>
to org.apache.tamaya.ext/tamaya-cdi/0.3-incubating-SNAPSHOT/tamaya-cdi-0.3-incubating-SNAPSHOT.pom
[JENKINS] Archiving <https://builds.apache.org/job/Tamaya-Master-branch/ws/docs/pom.xml>
to org.apache.tamaya/tamaya-docs/0.3-incubating-SNAPSHOT/tamaya-docs-0.3-incubating-SNAPSHOT.pom
channel stopped

Mime
View raw message