tamaya-commits mailing list archives

Site index · List index
Message view « Date » · « Thread »
Top « Date » · « Thread »
From Apache Jenkins Server <jenk...@builds.apache.org>
Subject Build failed in Jenkins: Tamaya-Master-branch #445
Date Tue, 08 Dec 2015 16:23:33 GMT
See <https://builds.apache.org/job/Tamaya-Master-branch/445/changes>

Changes:

[anatole] TAMAYA-129: OSGI Support: Added documentation.

[anatole] TAMAYA-129: OSGI Support: Added running tests and fixed deps

------------------------------------------
[...truncated 1302 lines...]
[INFO] Downloading: https://repo.maven.apache.org/maven2/javax/servlet/servlet-api/2.3/servlet-api-2.3.pom
[INFO] Downloaded: https://repo.maven.apache.org/maven2/javax/servlet/servlet-api/2.3/servlet-api-2.3.pom
(156 B at 21.8 KB/sec)
[INFO] Downloading: https://repo.maven.apache.org/maven2/commons-chain/commons-chain/1.1/commons-chain-1.1.pom
[INFO] Downloaded: https://repo.maven.apache.org/maven2/commons-chain/commons-chain/1.1/commons-chain-1.1.pom
(6 KB at 734.0 KB/sec)
[INFO] Downloading: https://repo.maven.apache.org/maven2/commons-validator/commons-validator/1.3.1/commons-validator-1.3.1.pom
[INFO] Downloaded: https://repo.maven.apache.org/maven2/commons-validator/commons-validator/1.3.1/commons-validator-1.3.1.pom
(9 KB at 979.4 KB/sec)
[INFO] Downloading: https://repo.maven.apache.org/maven2/dom4j/dom4j/1.1/dom4j-1.1.pom
[INFO] Downloaded: https://repo.maven.apache.org/maven2/dom4j/dom4j/1.1/dom4j-1.1.pom (142
B at 17.3 KB/sec)
[INFO] Downloading: https://repo.maven.apache.org/maven2/sslext/sslext/1.2-0/sslext-1.2-0.pom
[INFO] Downloaded: https://repo.maven.apache.org/maven2/sslext/sslext/1.2-0/sslext-1.2-0.pom
(653 B at 91.1 KB/sec)
[INFO] Downloading: https://repo.maven.apache.org/maven2/org/apache/struts/struts-core/1.3.8/struts-core-1.3.8.pom
[INFO] Downloaded: https://repo.maven.apache.org/maven2/org/apache/struts/struts-core/1.3.8/struts-core-1.3.8.pom
(5 KB at 467.9 KB/sec)
[INFO] Downloading: https://repo.maven.apache.org/maven2/org/apache/struts/struts-parent/1.3.8/struts-parent-1.3.8.pom
[INFO] Downloaded: https://repo.maven.apache.org/maven2/org/apache/struts/struts-parent/1.3.8/struts-parent-1.3.8.pom
(10 KB at 1201.0 KB/sec)
[INFO] Downloading: https://repo.maven.apache.org/maven2/org/apache/struts/struts-master/4/struts-master-4.pom
[INFO] Downloaded: https://repo.maven.apache.org/maven2/org/apache/struts/struts-master/4/struts-master-4.pom
(12 KB at 1444.2 KB/sec)
[INFO] Downloading: https://repo.maven.apache.org/maven2/org/apache/apache/2/apache-2.pom
[INFO] Downloaded: https://repo.maven.apache.org/maven2/org/apache/apache/2/apache-2.pom (4
KB at 369.9 KB/sec)
[INFO] Downloading: https://repo.maven.apache.org/maven2/antlr/antlr/2.7.2/antlr-2.7.2.pom
[INFO] Downloaded: https://repo.maven.apache.org/maven2/antlr/antlr/2.7.2/antlr-2.7.2.pom
(145 B at 17.7 KB/sec)
[INFO] Downloading: https://repo.maven.apache.org/maven2/org/apache/struts/struts-taglib/1.3.8/struts-taglib-1.3.8.pom
[INFO] Downloaded: https://repo.maven.apache.org/maven2/org/apache/struts/struts-taglib/1.3.8/struts-taglib-1.3.8.pom
(4 KB at 375.5 KB/sec)
[INFO] Downloading: https://repo.maven.apache.org/maven2/org/apache/struts/struts-tiles/1.3.8/struts-tiles-1.3.8.pom
[INFO] Downloaded: https://repo.maven.apache.org/maven2/org/apache/struts/struts-tiles/1.3.8/struts-tiles-1.3.8.pom
(3 KB at 141.8 KB/sec)
[INFO] Downloading: https://repo.maven.apache.org/maven2/org/apache/velocity/velocity/1.6.2/velocity-1.6.2.pom
[INFO] Downloaded: https://repo.maven.apache.org/maven2/org/apache/velocity/velocity/1.6.2/velocity-1.6.2.pom
(11 KB at 1152.3 KB/sec)
[INFO] Downloading: https://repo.maven.apache.org/maven2/org/apache/maven/shared/maven-doxia-tools/1.2.1/maven-doxia-tools-1.2.1.pom
[INFO] Downloaded: https://repo.maven.apache.org/maven2/org/apache/maven/shared/maven-doxia-tools/1.2.1/maven-doxia-tools-1.2.1.pom
(7 KB at 684.8 KB/sec)
[INFO] Downloading: https://repo.maven.apache.org/maven2/commons-io/commons-io/1.4/commons-io-1.4.pom
[INFO] Downloaded: https://repo.maven.apache.org/maven2/commons-io/commons-io/1.4/commons-io-1.4.pom
(13 KB at 1428.6 KB/sec)
[INFO] Downloading: https://repo.maven.apache.org/maven2/org/apache/commons/commons-parent/7/commons-parent-7.pom
[INFO] Downloaded: https://repo.maven.apache.org/maven2/org/apache/commons/commons-parent/7/commons-parent-7.pom
(18 KB at 1898.4 KB/sec)
[INFO] Downloading: https://repo.maven.apache.org/maven2/org/apache/maven/doxia/doxia-logging-api/1.1.3/doxia-logging-api-1.1.3.pom
[INFO] Downloaded: https://repo.maven.apache.org/maven2/org/apache/maven/doxia/doxia-logging-api/1.1.3/doxia-logging-api-1.1.3.pom
(2 KB at 171.4 KB/sec)
[INFO] Downloading: https://repo.maven.apache.org/maven2/org/apache/maven/doxia/doxia/1.1.3/doxia-1.1.3.pom
[INFO] Downloaded: https://repo.maven.apache.org/maven2/org/apache/maven/doxia/doxia/1.1.3/doxia-1.1.3.pom
(19 KB at 2018.9 KB/sec)
[INFO] Downloading: https://repo.maven.apache.org/maven2/org/apache/maven/doxia/doxia-decoration-model/1.1.3/doxia-decoration-model-1.1.3.pom
[INFO] Downloaded: https://repo.maven.apache.org/maven2/org/apache/maven/doxia/doxia-decoration-model/1.1.3/doxia-decoration-model-1.1.3.pom
(3 KB at 242.1 KB/sec)
[INFO] Downloading: https://repo.maven.apache.org/maven2/org/apache/maven/doxia/doxia-sitetools/1.1.3/doxia-sitetools-1.1.3.pom
[INFO] Downloaded: https://repo.maven.apache.org/maven2/org/apache/maven/doxia/doxia-sitetools/1.1.3/doxia-sitetools-1.1.3.pom
(16 KB at 1708.1 KB/sec)
[WARNING] Failure to transfer org.apache.tamaya:buildconfigurations:0.2-incubating-SNAPSHOT/maven-metadata.xml
from http://nexus.codehaus.org/snapshots/ was cached in the local repository, resolution will
not be reattempted until the update interval of codehaus-snapshots has elapsed or updates
are forced. Original error: Could not transfer metadata org.apache.tamaya:buildconfigurations:0.2-incubating-SNAPSHOT/maven-metadata.xml
from/to codehaus-snapshots (http://nexus.codehaus.org/snapshots/): nexus.codehaus.org: unknown
error
[INFO] Downloading: http://nexus.codehaus.org/snapshots/org/apache/tamaya/buildconfigurations/0.2-incubating-SNAPSHOT/buildconfigurations-0.2-incubating-SNAPSHOT.jar
[INFO] Downloading: https://repo.maven.apache.org/maven2/com/google/code/findbugs/findbugs/3.0.1/findbugs-3.0.1.jar
[INFO] Downloading: https://repo.maven.apache.org/maven2/net/jcip/jcip-annotations/1.0/jcip-annotations-1.0.jar
[INFO] Downloading: https://repo.maven.apache.org/maven2/com/google/code/findbugs/jsr305/2.0.1/jsr305-2.0.1.jar
[INFO] Downloading: https://repo.maven.apache.org/maven2/com/google/code/findbugs/bcel-findbugs/6.0/bcel-findbugs-6.0.jar
[INFO] Downloading: https://repo.maven.apache.org/maven2/com/google/code/findbugs/jFormatString/2.0.1/jFormatString-2.0.1.jar
[INFO] Downloaded: https://repo.maven.apache.org/maven2/net/jcip/jcip-annotations/1.0/jcip-annotations-1.0.jar
(3 KB at 157.2 KB/sec)
[INFO] Downloading: https://repo.maven.apache.org/maven2/dom4j/dom4j/1.6.1/dom4j-1.6.1.jar
[INFO] Downloaded: https://repo.maven.apache.org/maven2/com/google/code/findbugs/jsr305/2.0.1/jsr305-2.0.1.jar
(32 KB at 1353.0 KB/sec)
[INFO] Downloading: https://repo.maven.apache.org/maven2/xml-apis/xml-apis/1.0.b2/xml-apis-1.0.b2.jar
[INFO] Downloaded: https://repo.maven.apache.org/maven2/com/google/code/findbugs/jFormatString/2.0.1/jFormatString-2.0.1.jar
(27 KB at 760.9 KB/sec)
[INFO] Downloading: https://repo.maven.apache.org/maven2/org/ow2/asm/asm-debug-all/5.0.2/asm-debug-all-5.0.2.jar
[INFO] Downloaded: https://repo.maven.apache.org/maven2/xml-apis/xml-apis/1.0.b2/xml-apis-1.0.b2.jar
(107 KB at 2809.4 KB/sec)
[INFO] Downloading: https://repo.maven.apache.org/maven2/org/ow2/asm/asm-commons/5.0.2/asm-commons-5.0.2.jar
[INFO] Downloaded: https://repo.maven.apache.org/maven2/com/google/code/findbugs/bcel-findbugs/6.0/bcel-findbugs-6.0.jar
(599 KB at 11960.5 KB/sec)
[INFO] Downloaded: https://repo.maven.apache.org/maven2/org/ow2/asm/asm-commons/5.0.2/asm-commons-5.0.2.jar
(41 KB at 831.4 KB/sec)
[INFO] Downloading: https://repo.maven.apache.org/maven2/org/ow2/asm/asm-tree/5.0.2/asm-tree-5.0.2.jar
[INFO] Downloading: https://repo.maven.apache.org/maven2/org/ow2/asm/asm/5.0.2/asm-5.0.2.jar
[INFO] Downloaded: https://repo.maven.apache.org/maven2/dom4j/dom4j/1.6.1/dom4j-1.6.1.jar
(307 KB at 5025.3 KB/sec)
[INFO] Downloading: https://repo.maven.apache.org/maven2/com/apple/AppleJavaExtensions/1.4/AppleJavaExtensions-1.4.jar
[INFO] Downloaded: https://repo.maven.apache.org/maven2/org/ow2/asm/asm-tree/5.0.2/asm-tree-5.0.2.jar
(29 KB at 450.1 KB/sec)
[INFO] Downloading: https://repo.maven.apache.org/maven2/jaxen/jaxen/1.1.6/jaxen-1.1.6.jar
[INFO] Downloaded: https://repo.maven.apache.org/maven2/org/ow2/asm/asm/5.0.2/asm-5.0.2.jar
(52 KB at 799.8 KB/sec)
[INFO] Downloading: https://repo.maven.apache.org/maven2/org/codehaus/gmavenplus/gmavenplus-plugin/1.3/gmavenplus-plugin-1.3.jar
[INFO] Downloaded: https://repo.maven.apache.org/maven2/com/apple/AppleJavaExtensions/1.4/AppleJavaExtensions-1.4.jar
(12 KB at 144.9 KB/sec)
[INFO] Downloading: https://repo.maven.apache.org/maven2/org/apache/maven/shared/file-management/1.2.1/file-management-1.2.1.jar
[INFO] Downloaded: https://repo.maven.apache.org/maven2/org/codehaus/gmavenplus/gmavenplus-plugin/1.3/gmavenplus-plugin-1.3.jar
(87 KB at 874.7 KB/sec)
[INFO] Downloading: https://repo.maven.apache.org/maven2/org/apache/maven/shared/maven-shared-io/1.1/maven-shared-io-1.1.jar
[INFO] Downloaded: https://repo.maven.apache.org/maven2/jaxen/jaxen/1.1.6/jaxen-1.1.6.jar
(227 KB at 2264.5 KB/sec)
[INFO] Downloading: https://repo.maven.apache.org/maven2/org/apache/maven/wagon/wagon-provider-api/1.0-alpha-6/wagon-provider-api-1.0-alpha-6.jar
[INFO] Downloaded: https://repo.maven.apache.org/maven2/org/apache/maven/shared/maven-shared-io/1.1/maven-shared-io-1.1.jar
(39 KB at 360.3 KB/sec)
[INFO] Downloading: https://repo.maven.apache.org/maven2/org/codehaus/plexus/plexus-classworlds/2.5.2/plexus-classworlds-2.5.2.jar
[INFO] Downloaded: https://repo.maven.apache.org/maven2/org/apache/maven/shared/file-management/1.2.1/file-management-1.2.1.jar
(37 KB at 316.3 KB/sec)
[INFO] Downloading: https://repo.maven.apache.org/maven2/org/fusesource/jansi/jansi/1.11/jansi-1.11.jar
[INFO] Downloaded: https://repo.maven.apache.org/maven2/org/codehaus/plexus/plexus-classworlds/2.5.2/plexus-classworlds-2.5.2.jar
(52 KB at 408.3 KB/sec)
[INFO] Downloading: https://repo.maven.apache.org/maven2/jline/jline/2.12/jline-2.12.jar
[INFO] Downloaded: https://repo.maven.apache.org/maven2/org/ow2/asm/asm-debug-all/5.0.2/asm-debug-all-5.0.2.jar
(372 KB at 2751.1 KB/sec)
[INFO] Downloading: https://repo.maven.apache.org/maven2/org/apache/ant/ant/1.9.4/ant-1.9.4.jar
[INFO] Downloaded: https://repo.maven.apache.org/maven2/org/apache/maven/wagon/wagon-provider-api/1.0-alpha-6/wagon-provider-api-1.0-alpha-6.jar
(42 KB at 300.2 KB/sec)
[INFO] Downloading: https://repo.maven.apache.org/maven2/org/apache/ant/ant-launcher/1.9.4/ant-launcher-1.9.4.jar
[INFO] Downloaded: https://repo.maven.apache.org/maven2/org/fusesource/jansi/jansi/1.11/jansi-1.11.jar
(112 KB at 792.4 KB/sec)
[INFO] Downloading: https://repo.maven.apache.org/maven2/org/apache/ivy/ivy/2.4.0/ivy-2.4.0.jar
[INFO] Downloaded: https://repo.maven.apache.org/maven2/org/apache/ant/ant-launcher/1.9.4/ant-launcher-1.9.4.jar
(18 KB at 118.9 KB/sec)
[INFO] Downloading: https://repo.maven.apache.org/maven2/org/codehaus/groovy/groovy-all/2.4.0/groovy-all-2.4.0.jar
[INFO] Downloaded: https://repo.maven.apache.org/maven2/com/google/code/findbugs/findbugs/3.0.1/findbugs-3.0.1.jar
(3711 KB at 15994.1 KB/sec)
[INFO] Downloading: https://repo.maven.apache.org/maven2/org/apache/maven/reporting/maven-reporting-impl/2.1/maven-reporting-impl-2.1.jar
[INFO] Downloaded: https://repo.maven.apache.org/maven2/org/apache/maven/reporting/maven-reporting-impl/2.1/maven-reporting-impl-2.1.jar
(17 KB at 66.9 KB/sec)
[INFO] Downloading: https://repo.maven.apache.org/maven2/commons-validator/commons-validator/1.2.0/commons-validator-1.2.0.jar
[INFO] Downloaded: https://repo.maven.apache.org/maven2/commons-validator/commons-validator/1.2.0/commons-validator-1.2.0.jar
(89 KB at 344.9 KB/sec)
[INFO] Downloading: https://repo.maven.apache.org/maven2/commons-beanutils/commons-beanutils/1.7.0/commons-beanutils-1.7.0.jar
[INFO] Downloaded: https://repo.maven.apache.org/maven2/commons-beanutils/commons-beanutils/1.7.0/commons-beanutils-1.7.0.jar
(185 KB at 670.0 KB/sec)
[INFO] Downloading: https://repo.maven.apache.org/maven2/commons-digester/commons-digester/1.6/commons-digester-1.6.jar
[INFO] Downloaded: https://repo.maven.apache.org/maven2/org/apache/ant/ant/1.9.4/ant-1.9.4.jar
(1972 KB at 6823.3 KB/sec)
[INFO] Downloading: https://repo.maven.apache.org/maven2/commons-logging/commons-logging/1.0.4/commons-logging-1.0.4.jar
[INFO] Downloaded: https://repo.maven.apache.org/maven2/commons-digester/commons-digester/1.6/commons-digester-1.6.jar
(165 KB at 550.2 KB/sec)
[INFO] Downloading: https://repo.maven.apache.org/maven2/org/apache/maven/maven-plugin-api/2.0/maven-plugin-api-2.0.jar
[INFO] Downloaded: https://repo.maven.apache.org/maven2/commons-logging/commons-logging/1.0.4/commons-logging-1.0.4.jar
(38 KB at 123.7 KB/sec)
[INFO] Downloading: https://repo.maven.apache.org/maven2/org/apache/maven/doxia/doxia-core/1.4/doxia-core-1.4.jar
[INFO] Downloaded: https://repo.maven.apache.org/maven2/org/apache/maven/maven-plugin-api/2.0/maven-plugin-api-2.0.jar
(10 KB at 32.3 KB/sec)
[INFO] Downloading: https://repo.maven.apache.org/maven2/org/apache/maven/doxia/doxia-logging-api/1.4/doxia-logging-api-1.4.jar
[INFO] Downloaded: https://repo.maven.apache.org/maven2/org/apache/maven/doxia/doxia-logging-api/1.4/doxia-logging-api-1.4.jar
(12 KB at 35.3 KB/sec)
[INFO] Downloading: https://repo.maven.apache.org/maven2/xerces/xercesImpl/2.9.1/xercesImpl-2.9.1.jar
[INFO] Downloaded: https://repo.maven.apache.org/maven2/org/apache/maven/doxia/doxia-core/1.4/doxia-core-1.4.jar
(162 KB at 498.5 KB/sec)
[INFO] Downloading: https://repo.maven.apache.org/maven2/org/apache/maven/doxia/doxia-sink-api/1.4/doxia-sink-api-1.4.jar
[INFO] Downloaded: https://repo.maven.apache.org/maven2/org/apache/maven/doxia/doxia-sink-api/1.4/doxia-sink-api-1.4.jar
(11 KB at 32.8 KB/sec)
[INFO] Downloading: https://repo.maven.apache.org/maven2/org/apache/maven/doxia/doxia-decoration-model/1.4/doxia-decoration-model-1.4.jar
[INFO] Downloaded: https://repo.maven.apache.org/maven2/org/apache/maven/doxia/doxia-decoration-model/1.4/doxia-decoration-model-1.4.jar
(60 KB at 172.9 KB/sec)
[INFO] Downloading: https://repo.maven.apache.org/maven2/org/apache/maven/doxia/doxia-site-renderer/1.4/doxia-site-renderer-1.4.jar
[INFO] Downloaded: https://repo.maven.apache.org/maven2/org/apache/maven/doxia/doxia-site-renderer/1.4/doxia-site-renderer-1.4.jar
(52 KB at 144.0 KB/sec)
[INFO] Downloading: https://repo.maven.apache.org/maven2/org/apache/maven/doxia/doxia-module-xhtml/1.4/doxia-module-xhtml-1.4.jar
[INFO] Downloaded: https://repo.maven.apache.org/maven2/org/apache/maven/doxia/doxia-module-xhtml/1.4/doxia-module-xhtml-1.4.jar
(16 KB at 40.1 KB/sec)
[INFO] Downloading: https://repo.maven.apache.org/maven2/org/apache/maven/doxia/doxia-module-fml/1.4/doxia-module-fml-1.4.jar
[INFO] Downloaded: https://repo.maven.apache.org/maven2/org/apache/maven/doxia/doxia-module-fml/1.4/doxia-module-fml-1.4.jar
(37 KB at 96.2 KB/sec)
[INFO] Downloading: https://repo.maven.apache.org/maven2/org/apache/velocity/velocity-tools/2.0/velocity-tools-2.0.jar
[INFO] Downloaded: https://repo.maven.apache.org/maven2/jline/jline/2.12/jline-2.12.jar (209
KB at 542.4 KB/sec)
[INFO] Downloading: https://repo.maven.apache.org/maven2/commons-chain/commons-chain/1.1/commons-chain-1.1.jar
[INFO] Downloaded: https://repo.maven.apache.org/maven2/commons-chain/commons-chain/1.1/commons-chain-1.1.jar
(88 KB at 208.8 KB/sec)
[INFO] Downloading: https://repo.maven.apache.org/maven2/sslext/sslext/1.2-0/sslext-1.2-0.jar
[INFO] Downloaded: https://repo.maven.apache.org/maven2/xerces/xercesImpl/2.9.1/xercesImpl-2.9.1.jar
(1201 KB at 2837.6 KB/sec)
[INFO] Downloading: https://repo.maven.apache.org/maven2/org/apache/struts/struts-core/1.3.8/struts-core-1.3.8.jar
[INFO] Downloaded: https://repo.maven.apache.org/maven2/sslext/sslext/1.2-0/sslext-1.2-0.jar
(26 KB at 58.2 KB/sec)
[INFO] Downloading: https://repo.maven.apache.org/maven2/antlr/antlr/2.7.2/antlr-2.7.2.jar
[INFO] Downloaded: https://repo.maven.apache.org/maven2/org/apache/velocity/velocity-tools/2.0/velocity-tools-2.0.jar
(339 KB at 714.0 KB/sec)
[INFO] Downloading: https://repo.maven.apache.org/maven2/org/apache/struts/struts-taglib/1.3.8/struts-taglib-1.3.8.jar
[INFO] Downloaded: https://repo.maven.apache.org/maven2/org/apache/struts/struts-core/1.3.8/struts-core-1.3.8.jar
(322 KB at 647.6 KB/sec)
[INFO] Downloading: https://repo.maven.apache.org/maven2/org/apache/struts/struts-tiles/1.3.8/struts-tiles-1.3.8.jar
[INFO] Downloaded: https://repo.maven.apache.org/maven2/antlr/antlr/2.7.2/antlr-2.7.2.jar
(350 KB at 704.0 KB/sec)
[INFO] Downloading: https://repo.maven.apache.org/maven2/org/apache/maven/shared/maven-doxia-tools/1.2.1/maven-doxia-tools-1.2.1.jar
[INFO] Downloaded: https://repo.maven.apache.org/maven2/org/apache/ivy/ivy/2.4.0/ivy-2.4.0.jar
(1253 KB at 2475.0 KB/sec)
[INFO] Downloading: https://repo.maven.apache.org/maven2/commons-io/commons-io/1.4/commons-io-1.4.jar
[INFO] Downloaded: https://repo.maven.apache.org/maven2/org/apache/struts/struts-taglib/1.3.8/struts-taglib-1.3.8.jar
(246 KB at 485.4 KB/sec)
[INFO] Downloading: https://repo.maven.apache.org/maven2/org/apache/maven/maven-artifact-manager/2.0.6/maven-artifact-manager-2.0.6.jar
[INFO] Downloaded: https://repo.maven.apache.org/maven2/org/apache/struts/struts-tiles/1.3.8/struts-tiles-1.3.8.jar
(117 KB at 227.8 KB/sec)
[INFO] Downloading: https://repo.maven.apache.org/maven2/org/apache/maven/maven-model/2.0.6/maven-model-2.0.6.jar
[INFO] Downloaded: https://repo.maven.apache.org/maven2/org/apache/maven/shared/maven-doxia-tools/1.2.1/maven-doxia-tools-1.2.1.jar
(43 KB at 81.7 KB/sec)
[INFO] Downloading: https://repo.maven.apache.org/maven2/org/codehaus/plexus/plexus-container-default/1.0-alpha-9/plexus-container-default-1.0-alpha-9.jar
[INFO] Downloaded: https://repo.maven.apache.org/maven2/org/apache/maven/maven-artifact-manager/2.0.6/maven-artifact-manager-2.0.6.jar
(56 KB at 106.5 KB/sec)
[INFO] Downloading: https://repo.maven.apache.org/maven2/org/codehaus/plexus/plexus-utils/1.5.6/plexus-utils-1.5.6.jar
[INFO] Downloaded: https://repo.maven.apache.org/maven2/commons-io/commons-io/1.4/commons-io-1.4.jar
(107 KB at 201.3 KB/sec)
[INFO] Downloaded: https://repo.maven.apache.org/maven2/org/apache/maven/maven-model/2.0.6/maven-model-2.0.6.jar
(85 KB at 159.2 KB/sec)
[INFO] Downloaded: https://repo.maven.apache.org/maven2/org/codehaus/plexus/plexus-utils/1.5.6/plexus-utils-1.5.6.jar
(245 KB at 454.8 KB/sec)
[INFO] Downloaded: https://repo.maven.apache.org/maven2/org/codehaus/plexus/plexus-container-default/1.0-alpha-9/plexus-container-default-1.0-alpha-9.jar
(191 KB at 354.0 KB/sec)
[INFO] Downloaded: https://repo.maven.apache.org/maven2/org/codehaus/groovy/groovy-all/2.4.0/groovy-all-2.4.0.jar
(6758 KB at 11855.7 KB/sec)
[WARNING] Failed to getClass for org.codehaus.mojo.findbugs.FindBugsMojo
[FINDBUGS] No report found for mojo findbugs
[WARNING] Failed to getClass for org.codehaus.mojo.findbugs.FindbugsViolationCheckMojo
[WARNING] Failed to getClass for org.codehaus.mojo.findbugs.FindbugsViolationCheckMojo
[INFO] ------------------------------------------------------------------------
[INFO] Reactor Summary:
[INFO] 
[INFO] Apache Tamaya ...................................... FAILURE [ 11.961 s]
[INFO] Apache Tamaya Build Configuration .................. SKIPPED
[INFO] Apache Tamaya API .................................. SKIPPED
[INFO] Apache Tamaya Core Implementation .................. SKIPPED
[INFO] Apache Tamaya Extension Modules .................... SKIPPED
[INFO] Apache Tamaya Resource Services .................... SKIPPED
[INFO] Apache Tamaya Format Services ...................... SKIPPED
[INFO] Apache Tamaya SPI Support Classes .................. SKIPPED
[INFO] Apache Tamaya JSON Support ......................... SKIPPED
[INFO] Apache Tamaya Builder .............................. SKIPPED
[INFO] Apache Tamaya Event and dynamic Update Extensions .. SKIPPED
[INFO] Apache Tamaya Injection Support API ................ SKIPPED
[INFO] Apache Tamaya Resolver Services .................... SKIPPED
[INFO] Apache Tamaya Injection Support .................... SKIPPED
[INFO] Apache Tamaya Common Functional Extensions ......... SKIPPED
[INFO] Apache Tamaya Extension Modules: Configuration Model Infrastructure SKIPPED
[INFO] Apache Tamaya Modules - Java Management Extensions . SKIPPED
[INFO] Apache Tamaya Modules: Server Extension ............ SKIPPED
[INFO] Apache Tamaya Remote PropertySource ................ SKIPPED
[INFO] Apache Tamaya Optional Configuration Backend ....... SKIPPED
[INFO] Apache Tamaya Modules -Classloader Support ......... SKIPPED
[INFO] tamaya-integration ................................. SKIPPED
[INFO] Apache Tamaya Modules Integration - Spring ......... SKIPPED
[INFO] Apache Tamaya Modules Integration - CDI (Using SE Injection) SKIPPED
[INFO] Apache Tamaya Modules Integration - CDI (Java EE) .. SKIPPED
[INFO] Apache Tamaya :: OSGi Services :: Tamaya Config .... SKIPPED
[INFO] Apache Tamaya Modules Integration - Apache Camel ... SKIPPED
[INFO] Apache Tamaya Documentation ........................ SKIPPED
[INFO] Apache Tamaya Examples ............................. SKIPPED
[INFO] Apache Tamaya Example: Minimal Version ............. SKIPPED
[INFO] Apache Tamaya Example: Simple Property Source Version SKIPPED
[INFO] Apache Tamaya Example: Resource Location ........... SKIPPED
[INFO] Apache Tamaya Example: Value Resolution ............ SKIPPED
[INFO] Apache Tamaya Example: File Observer ............... SKIPPED
[INFO] Apache Tamaya Example: Configuration Injection ..... SKIPPED
[INFO] Apache Tamaya Example: Builder ..................... SKIPPED
[INFO] Apache Tamaya Example: Remote ...................... SKIPPED
[INFO] Apache Tamaya Example: Remote (Server) ............. SKIPPED
[INFO] Apache Tamaya Example: Remote (Client) ............. SKIPPED
[INFO] Apache Tamaya Distribution ......................... SKIPPED
[INFO] ------------------------------------------------------------------------
[INFO] BUILD FAILURE
[INFO] ------------------------------------------------------------------------
[INFO] Total time: 34.846 s
[INFO] Finished at: 2015-12-08T16:23:13+00:00
[INFO] Final Memory: 45M/605M
[INFO] ------------------------------------------------------------------------
[ERROR] Failed to execute goal org.codehaus.mojo:findbugs-maven-plugin:3.0.1:findbugs (findbugs)
on project tamaya-all: Execution findbugs of goal org.codehaus.mojo:findbugs-maven-plugin:3.0.1:findbugs
failed: Plugin org.codehaus.mojo:findbugs-maven-plugin:3.0.1 or one of its dependencies could
not be resolved: Could not transfer artifact org.apache.tamaya:buildconfigurations:jar:0.2-incubating-SNAPSHOT
from/to codehaus-snapshots (http://nexus.codehaus.org/snapshots/): nexus.codehaus.org: Unknown
host nexus.codehaus.org -> [Help 1]
[ERROR] 
[ERROR] To see the full stack trace of the errors, re-run Maven with the -e switch.
[ERROR] Re-run Maven using the -X switch to enable full debug logging.
[ERROR] 
[ERROR] For more information about the errors and possible solutions, please read the following
articles:
[ERROR] [Help 1] http://cwiki.apache.org/confluence/display/MAVEN/PluginResolutionException
[JENKINS] Archiving <https://builds.apache.org/job/Tamaya-Master-branch/ws/modules/injection/pom.xml>
to org.apache.tamaya.ext/tamaya-injection/0.2-incubating-SNAPSHOT/tamaya-injection-0.2-incubating-SNAPSHOT.pom
[JENKINS] Archiving <https://builds.apache.org/job/Tamaya-Master-branch/ws/examples/6-fileobserver-example/pom.xml>
to org.apache.tamaya.examples/tamaya-example-fileobserver/0.2-incubating-SNAPSHOT/tamaya-example-fileobserver-0.2-incubating-SNAPSHOT.pom
[JENKINS] Archiving <https://builds.apache.org/job/Tamaya-Master-branch/ws/modules/integration/osgi/pom.xml>
to org.apache.tamaya.ext/tamaya-osgi/0.2-incubating-SNAPSHOT/tamaya-osgi-0.2-incubating-SNAPSHOT.pom
No prior successful build to compare, so performing full copy of artifacts
[JENKINS] Archiving <https://builds.apache.org/job/Tamaya-Master-branch/ws/examples/8-remote-example/pom.xml>
to org.apache.tamaya.examples/tamaya-example-remote/0.2-incubating-SNAPSHOT/tamaya-example-remote-0.2-incubating-SNAPSHOT.pom
[JENKINS] Archiving <https://builds.apache.org/job/Tamaya-Master-branch/ws/modules/json/pom.xml>
to org.apache.tamaya.ext/tamaya-json/0.2-incubating-SNAPSHOT/tamaya-json-0.2-incubating-SNAPSHOT.pom
[JENKINS] Archiving <https://builds.apache.org/job/Tamaya-Master-branch/ws/modules/integration/camel/pom.xml>
to org.apache.tamaya.ext/tamaya-camel/0.2-incubating-SNAPSHOT/tamaya-camel-0.2-incubating-SNAPSHOT.pom
No prior successful build to compare, so performing full copy of artifacts
[JENKINS] Archiving <https://builds.apache.org/job/Tamaya-Master-branch/ws/examples/7-builder-example/pom.xml>
to org.apache.tamaya.examples/tamaya-example-builder/0.2-incubating-SNAPSHOT/tamaya-example-builder-0.2-incubating-SNAPSHOT.pom
[JENKINS] Archiving <https://builds.apache.org/job/Tamaya-Master-branch/ws/modules/spi-support/pom.xml>
to org.apache.tamaya.ext/tamaya-spisupport/0.2-incubating-SNAPSHOT/tamaya-spisupport-0.2-incubating-SNAPSHOT.pom
[JENKINS] Archiving <https://builds.apache.org/job/Tamaya-Master-branch/ws/examples/1-minimal-example/pom.xml>
to org.apache.tamaya.examples/tamaya-example-minimal/0.2-incubating-SNAPSHOT/tamaya-example-minimal-0.2-incubating-SNAPSHOT.pom
[JENKINS] Archiving <https://builds.apache.org/job/Tamaya-Master-branch/ws/buildconfigurations/pom.xml>
to org.apache.tamaya/buildconfigurations/0.2-incubating-SNAPSHOT/buildconfigurations-0.2-incubating-SNAPSHOT.pom
[JENKINS] Archiving <https://builds.apache.org/job/Tamaya-Master-branch/ws/examples/3-resources-example/pom.xml>
to org.apache.tamaya.examples/tamaya-example-resources/0.2-incubating-SNAPSHOT/tamaya-example-resources-0.2-incubating-SNAPSHOT.pom
[JENKINS] Archiving <https://builds.apache.org/job/Tamaya-Master-branch/ws/examples/8-remote-example/server/pom.xml>
to org.apache.tamaya.examples/tamaya-example-remote-server/0.2-incubating-SNAPSHOT/tamaya-example-remote-server-0.2-incubating-SNAPSHOT.pom
[JENKINS] Archiving <https://builds.apache.org/job/Tamaya-Master-branch/ws/examples/pom.xml>
to org.apache.tamaya.ext/tamaya-examples/0.2-incubating-SNAPSHOT/tamaya-examples-0.2-incubating-SNAPSHOT.pom
[JENKINS] Archiving <https://builds.apache.org/job/Tamaya-Master-branch/ws/examples/8-remote-example/client/pom.xml>
to org.apache.tamaya.examples/tamaya-example-remote-client/0.2-incubating-SNAPSHOT/tamaya-example-remote-client-0.2-incubating-SNAPSHOT.pom
[JENKINS] Archiving <https://builds.apache.org/job/Tamaya-Master-branch/ws/modules/optional/pom.xml>
to org.apache.tamaya.ext/tamaya-optional/0.2-incubating-SNAPSHOT/tamaya-optional-0.2-incubating-SNAPSHOT.pom
[JENKINS] Archiving <https://builds.apache.org/job/Tamaya-Master-branch/ws/modules/injection-api/pom.xml>
to org.apache.tamaya.ext/tamaya-injection-api/0.2-incubating-SNAPSHOT/tamaya-injection-api-0.2-incubating-SNAPSHOT.pom
No prior successful build to compare, so performing full copy of artifacts
[JENKINS] Archiving <https://builds.apache.org/job/Tamaya-Master-branch/ws/modules/integration/cdi-se/pom.xml>
to org.apache.tamaya.ext/tamaya-cdi-se/0.2-incubating-SNAPSHOT/tamaya-cdi-se-0.2-incubating-SNAPSHOT.pom
[JENKINS] Archiving <https://builds.apache.org/job/Tamaya-Master-branch/ws/examples/2-simple-propertysource-example/pom.xml>
to org.apache.tamaya.examples/tamaya-example-simple-propertysource/0.2-incubating-SNAPSHOT/tamaya-example-simple-propertysource-0.2-incubating-SNAPSHOT.pom
[JENKINS] Archiving <https://builds.apache.org/job/Tamaya-Master-branch/ws/modules/resources/pom.xml>
to org.apache.tamaya.ext/tamaya-resources/0.2-incubating-SNAPSHOT/tamaya-resources-0.2-incubating-SNAPSHOT.pom
[JENKINS] Archiving <https://builds.apache.org/job/Tamaya-Master-branch/ws/modules/management/pom.xml>
to org.apache.tamaya.ext/tamaya-management/0.2-incubating-SNAPSHOT/tamaya-management-0.2-incubating-SNAPSHOT.pom
[JENKINS] Archiving <https://builds.apache.org/job/Tamaya-Master-branch/ws/distribution/pom.xml>
to org.apache.tamaya/tamaya-distribution/0.2-incubating-SNAPSHOT/tamaya-distribution-0.2-incubating-SNAPSHOT.pom
[JENKINS] Archiving <https://builds.apache.org/job/Tamaya-Master-branch/ws/modules/integration/spring/pom.xml>
to org.apache.tamaya.ext/tamaya-spring/0.2-incubating-SNAPSHOT/tamaya-spring-0.2-incubating-SNAPSHOT.pom
[JENKINS] Archiving <https://builds.apache.org/job/Tamaya-Master-branch/ws/examples/4-resolver-example/pom.xml>
to org.apache.tamaya.examples/tamaya-example-resolver/0.2-incubating-SNAPSHOT/tamaya-example-resolver-0.2-incubating-SNAPSHOT.pom
[JENKINS] Archiving <https://builds.apache.org/job/Tamaya-Master-branch/ws/modules/events/pom.xml>
to org.apache.tamaya.ext/tamaya-events/0.2-incubating-SNAPSHOT/tamaya-events-0.2-incubating-SNAPSHOT.pom
[JENKINS] Archiving <https://builds.apache.org/job/Tamaya-Master-branch/ws/modules/formats/pom.xml>
to org.apache.tamaya.ext/tamaya-formats/0.2-incubating-SNAPSHOT/tamaya-formats-0.2-incubating-SNAPSHOT.pom
[JENKINS] Archiving <https://builds.apache.org/job/Tamaya-Master-branch/ws/examples/5-injection-example/pom.xml>
to org.apache.tamaya.examples/tamaya-example-injection/0.2-incubating-SNAPSHOT/tamaya-example-injection-0.2-incubating-SNAPSHOT.pom
[JENKINS] Archiving <https://builds.apache.org/job/Tamaya-Master-branch/ws/modules/pom.xml>
to org.apache.tamaya.ext/tamaya-extensions/0.2-incubating-SNAPSHOT/tamaya-extensions-0.2-incubating-SNAPSHOT.pom
[JENKINS] Archiving <https://builds.apache.org/job/Tamaya-Master-branch/ws/api/pom.xml>
to org.apache.tamaya/tamaya-api/0.2-incubating-SNAPSHOT/tamaya-api-0.2-incubating-SNAPSHOT.pom
[JENKINS] Archiving <https://builds.apache.org/job/Tamaya-Master-branch/ws/modules/server/pom.xml>
to org.apache.tamaya.ext/tamaya-server/0.2-incubating-SNAPSHOT/tamaya-server-0.2-incubating-SNAPSHOT.pom
[JENKINS] Archiving <https://builds.apache.org/job/Tamaya-Master-branch/ws/modules/model/pom.xml>
to org.apache.tamaya.ext.model/tamaya-model/0.2-incubating-SNAPSHOT/tamaya-model-0.2-incubating-SNAPSHOT.pom
[JENKINS] Archiving <https://builds.apache.org/job/Tamaya-Master-branch/ws/modules/classloader-support/pom.xml>
to org.apache.tamaya.ext/tamaya-classloader-support/0.2-incubating-SNAPSHOT/tamaya-classloader-support-0.2-incubating-SNAPSHOT.pom
[JENKINS] Archiving <https://builds.apache.org/job/Tamaya-Master-branch/ws/modules/functions/pom.xml>
to org.apache.tamaya.ext/tamaya-functions/0.2-incubating-SNAPSHOT/tamaya-functions-0.2-incubating-SNAPSHOT.pom
[JENKINS] Archiving <https://builds.apache.org/job/Tamaya-Master-branch/ws/modules/remote/pom.xml>
to org.apache.tamaya.ext/tamaya-remote/0.2-incubating-SNAPSHOT/tamaya-remote-0.2-incubating-SNAPSHOT.pom
[JENKINS] Archiving <https://builds.apache.org/job/Tamaya-Master-branch/ws/modules/resolver/pom.xml>
to org.apache.tamaya.ext/tamaya-resolver/0.2-incubating-SNAPSHOT/tamaya-resolver-0.2-incubating-SNAPSHOT.pom
[JENKINS] Archiving <https://builds.apache.org/job/Tamaya-Master-branch/ws/modules/integration/pom.xml>
to org.apache.tamaya.ext/tamaya-integration/0.2-incubating-SNAPSHOT/tamaya-integration-0.2-incubating-SNAPSHOT.pom
[JENKINS] Archiving <https://builds.apache.org/job/Tamaya-Master-branch/ws/core/pom.xml>
to org.apache.tamaya/tamaya-core/0.2-incubating-SNAPSHOT/tamaya-core-0.2-incubating-SNAPSHOT.pom
[JENKINS] Archiving <https://builds.apache.org/job/Tamaya-Master-branch/ws/pom.xml>
to org.apache.tamaya/tamaya-all/0.2-incubating-SNAPSHOT/tamaya-all-0.2-incubating-SNAPSHOT.pom
[JENKINS] Archiving <https://builds.apache.org/job/Tamaya-Master-branch/ws/modules/builder/pom.xml>
to org.apache.tamaya.ext/tamaya-builder/0.2-incubating-SNAPSHOT/tamaya-builder-0.2-incubating-SNAPSHOT.pom
[JENKINS] Archiving <https://builds.apache.org/job/Tamaya-Master-branch/ws/modules/integration/cdi/pom.xml>
to org.apache.tamaya.ext/tamaya-cdi/0.2-incubating-SNAPSHOT/tamaya-cdi-0.2-incubating-SNAPSHOT.pom
[JENKINS] Archiving <https://builds.apache.org/job/Tamaya-Master-branch/ws/docs/pom.xml>
to org.apache.tamaya/tamaya-docs/0.2-incubating-SNAPSHOT/tamaya-docs-0.2-incubating-SNAPSHOT.pom
channel stopped

Mime
View raw message