tamaya-commits mailing list archives

Site index · List index
Message view « Date » · « Thread »
Top « Date » · « Thread »
From Apache Jenkins Server <jenk...@builds.apache.org>
Subject Build failed in Jenkins: Tamaya-Master-branch #428
Date Mon, 09 Nov 2015 03:28:29 GMT
See <https://builds.apache.org/job/Tamaya-Master-branch/428/changes>

Changes:

[anatole] TAMAYA-129: OSGI: Added OSGI BundleListener that also registers an OSGI

------------------------------------------
Started by an SCM change
[EnvInject] - Loading node environment variables.
[EnvInject] - Preparing an environment for the build.
[EnvInject] - Keeping Jenkins system variables.
[EnvInject] - Keeping Jenkins build variables.
[EnvInject] - Injecting contributions.
Building remotely on H11 (Ubuntu ubuntu) in workspace <https://builds.apache.org/job/Tamaya-Master-branch/ws/>
 > git rev-parse --is-inside-work-tree # timeout=10
Fetching changes from the remote Git repository
 > git config remote.origin.url https://git-wip-us.apache.org/repos/asf/incubator-tamaya.git
# timeout=10
Fetching upstream changes from https://git-wip-us.apache.org/repos/asf/incubator-tamaya.git
 > git --version # timeout=10
 > git -c core.askpass=true fetch --tags --progress https://git-wip-us.apache.org/repos/asf/incubator-tamaya.git
+refs/heads/*:refs/remotes/origin/*
 > git rev-parse refs/remotes/origin/master^{commit} # timeout=10
 > git rev-parse refs/remotes/origin/origin/master^{commit} # timeout=10
Checking out Revision e941425fbb1316070f0ec50cd2408f3bbb9a1c15 (refs/remotes/origin/master)
 > git config core.sparsecheckout # timeout=10
 > git checkout -f e941425fbb1316070f0ec50cd2408f3bbb9a1c15
 > git rev-list 306b2bb8ad4c0bba3d3081976652fc0a64f91f99 # timeout=10
Parsing POMs
Modules changed, recalculating dependency graph
Established TCP socket on 43812
maven32-agent.jar already up to date
maven32-interceptor.jar already up to date
maven3-interceptor-commons.jar already up to date
[Tamaya-Master-branch] $ /home/jenkins/jenkins-slave/tools/hudson.model.JDK/latest1.8/bin/java
-Xmx2g -Xms256m -XX:MaxPermSize=512m -cp /home/jenkins/jenkins-slave/maven32-agent.jar:/home/jenkins/jenkins-slave/tools/hudson.tasks.Maven_MavenInstallation/maven-3.3.3/boot/plexus-classworlds-2.5.2.jar:/home/jenkins/jenkins-slave/tools/hudson.tasks.Maven_MavenInstallation/maven-3.3.3/conf/logging
jenkins.maven3.agent.Maven32Main /home/jenkins/jenkins-slave/tools/hudson.tasks.Maven_MavenInstallation/maven-3.3.3
/home/jenkins/jenkins-slave/slave.jar /home/jenkins/jenkins-slave/maven32-interceptor.jar
/home/jenkins/jenkins-slave/maven3-interceptor-commons.jar 43812
Java HotSpot(TM) 64-Bit Server VM warning: ignoring option MaxPermSize=512m; support was removed
in 8.0
<===[JENKINS REMOTING CAPACITY]===>   channel started
Executing Maven:  -B -f <https://builds.apache.org/job/Tamaya-Master-branch/ws/pom.xml>
-Dmaven.repo.local=/home/jenkins/jenkins-slave/maven-repositories/1 clean install deploy
[INFO] Scanning for projects...
[WARNING] 
[WARNING] Some problems were encountered while building the effective model for org.apache.tamaya.ext:tamaya-spring:bundle:0.2-incubating-SNAPSHOT
[WARNING] 'build.plugins.plugin.version' for org.jacoco:jacoco-maven-plugin is missing. @
org.apache.tamaya.ext:tamaya-spring:[unknown-version], <https://builds.apache.org/job/Tamaya-Master-branch/ws/modules/integration/spring/pom.xml,>
line 40, column 21
[WARNING] 
[WARNING] Some problems were encountered while building the effective model for org.apache.tamaya.ext:tamaya-cdi-se:bundle:0.2-incubating-SNAPSHOT
[WARNING] 'build.plugins.plugin.version' for org.jacoco:jacoco-maven-plugin is missing. @
org.apache.tamaya.ext:tamaya-cdi-se:[unknown-version], <https://builds.apache.org/job/Tamaya-Master-branch/ws/modules/integration/cdi-se/pom.xml,>
line 45, column 21
[WARNING] 
[WARNING] Some problems were encountered while building the effective model for org.apache.tamaya.ext:tamaya-cdi:bundle:0.2-incubating-SNAPSHOT
[WARNING] 'build.plugins.plugin.version' for org.jacoco:jacoco-maven-plugin is missing. @
org.apache.tamaya.ext:tamaya-cdi:[unknown-version], <https://builds.apache.org/job/Tamaya-Master-branch/ws/modules/integration/cdi/pom.xml,>
line 48, column 21
[WARNING] 
[WARNING] Some problems were encountered while building the effective model for org.apache.tamaya.ext:tamaya-osgi-felix:bundle:0.2-incubating-SNAPSHOT
[WARNING] 'dependencies.dependency.scope' for org.jboss.arquillian:arquillian-bom:pom must
be one of [provided, compile, runtime, test, system] but is 'import'. @ org.apache.tamaya.ext:tamaya-osgi-felix:[unknown-version],
<https://builds.apache.org/job/Tamaya-Master-branch/ws/modules/integration/osgi/felix/pom.xml,>
line 84, column 20
[WARNING] 
[WARNING] Some problems were encountered while building the effective model for org.apache.tamaya:tamaya-distribution:jar:0.2-incubating-SNAPSHOT
[WARNING] 'dependencies.dependency.(groupId:artifactId:type:classifier)' must be unique: org.apache.tamaya.ext:tamaya-functions:jar
-> duplicate declaration of version ${project.version} @ org.apache.tamaya:tamaya-distribution:[unknown-version],
<https://builds.apache.org/job/Tamaya-Master-branch/ws/distribution/pom.xml,> line 289,
column 21
[WARNING] 'dependencies.dependency.(groupId:artifactId:type:classifier)' must be unique: org.apache.tamaya.ext:tamaya-functions:jar:sources
-> duplicate declaration of version ${project.version} @ org.apache.tamaya:tamaya-distribution:[unknown-version],
<https://builds.apache.org/job/Tamaya-Master-branch/ws/distribution/pom.xml,> line 294,
column 21
[WARNING] 'dependencies.dependency.(groupId:artifactId:type:classifier)' must be unique: org.apache.tamaya.ext:tamaya-functions:jar:javadoc
-> duplicate declaration of version ${project.version} @ org.apache.tamaya:tamaya-distribution:[unknown-version],
<https://builds.apache.org/job/Tamaya-Master-branch/ws/distribution/pom.xml,> line 300,
column 21
[WARNING] 
[WARNING] It is highly recommended to fix these problems because they threaten the stability
of your build.
[WARNING] 
[WARNING] For this reason, future Maven versions might no longer support building such malformed
projects.
[WARNING] 
[INFO] ------------------------------------------------------------------------
[INFO] Reactor Build Order:
[INFO] 
[INFO] Apache Tamaya
[INFO] Apache Tamaya Build Configuration
[INFO] Apache Tamaya API
[INFO] Apache Tamaya Core Implementation
[INFO] Apache Tamaya Extension Modules
[INFO] Apache Tamaya Resource Services
[INFO] Apache Tamaya Format Services
[INFO] Apache Tamaya SPI Support Classes
[INFO] Apache Tamaya JSON Support
[INFO] Apache Tamaya Builder
[INFO] Apache Tamaya Event and dynamic Update Extensions
[INFO] Apache Tamaya Injection Support API
[INFO] Apache Tamaya Resolver Services
[INFO] Apache Tamaya Extension Modules: Configuration Model Infrastructure
[INFO] Apache Tamaya Injection Support
[INFO] Apache Tamaya Common Functional Extensions
[INFO] Apache Tamaya Modules - Java Management Extensions
[INFO] Apache Tamaya Modules: Server Extension
[INFO] Apache Tamaya Remote PropertySource
[INFO] Apache Tamaya Optional Configuration Backend
[INFO] Apache Tamaya Modules -Classloader Support
[INFO] tamaya-integration
[INFO] Apache Tamaya Modules Integration - Spring
[INFO] Apache Tamaya Modules Integration - CDI (Using SE Injection)
[INFO] Apache Tamaya Modules Integration - CDI (Java EE)
[INFO] Apache Tamaya OSGI Support Projects
[INFO] Apache Tamaya :: OSGi Services :: Tamaya Based OSGI Felix PersistenceManager
[INFO] Apache Tamaya :: OSGi Services :: Tamaya Based Injection
[INFO] Apache Tamaya :: OSGi Services :: Tamaya Based OSGI ConfigAdmin implementation
[INFO] Apache Tamaya Documentation
[INFO] Apache Tamaya Examples
[INFO] Apache Tamaya Example: Minimal Version
[INFO] Apache Tamaya Example: Simple Property Source Version
[INFO] Apache Tamaya Example: Resource Location
[INFO] Apache Tamaya Example: Value Resolution
[INFO] Apache Tamaya Example: File Observer
[INFO] Apache Tamaya Example: Configuration Injection
[INFO] Apache Tamaya Example: Builder
[INFO] Apache Tamaya Example: Remote
[INFO] Apache Tamaya Example: Remote (Server)
[INFO] Apache Tamaya Example: Remote (Client)
[INFO] Apache Tamaya Distribution
[INFO]                                                                         
[INFO] ------------------------------------------------------------------------
[INFO] Building Apache Tamaya 0.2-incubating-SNAPSHOT
[INFO] ------------------------------------------------------------------------
[INFO] 
[INFO] --- maven-clean-plugin:2.5:clean (default-clean) @ tamaya-all ---
[INFO] Deleting <https://builds.apache.org/job/Tamaya-Master-branch/ws/target>
[INFO] 
[INFO] --- maven-enforcer-plugin:1.4:enforce (enforce-versions) @ tamaya-all ---
[INFO] 
[INFO] --- apache-rat-plugin:0.11:check (default) @ tamaya-all ---
[INFO] 58 implicit excludes (use -debug for more details).
[INFO] Exclude: .git
[INFO] Exclude: derby.log
[INFO] Exclude: **/bootstrap-*
[INFO] Exclude: **/js/jquery-*
[INFO] Exclude: **/*.json
[INFO] Exclude: **/*.adoc
[INFO] Exclude: **/*.md
[INFO] 2 resources included (use -debug for more details)
[INFO] Rat check: Summary of files. Unapproved: 0 unknown: 0 generated: 0 approved: 2 licence.
[INFO] 
[INFO] --- maven-remote-resources-plugin:1.5:process (default) @ tamaya-all ---
[INFO] 
[INFO] >>> findbugs-maven-plugin:3.0.1:check (findbugs-analyze) > :findbugs @
tamaya-all >>>
[INFO] 
[INFO] --- findbugs-maven-plugin:3.0.1:findbugs (findbugs) @ tamaya-all ---
[INFO] Downloading: http://nexus.codehaus.org/snapshots/org/apache/tamaya/buildconfigurations/0.2-incubating-SNAPSHOT/maven-metadata.xml
[WARNING] Could not transfer metadata org.apache.tamaya:buildconfigurations:0.2-incubating-SNAPSHOT/maven-metadata.xml
from/to codehaus-snapshots (http://nexus.codehaus.org/snapshots/): nexus.codehaus.org: unknown
error
[WARNING] Failure to transfer org.apache.tamaya:buildconfigurations:0.2-incubating-SNAPSHOT/maven-metadata.xml
from http://nexus.codehaus.org/snapshots/ was cached in the local repository, resolution will
not be reattempted until the update interval of codehaus-snapshots has elapsed or updates
are forced. Original error: Could not transfer metadata org.apache.tamaya:buildconfigurations:0.2-incubating-SNAPSHOT/maven-metadata.xml
from/to codehaus-snapshots (http://nexus.codehaus.org/snapshots/): nexus.codehaus.org: unknown
error
[INFO] Downloading: http://nexus.codehaus.org/snapshots/org/apache/tamaya/buildconfigurations/0.2-incubating-SNAPSHOT/buildconfigurations-0.2-incubating-SNAPSHOT.jar
[WARNING] Failed to getClass for org.codehaus.mojo.findbugs.FindBugsMojo
[WARNING] Failed to getClass for org.codehaus.mojo.findbugs.FindbugsViolationCheckMojo
[WARNING] Failed to getClass for org.codehaus.mojo.findbugs.FindbugsViolationCheckMojo
[INFO] ------------------------------------------------------------------------
[INFO] Reactor Summary:
[INFO] 
[INFO] Apache Tamaya ...................................... FAILURE [  3.975 s]
[INFO] Apache Tamaya Build Configuration .................. SKIPPED
[INFO] Apache Tamaya API .................................. SKIPPED
[INFO] Apache Tamaya Core Implementation .................. SKIPPED
[INFO] Apache Tamaya Extension Modules .................... SKIPPED
[INFO] Apache Tamaya Resource Services .................... SKIPPED
[INFO] Apache Tamaya Format Services ...................... SKIPPED
[INFO] Apache Tamaya SPI Support Classes .................. SKIPPED
[INFO] Apache Tamaya JSON Support ......................... SKIPPED
[INFO] Apache Tamaya Builder .............................. SKIPPED
[INFO] Apache Tamaya Event and dynamic Update Extensions .. SKIPPED
[INFO] Apache Tamaya Injection Support API ................ SKIPPED
[INFO] Apache Tamaya Resolver Services .................... SKIPPED
[INFO] Apache Tamaya Extension Modules: Configuration Model Infrastructure SKIPPED
[INFO] Apache Tamaya Injection Support .................... SKIPPED
[INFO] Apache Tamaya Common Functional Extensions ......... SKIPPED
[INFO] Apache Tamaya Modules - Java Management Extensions . SKIPPED
[INFO] Apache Tamaya Modules: Server Extension ............ SKIPPED
[INFO] Apache Tamaya Remote PropertySource ................ SKIPPED
[INFO] Apache Tamaya Optional Configuration Backend ....... SKIPPED
[INFO] Apache Tamaya Modules -Classloader Support ......... SKIPPED
[INFO] tamaya-integration ................................. SKIPPED
[INFO] Apache Tamaya Modules Integration - Spring ......... SKIPPED
[INFO] Apache Tamaya Modules Integration - CDI (Using SE Injection) SKIPPED
[INFO] Apache Tamaya Modules Integration - CDI (Java EE) .. SKIPPED
[INFO] Apache Tamaya OSGI Support Projects ................ SKIPPED
[INFO] Apache Tamaya :: OSGi Services :: Tamaya Based OSGI Felix PersistenceManager SKIPPED
[INFO] Apache Tamaya :: OSGi Services :: Tamaya Based Injection SKIPPED
[INFO] Apache Tamaya :: OSGi Services :: Tamaya Based OSGI ConfigAdmin implementation SKIPPED
[INFO] Apache Tamaya Documentation ........................ SKIPPED
[INFO] Apache Tamaya Examples ............................. SKIPPED
[INFO] Apache Tamaya Example: Minimal Version ............. SKIPPED
[INFO] Apache Tamaya Example: Simple Property Source Version SKIPPED
[INFO] Apache Tamaya Example: Resource Location ........... SKIPPED
[INFO] Apache Tamaya Example: Value Resolution ............ SKIPPED
[INFO] Apache Tamaya Example: File Observer ............... SKIPPED
[INFO] Apache Tamaya Example: Configuration Injection ..... SKIPPED
[INFO] Apache Tamaya Example: Builder ..................... SKIPPED
[INFO] Apache Tamaya Example: Remote ...................... SKIPPED
[INFO] Apache Tamaya Example: Remote (Server) ............. SKIPPED
[INFO] Apache Tamaya Example: Remote (Client) ............. SKIPPED
[INFO] Apache Tamaya Distribution ......................... SKIPPED
[INFO] ------------------------------------------------------------------------
[INFO] BUILD FAILURE
[INFO] ------------------------------------------------------------------------
[INFO] Total time: 13.109 s
[INFO] Finished at: 2015-11-09T03:28:35+00:00
[INFO] Final Memory: 42M/375M
[INFO] ------------------------------------------------------------------------
[ERROR] Failed to execute goal org.codehaus.mojo:findbugs-maven-plugin:3.0.1:findbugs (findbugs)
on project tamaya-all: Execution findbugs of goal org.codehaus.mojo:findbugs-maven-plugin:3.0.1:findbugs
failed: Plugin org.codehaus.mojo:findbugs-maven-plugin:3.0.1 or one of its dependencies could
not be resolved: Could not transfer artifact org.apache.tamaya:buildconfigurations:jar:0.2-incubating-SNAPSHOT
from/to codehaus-snapshots (http://nexus.codehaus.org/snapshots/): nexus.codehaus.org: Unknown
host nexus.codehaus.org -> [Help 1]
[ERROR] 
[ERROR] To see the full stack trace of the errors, re-run Maven with the -e switch.
[ERROR] Re-run Maven using the -X switch to enable full debug logging.
[ERROR] 
[ERROR] For more information about the errors and possible solutions, please read the following
articles:
[ERROR] [Help 1] http://cwiki.apache.org/confluence/display/MAVEN/PluginResolutionException
[JENKINS] Archiving <https://builds.apache.org/job/Tamaya-Master-branch/ws/modules/injection/pom.xml>
to org.apache.tamaya.ext/tamaya-injection/0.2-incubating-SNAPSHOT/tamaya-injection-0.2-incubating-SNAPSHOT.pom
[JENKINS] Archiving <https://builds.apache.org/job/Tamaya-Master-branch/ws/examples/6-fileobserver-example/pom.xml>
to org.apache.tamaya.examples/tamaya-example-fileobserver/0.2-incubating-SNAPSHOT/tamaya-example-fileobserver-0.2-incubating-SNAPSHOT.pom
[JENKINS] Archiving <https://builds.apache.org/job/Tamaya-Master-branch/ws/modules/integration/osgi/pom.xml>
to org.apache.tamaya.ext/tamaya-osgi/0.2-incubating-SNAPSHOT/tamaya-osgi-0.2-incubating-SNAPSHOT.pom
No prior successful build to compare, so performing full copy of artifacts
[JENKINS] Archiving <https://builds.apache.org/job/Tamaya-Master-branch/ws/examples/8-remote-example/pom.xml>
to org.apache.tamaya.examples/tamaya-example-remote/0.2-incubating-SNAPSHOT/tamaya-example-remote-0.2-incubating-SNAPSHOT.pom
[JENKINS] Archiving <https://builds.apache.org/job/Tamaya-Master-branch/ws/modules/json/pom.xml>
to org.apache.tamaya.ext/tamaya-json/0.2-incubating-SNAPSHOT/tamaya-json-0.2-incubating-SNAPSHOT.pom
[JENKINS] Archiving <https://builds.apache.org/job/Tamaya-Master-branch/ws/examples/7-builder-example/pom.xml>
to org.apache.tamaya.examples/tamaya-example-builder/0.2-incubating-SNAPSHOT/tamaya-example-builder-0.2-incubating-SNAPSHOT.pom
[JENKINS] Archiving <https://builds.apache.org/job/Tamaya-Master-branch/ws/modules/spi-support/pom.xml>
to org.apache.tamaya.ext/tamaya-spisupport/0.2-incubating-SNAPSHOT/tamaya-spisupport-0.2-incubating-SNAPSHOT.pom
[JENKINS] Archiving <https://builds.apache.org/job/Tamaya-Master-branch/ws/examples/1-minimal-example/pom.xml>
to org.apache.tamaya.examples/tamaya-example-minimal/0.2-incubating-SNAPSHOT/tamaya-example-minimal-0.2-incubating-SNAPSHOT.pom
[JENKINS] Archiving <https://builds.apache.org/job/Tamaya-Master-branch/ws/buildconfigurations/pom.xml>
to org.apache.tamaya/buildconfigurations/0.2-incubating-SNAPSHOT/buildconfigurations-0.2-incubating-SNAPSHOT.pom
[JENKINS] Archiving <https://builds.apache.org/job/Tamaya-Master-branch/ws/examples/3-resources-example/pom.xml>
to org.apache.tamaya.examples/tamaya-example-resources/0.2-incubating-SNAPSHOT/tamaya-example-resources-0.2-incubating-SNAPSHOT.pom
[JENKINS] Archiving <https://builds.apache.org/job/Tamaya-Master-branch/ws/examples/8-remote-example/server/pom.xml>
to org.apache.tamaya.examples/tamaya-example-remote-server/0.2-incubating-SNAPSHOT/tamaya-example-remote-server-0.2-incubating-SNAPSHOT.pom
[JENKINS] Archiving <https://builds.apache.org/job/Tamaya-Master-branch/ws/examples/pom.xml>
to org.apache.tamaya.ext/tamaya-examples/0.2-incubating-SNAPSHOT/tamaya-examples-0.2-incubating-SNAPSHOT.pom
[JENKINS] Archiving <https://builds.apache.org/job/Tamaya-Master-branch/ws/modules/integration/osgi/felix/pom.xml>
to org.apache.tamaya.ext/tamaya-osgi-felix/0.2-incubating-SNAPSHOT/tamaya-osgi-felix-0.2-incubating-SNAPSHOT.pom
No prior successful build to compare, so performing full copy of artifacts
[JENKINS] Archiving <https://builds.apache.org/job/Tamaya-Master-branch/ws/examples/8-remote-example/client/pom.xml>
to org.apache.tamaya.examples/tamaya-example-remote-client/0.2-incubating-SNAPSHOT/tamaya-example-remote-client-0.2-incubating-SNAPSHOT.pom
[JENKINS] Archiving <https://builds.apache.org/job/Tamaya-Master-branch/ws/modules/optional/pom.xml>
to org.apache.tamaya.ext/tamaya-optional/0.2-incubating-SNAPSHOT/tamaya-optional-0.2-incubating-SNAPSHOT.pom
[JENKINS] Archiving <https://builds.apache.org/job/Tamaya-Master-branch/ws/modules/injection-api/pom.xml>
to org.apache.tamaya.ext/tamaya-injection-api/0.2-incubating-SNAPSHOT/tamaya-injection-api-0.2-incubating-SNAPSHOT.pom
No prior successful build to compare, so performing full copy of artifacts
[JENKINS] Archiving <https://builds.apache.org/job/Tamaya-Master-branch/ws/modules/integration/cdi-se/pom.xml>
to org.apache.tamaya.ext/tamaya-cdi-se/0.2-incubating-SNAPSHOT/tamaya-cdi-se-0.2-incubating-SNAPSHOT.pom
[JENKINS] Archiving <https://builds.apache.org/job/Tamaya-Master-branch/ws/examples/2-simple-propertysource-example/pom.xml>
to org.apache.tamaya.examples/tamaya-example-simple-propertysource/0.2-incubating-SNAPSHOT/tamaya-example-simple-propertysource-0.2-incubating-SNAPSHOT.pom
[JENKINS] Archiving <https://builds.apache.org/job/Tamaya-Master-branch/ws/modules/resources/pom.xml>
to org.apache.tamaya.ext/tamaya-resources/0.2-incubating-SNAPSHOT/tamaya-resources-0.2-incubating-SNAPSHOT.pom
[JENKINS] Archiving <https://builds.apache.org/job/Tamaya-Master-branch/ws/modules/management/pom.xml>
to org.apache.tamaya.ext/tamaya-management/0.2-incubating-SNAPSHOT/tamaya-management-0.2-incubating-SNAPSHOT.pom
[JENKINS] Archiving <https://builds.apache.org/job/Tamaya-Master-branch/ws/distribution/pom.xml>
to org.apache.tamaya/tamaya-distribution/0.2-incubating-SNAPSHOT/tamaya-distribution-0.2-incubating-SNAPSHOT.pom
[JENKINS] Archiving <https://builds.apache.org/job/Tamaya-Master-branch/ws/modules/integration/spring/pom.xml>
to org.apache.tamaya.ext/tamaya-spring/0.2-incubating-SNAPSHOT/tamaya-spring-0.2-incubating-SNAPSHOT.pom
[JENKINS] Archiving <https://builds.apache.org/job/Tamaya-Master-branch/ws/examples/4-resolver-example/pom.xml>
to org.apache.tamaya.examples/tamaya-example-resolver/0.2-incubating-SNAPSHOT/tamaya-example-resolver-0.2-incubating-SNAPSHOT.pom
[JENKINS] Archiving <https://builds.apache.org/job/Tamaya-Master-branch/ws/modules/events/pom.xml>
to org.apache.tamaya.ext/tamaya-events/0.2-incubating-SNAPSHOT/tamaya-events-0.2-incubating-SNAPSHOT.pom
[JENKINS] Archiving <https://builds.apache.org/job/Tamaya-Master-branch/ws/modules/formats/pom.xml>
to org.apache.tamaya.ext/tamaya-formats/0.2-incubating-SNAPSHOT/tamaya-formats-0.2-incubating-SNAPSHOT.pom
[JENKINS] Archiving <https://builds.apache.org/job/Tamaya-Master-branch/ws/examples/5-injection-example/pom.xml>
to org.apache.tamaya.examples/tamaya-example-injection/0.2-incubating-SNAPSHOT/tamaya-example-injection-0.2-incubating-SNAPSHOT.pom
[JENKINS] Archiving <https://builds.apache.org/job/Tamaya-Master-branch/ws/modules/pom.xml>
to org.apache.tamaya.ext/tamaya-extensions/0.2-incubating-SNAPSHOT/tamaya-extensions-0.2-incubating-SNAPSHOT.pom
[JENKINS] Archiving <https://builds.apache.org/job/Tamaya-Master-branch/ws/api/pom.xml>
to org.apache.tamaya/tamaya-api/0.2-incubating-SNAPSHOT/tamaya-api-0.2-incubating-SNAPSHOT.pom
[JENKINS] Archiving <https://builds.apache.org/job/Tamaya-Master-branch/ws/modules/server/pom.xml>
to org.apache.tamaya.ext/tamaya-server/0.2-incubating-SNAPSHOT/tamaya-server-0.2-incubating-SNAPSHOT.pom
[JENKINS] Archiving <https://builds.apache.org/job/Tamaya-Master-branch/ws/modules/model/pom.xml>
to org.apache.tamaya.ext.model/tamaya-model/0.2-incubating-SNAPSHOT/tamaya-model-0.2-incubating-SNAPSHOT.pom
[JENKINS] Archiving <https://builds.apache.org/job/Tamaya-Master-branch/ws/modules/integration/osgi/injection/pom.xml>
to org.apache.tamaya.ext/tamaya-osgi-injection/0.2-incubating-SNAPSHOT/tamaya-osgi-injection-0.2-incubating-SNAPSHOT.pom
No prior successful build to compare, so performing full copy of artifacts
[JENKINS] Archiving <https://builds.apache.org/job/Tamaya-Master-branch/ws/modules/classloader-support/pom.xml>
to org.apache.tamaya.ext/tamaya-classloader-support/0.2-incubating-SNAPSHOT/tamaya-classloader-support-0.2-incubating-SNAPSHOT.pom
[JENKINS] Archiving <https://builds.apache.org/job/Tamaya-Master-branch/ws/modules/functions/pom.xml>
to org.apache.tamaya.ext/tamaya-functions/0.2-incubating-SNAPSHOT/tamaya-functions-0.2-incubating-SNAPSHOT.pom
[JENKINS] Archiving <https://builds.apache.org/job/Tamaya-Master-branch/ws/modules/remote/pom.xml>
to org.apache.tamaya.ext/tamaya-remote/0.2-incubating-SNAPSHOT/tamaya-remote-0.2-incubating-SNAPSHOT.pom
[JENKINS] Archiving <https://builds.apache.org/job/Tamaya-Master-branch/ws/modules/resolver/pom.xml>
to org.apache.tamaya.ext/tamaya-resolver/0.2-incubating-SNAPSHOT/tamaya-resolver-0.2-incubating-SNAPSHOT.pom
[JENKINS] Archiving <https://builds.apache.org/job/Tamaya-Master-branch/ws/modules/integration/osgi/general/pom.xml>
to org.apache.tamaya.ext/tamaya-osgi-general/0.2-incubating-SNAPSHOT/tamaya-osgi-general-0.2-incubating-SNAPSHOT.pom
No prior successful build to compare, so performing full copy of artifacts
[JENKINS] Archiving <https://builds.apache.org/job/Tamaya-Master-branch/ws/modules/integration/pom.xml>
to org.apache.tamaya.ext/tamaya-integration/0.2-incubating-SNAPSHOT/tamaya-integration-0.2-incubating-SNAPSHOT.pom
[JENKINS] Archiving <https://builds.apache.org/job/Tamaya-Master-branch/ws/core/pom.xml>
to org.apache.tamaya/tamaya-core/0.2-incubating-SNAPSHOT/tamaya-core-0.2-incubating-SNAPSHOT.pom
[JENKINS] Archiving <https://builds.apache.org/job/Tamaya-Master-branch/ws/pom.xml>
to org.apache.tamaya/tamaya-all/0.2-incubating-SNAPSHOT/tamaya-all-0.2-incubating-SNAPSHOT.pom
[JENKINS] Archiving <https://builds.apache.org/job/Tamaya-Master-branch/ws/modules/builder/pom.xml>
to org.apache.tamaya.ext/tamaya-builder/0.2-incubating-SNAPSHOT/tamaya-builder-0.2-incubating-SNAPSHOT.pom
[JENKINS] Archiving <https://builds.apache.org/job/Tamaya-Master-branch/ws/modules/integration/cdi/pom.xml>
to org.apache.tamaya.ext/tamaya-cdi/0.2-incubating-SNAPSHOT/tamaya-cdi-0.2-incubating-SNAPSHOT.pom
[JENKINS] Archiving <https://builds.apache.org/job/Tamaya-Master-branch/ws/docs/pom.xml>
to org.apache.tamaya/tamaya-docs/0.2-incubating-SNAPSHOT/tamaya-docs-0.2-incubating-SNAPSHOT.pom
channel stopped

Mime
View raw message