tamaya-commits mailing list archives

Site index · List index
Message view « Date » · « Thread »
Top « Date » · « Thread »
From Apache Jenkins Server <jenk...@builds.apache.org>
Subject Build failed in Jenkins: Tamaya-Master-branch #424
Date Tue, 03 Nov 2015 00:48:33 GMT
See <https://builds.apache.org/job/Tamaya-Master-branch/424/changes>

Changes:

[anatole] Moved examples to Java 7 as well, to simplify build.

[anatole] OSGI: Added missing implementation.

[anatole] Ignored test, must fix later (added TODO).

------------------------------------------
[...truncated 57 lines...]
[INFO] Downloading: https://repo.maven.apache.org/maven2/org/apache/maven/maven-artifact-manager/2.0.7/maven-artifact-manager-2.0.7.jar
[INFO] Downloaded: https://repo.maven.apache.org/maven2/org/apache/maven/maven-plugin-api/2.0.7/maven-plugin-api-2.0.7.jar
(13 KB at 8.4 KB/sec)
[INFO] Downloading: https://repo.maven.apache.org/maven2/org/apache/maven/maven-monitor/2.0.7/maven-monitor-2.0.7.jar
[INFO] Downloaded: https://repo.maven.apache.org/maven2/org/apache/maven/maven-plugin-descriptor/2.0.7/maven-plugin-descriptor-2.0.7.jar
(37 KB at 24.0 KB/sec)
[INFO] Downloading: https://repo.maven.apache.org/maven2/classworlds/classworlds/1.1/classworlds-1.1.jar
[INFO] Downloaded: https://repo.maven.apache.org/maven2/org/apache/maven/maven-artifact/2.0.7/maven-artifact-2.0.7.jar
(86 KB at 56.9 KB/sec)
[INFO] Downloaded: https://repo.maven.apache.org/maven2/org/apache/maven/maven-project/2.0.7/maven-project-2.0.7.jar
(114 KB at 75.3 KB/sec)
[INFO] Downloaded: https://repo.maven.apache.org/maven2/org/apache/maven/maven-monitor/2.0.7/maven-monitor-2.0.7.jar
(11 KB at 6.6 KB/sec)
[INFO] Downloaded: https://repo.maven.apache.org/maven2/org/apache/maven/maven-artifact-manager/2.0.7/maven-artifact-manager-2.0.7.jar
(56 KB at 36.2 KB/sec)
[INFO] Downloaded: https://repo.maven.apache.org/maven2/classworlds/classworlds/1.1/classworlds-1.1.jar
(37 KB at 23.5 KB/sec)
[INFO] Downloading: https://repo.maven.apache.org/maven2/org/apache/felix/maven-bundle-plugin/2.5.4/maven-bundle-plugin-2.5.4.pom
[INFO] Downloaded: https://repo.maven.apache.org/maven2/org/apache/felix/maven-bundle-plugin/2.5.4/maven-bundle-plugin-2.5.4.pom
(6 KB at 395.2 KB/sec)
[INFO] Downloading: https://repo.maven.apache.org/maven2/org/apache/felix/maven-bundle-plugin/2.5.4/maven-bundle-plugin-2.5.4.jar
[INFO] Downloaded: https://repo.maven.apache.org/maven2/org/apache/felix/maven-bundle-plugin/2.5.4/maven-bundle-plugin-2.5.4.jar
(167 KB at 1677.3 KB/sec)
[WARNING] 
[WARNING] Some problems were encountered while building the effective model for org.apache.tamaya.ext:tamaya-spring:bundle:0.2-incubating-SNAPSHOT
[WARNING] 'build.plugins.plugin.version' for org.jacoco:jacoco-maven-plugin is missing. @
org.apache.tamaya.ext:tamaya-spring:[unknown-version], <https://builds.apache.org/job/Tamaya-Master-branch/ws/modules/integration/spring/pom.xml,>
line 40, column 21
[WARNING] 
[WARNING] Some problems were encountered while building the effective model for org.apache.tamaya.ext:tamaya-cdi-se:bundle:0.2-incubating-SNAPSHOT
[WARNING] 'build.plugins.plugin.version' for org.jacoco:jacoco-maven-plugin is missing. @
org.apache.tamaya.ext:tamaya-cdi-se:[unknown-version], <https://builds.apache.org/job/Tamaya-Master-branch/ws/modules/integration/cdi-se/pom.xml,>
line 45, column 21
[WARNING] 
[WARNING] Some problems were encountered while building the effective model for org.apache.tamaya.ext:tamaya-cdi:bundle:0.2-incubating-SNAPSHOT
[WARNING] 'build.plugins.plugin.version' for org.jacoco:jacoco-maven-plugin is missing. @
org.apache.tamaya.ext:tamaya-cdi:[unknown-version], <https://builds.apache.org/job/Tamaya-Master-branch/ws/modules/integration/cdi/pom.xml,>
line 48, column 21
[WARNING] 
[WARNING] It is highly recommended to fix these problems because they threaten the stability
of your build.
[WARNING] 
[WARNING] For this reason, future Maven versions might no longer support building such malformed
projects.
[WARNING] 
[INFO] ------------------------------------------------------------------------
[INFO] Reactor Build Order:
[INFO] 
[INFO] Apache Tamaya
[INFO] Apache Tamaya Build Configuration
[INFO] Apache Tamaya API
[INFO] Apache Tamaya Core Implementation
[INFO] Apache Tamaya Extension Modules
[INFO] Apache Tamaya Resource Services
[INFO] Apache Tamaya Format Services
[INFO] Apache Tamaya SPI Support Classes
[INFO] Apache Tamaya JSON Support
[INFO] Apache Tamaya Builder
[INFO] Apache Tamaya Event and dynamic Update Extensions
[INFO] Apache Tamaya Injection Support API
[INFO] Apache Tamaya Resolver Services
[INFO] Apache Tamaya Extension Modules: Configuration Model Infrastructure
[INFO] Apache Tamaya Injection Support
[INFO] Apache Tamaya Common Functional Extensions
[INFO] Apache Tamaya Modules - Java Management Extensions
[INFO] Apache Tamaya Modules: Server Extension
[INFO] Apache Tamaya Remote PropertySource
[INFO] Apache Tamaya Optional Configuration Backend
[INFO] Apache Tamaya Modules -Classloader Support
[INFO] tamaya-integration
[INFO] Apache Tamaya Modules Integration - Spring
[INFO] Apache Tamaya Modules Integration - CDI (Using SE Injection)
[INFO] Apache Tamaya Modules Integration - CDI (Java EE)
[INFO] Apache Tamaya OSGI Support Projects
[INFO] Apache Tamaya :: OSGi Services :: Tamaya Based OSGI Felix PersistenceManager
[INFO] Apache Tamaya :: OSGi Services :: Tamaya Based Injection
[INFO] Apache Tamaya :: OSGi Services :: Tamaya Based OSGI ConfigAdmin implementation
[INFO] Apache Tamaya Documentation
[INFO] Apache Tamaya Examples
[INFO] Apache Tamaya Example: Minimal Version
[INFO] Apache Tamaya Example: Simple Property Source Version
[INFO] Apache Tamaya Example: Resource Location
[INFO] Apache Tamaya Example: Value Resolution
[INFO] Apache Tamaya Example: File Observer
[INFO] Apache Tamaya Example: Configuration Injection
[INFO] Apache Tamaya Example: Builder
[INFO] Apache Tamaya Example: Remote
[INFO] Apache Tamaya Example: Remote (Server)
[INFO] Apache Tamaya Example: Remote (Client)
[INFO] Apache Tamaya Distribution
[INFO]                                                                         
[INFO] ------------------------------------------------------------------------
[INFO] Building Apache Tamaya 0.2-incubating-SNAPSHOT
[INFO] ------------------------------------------------------------------------
[INFO] Downloading: https://repo.maven.apache.org/maven2/org/apache/maven/plugins/maven-enforcer-plugin/1.4/maven-enforcer-plugin-1.4.pom
[INFO] Downloaded: https://repo.maven.apache.org/maven2/org/apache/maven/plugins/maven-enforcer-plugin/1.4/maven-enforcer-plugin-1.4.pom
(8 KB at 108.4 KB/sec)
[INFO] Downloading: https://repo.maven.apache.org/maven2/org/apache/maven/enforcer/enforcer/1.4/enforcer-1.4.pom
[INFO] Downloaded: https://repo.maven.apache.org/maven2/org/apache/maven/enforcer/enforcer/1.4/enforcer-1.4.pom
(7 KB at 349.6 KB/sec)
[INFO] Downloading: https://repo.maven.apache.org/maven2/org/apache/maven/plugins/maven-enforcer-plugin/1.4/maven-enforcer-plugin-1.4.jar
[INFO] Downloaded: https://repo.maven.apache.org/maven2/org/apache/maven/plugins/maven-enforcer-plugin/1.4/maven-enforcer-plugin-1.4.jar
(31 KB at 875.8 KB/sec)
[INFO] Downloading: https://repo.maven.apache.org/maven2/org/apache/geronimo/specs/geronimo-annotation_1.2_spec/1.0-alpha-1/geronimo-annotation_1.2_spec-1.0-alpha-1.pom
[INFO] Downloaded: https://repo.maven.apache.org/maven2/org/apache/geronimo/specs/geronimo-annotation_1.2_spec/1.0-alpha-1/geronimo-annotation_1.2_spec-1.0-alpha-1.pom
(4 KB at 67.7 KB/sec)
[INFO] Downloading: https://repo.maven.apache.org/maven2/org/apache/geronimo/specs/geronimo-annotation_1.2_spec/1.0-alpha-1/geronimo-annotation_1.2_spec-1.0-alpha-1.jar
[INFO] Downloaded: https://repo.maven.apache.org/maven2/org/apache/geronimo/specs/geronimo-annotation_1.2_spec/1.0-alpha-1/geronimo-annotation_1.2_spec-1.0-alpha-1.jar
(16 KB at 665.0 KB/sec)
[INFO] 
[INFO] --- maven-clean-plugin:2.5:clean (default-clean) @ tamaya-all ---
[INFO] 
[INFO] --- maven-enforcer-plugin:1.4:enforce (enforce-versions) @ tamaya-all ---
[INFO] Downloading: https://repo.maven.apache.org/maven2/org/apache/maven/enforcer/enforcer-api/1.4/enforcer-api-1.4.pom
[INFO] Downloaded: https://repo.maven.apache.org/maven2/org/apache/maven/enforcer/enforcer-api/1.4/enforcer-api-1.4.pom
(3 KB at 183.9 KB/sec)
[INFO] Downloading: https://repo.maven.apache.org/maven2/org/apache/maven/enforcer/enforcer-rules/1.4/enforcer-rules-1.4.pom
[INFO] Downloaded: https://repo.maven.apache.org/maven2/org/apache/maven/enforcer/enforcer-rules/1.4/enforcer-rules-1.4.pom
(4 KB at 258.5 KB/sec)
[INFO] Downloading: https://repo.maven.apache.org/maven2/org/apache/maven/plugin-testing/maven-plugin-testing-harness/1.3/maven-plugin-testing-harness-1.3.pom
[INFO] Downloaded: https://repo.maven.apache.org/maven2/org/apache/maven/plugin-testing/maven-plugin-testing-harness/1.3/maven-plugin-testing-harness-1.3.pom
(4 KB at 146.4 KB/sec)
[INFO] Downloading: https://repo.maven.apache.org/maven2/org/apache/maven/plugin-testing/maven-plugin-testing/1.3/maven-plugin-testing-1.3.pom
[INFO] Downloaded: https://repo.maven.apache.org/maven2/org/apache/maven/plugin-testing/maven-plugin-testing/1.3/maven-plugin-testing-1.3.pom
(10 KB at 620.6 KB/sec)
[INFO] Downloading: https://repo.maven.apache.org/maven2/org/apache/maven/maven-core/2.2.1/maven-core-2.2.1.jar
[INFO] Downloading: https://repo.maven.apache.org/maven2/org/apache/maven/maven-error-diagnostics/2.2.1/maven-error-diagnostics-2.2.1.jar
[INFO] Downloading: https://repo.maven.apache.org/maven2/org/apache/maven/maven-plugin-parameter-documenter/2.2.1/maven-plugin-parameter-documenter-2.2.1.jar
[INFO] Downloading: https://repo.maven.apache.org/maven2/org/apache/maven/enforcer/enforcer-api/1.4/enforcer-api-1.4.jar
[INFO] Downloading: https://repo.maven.apache.org/maven2/org/apache/maven/maven-monitor/2.2.1/maven-monitor-2.2.1.jar
[INFO] Downloaded: https://repo.maven.apache.org/maven2/org/apache/maven/maven-error-diagnostics/2.2.1/maven-error-diagnostics-2.2.1.jar
(13 KB at 363.3 KB/sec)
[INFO] Downloading: https://repo.maven.apache.org/maven2/org/apache/maven/enforcer/enforcer-rules/1.4/enforcer-rules-1.4.jar
[INFO] Downloaded: https://repo.maven.apache.org/maven2/org/apache/maven/enforcer/enforcer-api/1.4/enforcer-api-1.4.jar
(11 KB at 231.1 KB/sec)
[INFO] Downloading: https://repo.maven.apache.org/maven2/org/apache/maven/plugin-testing/maven-plugin-testing-harness/1.3/maven-plugin-testing-harness-1.3.jar
[INFO] Downloaded: https://repo.maven.apache.org/maven2/org/apache/maven/maven-plugin-parameter-documenter/2.2.1/maven-plugin-parameter-documenter-2.2.1.jar
(22 KB at 394.0 KB/sec)
[INFO] Downloaded: https://repo.maven.apache.org/maven2/org/apache/maven/maven-monitor/2.2.1/maven-monitor-2.2.1.jar
(11 KB at 176.1 KB/sec)
[INFO] Downloaded: https://repo.maven.apache.org/maven2/org/apache/maven/plugin-testing/maven-plugin-testing-harness/1.3/maven-plugin-testing-harness-1.3.jar
(35 KB at 415.5 KB/sec)
[INFO] Downloaded: https://repo.maven.apache.org/maven2/org/apache/maven/enforcer/enforcer-rules/1.4/enforcer-rules-1.4.jar
(97 KB at 852.7 KB/sec)
[INFO] Downloaded: https://repo.maven.apache.org/maven2/org/apache/maven/maven-core/2.2.1/maven-core-2.2.1.jar
(174 KB at 1181.8 KB/sec)
[INFO] 
[INFO] --- apache-rat-plugin:0.11:check (default) @ tamaya-all ---
[INFO] 58 implicit excludes (use -debug for more details).
[INFO] Exclude: .git
[INFO] Exclude: derby.log
[INFO] Exclude: **/bootstrap-*
[INFO] Exclude: **/js/jquery-*
[INFO] Exclude: **/*.json
[INFO] Exclude: **/*.adoc
[INFO] Exclude: **/*.md
[INFO] 2 resources included (use -debug for more details)
[INFO] Rat check: Summary of files. Unapproved: 0 unknown: 0 generated: 0 approved: 2 licence.
[INFO] 
[INFO] --- maven-remote-resources-plugin:1.5:process (default) @ tamaya-all ---
[INFO] 
[INFO] >>> findbugs-maven-plugin:3.0.1:check (findbugs-analyze) > :findbugs @
tamaya-all >>>
[INFO] 
[INFO] --- findbugs-maven-plugin:3.0.1:findbugs (findbugs) @ tamaya-all ---
[INFO] Downloading: http://nexus.codehaus.org/snapshots/org/apache/tamaya/buildconfigurations/0.2-incubating-SNAPSHOT/maven-metadata.xml
[WARNING] Could not transfer metadata org.apache.tamaya:buildconfigurations:0.2-incubating-SNAPSHOT/maven-metadata.xml
from/to codehaus-snapshots (http://nexus.codehaus.org/snapshots/): nexus.codehaus.org: unknown
error
[WARNING] Failure to transfer org.apache.tamaya:buildconfigurations:0.2-incubating-SNAPSHOT/maven-metadata.xml
from http://nexus.codehaus.org/snapshots/ was cached in the local repository, resolution will
not be reattempted until the update interval of codehaus-snapshots has elapsed or updates
are forced. Original error: Could not transfer metadata org.apache.tamaya:buildconfigurations:0.2-incubating-SNAPSHOT/maven-metadata.xml
from/to codehaus-snapshots (http://nexus.codehaus.org/snapshots/): nexus.codehaus.org: unknown
error
[INFO] Downloading: http://nexus.codehaus.org/snapshots/org/apache/tamaya/buildconfigurations/0.2-incubating-SNAPSHOT/buildconfigurations-0.2-incubating-SNAPSHOT.jar
[INFO] Downloading: https://repo.maven.apache.org/maven2/org/apache/maven/wagon/wagon-provider-api/1.0-alpha-6/wagon-provider-api-1.0-alpha-6.jar
[INFO] Downloading: https://repo.maven.apache.org/maven2/org/codehaus/plexus/plexus-classworlds/2.5.2/plexus-classworlds-2.5.2.jar
[INFO] Downloaded: https://repo.maven.apache.org/maven2/org/apache/maven/wagon/wagon-provider-api/1.0-alpha-6/wagon-provider-api-1.0-alpha-6.jar
(42 KB at 1017.7 KB/sec)
[INFO] Downloaded: https://repo.maven.apache.org/maven2/org/codehaus/plexus/plexus-classworlds/2.5.2/plexus-classworlds-2.5.2.jar
(52 KB at 791.5 KB/sec)
[WARNING] Failed to getClass for org.codehaus.mojo.findbugs.FindBugsMojo
[WARNING] Failed to getClass for org.codehaus.mojo.findbugs.FindbugsViolationCheckMojo
[WARNING] Failed to getClass for org.codehaus.mojo.findbugs.FindbugsViolationCheckMojo
[INFO] ------------------------------------------------------------------------
[INFO] Reactor Summary:
[INFO] 
[INFO] Apache Tamaya ...................................... FAILURE [ 10.237 s]
[INFO] Apache Tamaya Build Configuration .................. SKIPPED
[INFO] Apache Tamaya API .................................. SKIPPED
[INFO] Apache Tamaya Core Implementation .................. SKIPPED
[INFO] Apache Tamaya Extension Modules .................... SKIPPED
[INFO] Apache Tamaya Resource Services .................... SKIPPED
[INFO] Apache Tamaya Format Services ...................... SKIPPED
[INFO] Apache Tamaya SPI Support Classes .................. SKIPPED
[INFO] Apache Tamaya JSON Support ......................... SKIPPED
[INFO] Apache Tamaya Builder .............................. SKIPPED
[INFO] Apache Tamaya Event and dynamic Update Extensions .. SKIPPED
[INFO] Apache Tamaya Injection Support API ................ SKIPPED
[INFO] Apache Tamaya Resolver Services .................... SKIPPED
[INFO] Apache Tamaya Extension Modules: Configuration Model Infrastructure SKIPPED
[INFO] Apache Tamaya Injection Support .................... SKIPPED
[INFO] Apache Tamaya Common Functional Extensions ......... SKIPPED
[INFO] Apache Tamaya Modules - Java Management Extensions . SKIPPED
[INFO] Apache Tamaya Modules: Server Extension ............ SKIPPED
[INFO] Apache Tamaya Remote PropertySource ................ SKIPPED
[INFO] Apache Tamaya Optional Configuration Backend ....... SKIPPED
[INFO] Apache Tamaya Modules -Classloader Support ......... SKIPPED
[INFO] tamaya-integration ................................. SKIPPED
[INFO] Apache Tamaya Modules Integration - Spring ......... SKIPPED
[INFO] Apache Tamaya Modules Integration - CDI (Using SE Injection) SKIPPED
[INFO] Apache Tamaya Modules Integration - CDI (Java EE) .. SKIPPED
[INFO] Apache Tamaya OSGI Support Projects ................ SKIPPED
[INFO] Apache Tamaya :: OSGi Services :: Tamaya Based OSGI Felix PersistenceManager SKIPPED
[INFO] Apache Tamaya :: OSGi Services :: Tamaya Based Injection SKIPPED
[INFO] Apache Tamaya :: OSGi Services :: Tamaya Based OSGI ConfigAdmin implementation SKIPPED
[INFO] Apache Tamaya Documentation ........................ SKIPPED
[INFO] Apache Tamaya Examples ............................. SKIPPED
[INFO] Apache Tamaya Example: Minimal Version ............. SKIPPED
[INFO] Apache Tamaya Example: Simple Property Source Version SKIPPED
[INFO] Apache Tamaya Example: Resource Location ........... SKIPPED
[INFO] Apache Tamaya Example: Value Resolution ............ SKIPPED
[INFO] Apache Tamaya Example: File Observer ............... SKIPPED
[INFO] Apache Tamaya Example: Configuration Injection ..... SKIPPED
[INFO] Apache Tamaya Example: Builder ..................... SKIPPED
[INFO] Apache Tamaya Example: Remote ...................... SKIPPED
[INFO] Apache Tamaya Example: Remote (Server) ............. SKIPPED
[INFO] Apache Tamaya Example: Remote (Client) ............. SKIPPED
[INFO] Apache Tamaya Distribution ......................... SKIPPED
[INFO] ------------------------------------------------------------------------
[INFO] BUILD FAILURE
[INFO] ------------------------------------------------------------------------
[INFO] Total time: 34.984 s
[INFO] Finished at: 2015-11-03T00:48:25+00:00
[INFO] Final Memory: 46M/533M
[INFO] ------------------------------------------------------------------------
[ERROR] Failed to execute goal org.codehaus.mojo:findbugs-maven-plugin:3.0.1:findbugs (findbugs)
on project tamaya-all: Execution findbugs of goal org.codehaus.mojo:findbugs-maven-plugin:3.0.1:findbugs
failed: Plugin org.codehaus.mojo:findbugs-maven-plugin:3.0.1 or one of its dependencies could
not be resolved: Could not transfer artifact org.apache.tamaya:buildconfigurations:jar:0.2-incubating-SNAPSHOT
from/to codehaus-snapshots (http://nexus.codehaus.org/snapshots/): nexus.codehaus.org: Unknown
host nexus.codehaus.org -> [Help 1]
[ERROR] 
[ERROR] To see the full stack trace of the errors, re-run Maven with the -e switch.
[ERROR] Re-run Maven using the -X switch to enable full debug logging.
[ERROR] 
[ERROR] For more information about the errors and possible solutions, please read the following
articles:
[ERROR] [Help 1] http://cwiki.apache.org/confluence/display/MAVEN/PluginResolutionException
[JENKINS] Archiving <https://builds.apache.org/job/Tamaya-Master-branch/ws/modules/injection/pom.xml>
to org.apache.tamaya.ext/tamaya-injection/0.2-incubating-SNAPSHOT/tamaya-injection-0.2-incubating-SNAPSHOT.pom
[JENKINS] Archiving <https://builds.apache.org/job/Tamaya-Master-branch/ws/examples/6-fileobserver-example/pom.xml>
to org.apache.tamaya.examples/tamaya-example-fileobserver/0.2-incubating-SNAPSHOT/tamaya-example-fileobserver-0.2-incubating-SNAPSHOT.pom
[JENKINS] Archiving <https://builds.apache.org/job/Tamaya-Master-branch/ws/modules/integration/osgi/pom.xml>
to org.apache.tamaya.ext/tamaya-osgi/0.2-incubating-SNAPSHOT/tamaya-osgi-0.2-incubating-SNAPSHOT.pom
No prior successful build to compare, so performing full copy of artifacts
[JENKINS] Archiving <https://builds.apache.org/job/Tamaya-Master-branch/ws/examples/8-remote-example/pom.xml>
to org.apache.tamaya.examples/tamaya-example-remote/0.2-incubating-SNAPSHOT/tamaya-example-remote-0.2-incubating-SNAPSHOT.pom
[JENKINS] Archiving <https://builds.apache.org/job/Tamaya-Master-branch/ws/modules/json/pom.xml>
to org.apache.tamaya.ext/tamaya-json/0.2-incubating-SNAPSHOT/tamaya-json-0.2-incubating-SNAPSHOT.pom
[JENKINS] Archiving <https://builds.apache.org/job/Tamaya-Master-branch/ws/examples/7-builder-example/pom.xml>
to org.apache.tamaya.examples/tamaya-example-builder/0.2-incubating-SNAPSHOT/tamaya-example-builder-0.2-incubating-SNAPSHOT.pom
[JENKINS] Archiving <https://builds.apache.org/job/Tamaya-Master-branch/ws/modules/spi-support/pom.xml>
to org.apache.tamaya.ext/tamaya-spisupport/0.2-incubating-SNAPSHOT/tamaya-spisupport-0.2-incubating-SNAPSHOT.pom
[JENKINS] Archiving <https://builds.apache.org/job/Tamaya-Master-branch/ws/examples/1-minimal-example/pom.xml>
to org.apache.tamaya.examples/tamaya-example-minimal/0.2-incubating-SNAPSHOT/tamaya-example-minimal-0.2-incubating-SNAPSHOT.pom
[JENKINS] Archiving <https://builds.apache.org/job/Tamaya-Master-branch/ws/buildconfigurations/pom.xml>
to org.apache.tamaya/buildconfigurations/0.2-incubating-SNAPSHOT/buildconfigurations-0.2-incubating-SNAPSHOT.pom
[JENKINS] Archiving <https://builds.apache.org/job/Tamaya-Master-branch/ws/examples/3-resources-example/pom.xml>
to org.apache.tamaya.examples/tamaya-example-resources/0.2-incubating-SNAPSHOT/tamaya-example-resources-0.2-incubating-SNAPSHOT.pom
[JENKINS] Archiving <https://builds.apache.org/job/Tamaya-Master-branch/ws/examples/8-remote-example/server/pom.xml>
to org.apache.tamaya.examples/tamaya-example-remote-server/0.2-incubating-SNAPSHOT/tamaya-example-remote-server-0.2-incubating-SNAPSHOT.pom
[JENKINS] Archiving <https://builds.apache.org/job/Tamaya-Master-branch/ws/examples/pom.xml>
to org.apache.tamaya.ext/tamaya-examples/0.2-incubating-SNAPSHOT/tamaya-examples-0.2-incubating-SNAPSHOT.pom
[JENKINS] Archiving <https://builds.apache.org/job/Tamaya-Master-branch/ws/modules/integration/osgi/felix/pom.xml>
to org.apache.tamaya.ext/tamaya-osgi-felix/0.2-incubating-SNAPSHOT/tamaya-osgi-felix-0.2-incubating-SNAPSHOT.pom
No prior successful build to compare, so performing full copy of artifacts
[JENKINS] Archiving <https://builds.apache.org/job/Tamaya-Master-branch/ws/examples/8-remote-example/client/pom.xml>
to org.apache.tamaya.examples/tamaya-example-remote-client/0.2-incubating-SNAPSHOT/tamaya-example-remote-client-0.2-incubating-SNAPSHOT.pom
[JENKINS] Archiving <https://builds.apache.org/job/Tamaya-Master-branch/ws/modules/optional/pom.xml>
to org.apache.tamaya.ext/tamaya-optional/0.2-incubating-SNAPSHOT/tamaya-optional-0.2-incubating-SNAPSHOT.pom
[JENKINS] Archiving <https://builds.apache.org/job/Tamaya-Master-branch/ws/modules/injection-api/pom.xml>
to org.apache.tamaya.ext/tamaya-injection-api/0.2-incubating-SNAPSHOT/tamaya-injection-api-0.2-incubating-SNAPSHOT.pom
No prior successful build to compare, so performing full copy of artifacts
[JENKINS] Archiving <https://builds.apache.org/job/Tamaya-Master-branch/ws/modules/integration/cdi-se/pom.xml>
to org.apache.tamaya.ext/tamaya-cdi-se/0.2-incubating-SNAPSHOT/tamaya-cdi-se-0.2-incubating-SNAPSHOT.pom
[JENKINS] Archiving <https://builds.apache.org/job/Tamaya-Master-branch/ws/examples/2-simple-propertysource-example/pom.xml>
to org.apache.tamaya.examples/tamaya-example-simple-propertysource/0.2-incubating-SNAPSHOT/tamaya-example-simple-propertysource-0.2-incubating-SNAPSHOT.pom
[JENKINS] Archiving <https://builds.apache.org/job/Tamaya-Master-branch/ws/modules/resources/pom.xml>
to org.apache.tamaya.ext/tamaya-resources/0.2-incubating-SNAPSHOT/tamaya-resources-0.2-incubating-SNAPSHOT.pom
[JENKINS] Archiving <https://builds.apache.org/job/Tamaya-Master-branch/ws/modules/management/pom.xml>
to org.apache.tamaya.ext/tamaya-management/0.2-incubating-SNAPSHOT/tamaya-management-0.2-incubating-SNAPSHOT.pom
[JENKINS] Archiving <https://builds.apache.org/job/Tamaya-Master-branch/ws/distribution/pom.xml>
to org.apache.tamaya/tamaya-distribution/0.2-incubating-SNAPSHOT/tamaya-distribution-0.2-incubating-SNAPSHOT.pom
[JENKINS] Archiving <https://builds.apache.org/job/Tamaya-Master-branch/ws/modules/integration/spring/pom.xml>
to org.apache.tamaya.ext/tamaya-spring/0.2-incubating-SNAPSHOT/tamaya-spring-0.2-incubating-SNAPSHOT.pom
[JENKINS] Archiving <https://builds.apache.org/job/Tamaya-Master-branch/ws/examples/4-resolver-example/pom.xml>
to org.apache.tamaya.examples/tamaya-example-resolver/0.2-incubating-SNAPSHOT/tamaya-example-resolver-0.2-incubating-SNAPSHOT.pom
[JENKINS] Archiving <https://builds.apache.org/job/Tamaya-Master-branch/ws/modules/events/pom.xml>
to org.apache.tamaya.ext/tamaya-events/0.2-incubating-SNAPSHOT/tamaya-events-0.2-incubating-SNAPSHOT.pom
[JENKINS] Archiving <https://builds.apache.org/job/Tamaya-Master-branch/ws/modules/formats/pom.xml>
to org.apache.tamaya.ext/tamaya-formats/0.2-incubating-SNAPSHOT/tamaya-formats-0.2-incubating-SNAPSHOT.pom
[JENKINS] Archiving <https://builds.apache.org/job/Tamaya-Master-branch/ws/examples/5-injection-example/pom.xml>
to org.apache.tamaya.examples/tamaya-example-injection/0.2-incubating-SNAPSHOT/tamaya-example-injection-0.2-incubating-SNAPSHOT.pom
[JENKINS] Archiving <https://builds.apache.org/job/Tamaya-Master-branch/ws/modules/pom.xml>
to org.apache.tamaya.ext/tamaya-extensions/0.2-incubating-SNAPSHOT/tamaya-extensions-0.2-incubating-SNAPSHOT.pom
[JENKINS] Archiving <https://builds.apache.org/job/Tamaya-Master-branch/ws/api/pom.xml>
to org.apache.tamaya/tamaya-api/0.2-incubating-SNAPSHOT/tamaya-api-0.2-incubating-SNAPSHOT.pom
[JENKINS] Archiving <https://builds.apache.org/job/Tamaya-Master-branch/ws/modules/server/pom.xml>
to org.apache.tamaya.ext/tamaya-server/0.2-incubating-SNAPSHOT/tamaya-server-0.2-incubating-SNAPSHOT.pom
[JENKINS] Archiving <https://builds.apache.org/job/Tamaya-Master-branch/ws/modules/model/pom.xml>
to org.apache.tamaya.ext.model/tamaya-model/0.2-incubating-SNAPSHOT/tamaya-model-0.2-incubating-SNAPSHOT.pom
[JENKINS] Archiving <https://builds.apache.org/job/Tamaya-Master-branch/ws/modules/integration/osgi/injection/pom.xml>
to org.apache.tamaya.ext/tamaya-osgi-injection/0.2-incubating-SNAPSHOT/tamaya-osgi-injection-0.2-incubating-SNAPSHOT.pom
No prior successful build to compare, so performing full copy of artifacts
[JENKINS] Archiving <https://builds.apache.org/job/Tamaya-Master-branch/ws/modules/classloader-support/pom.xml>
to org.apache.tamaya.ext/tamaya-classloader-support/0.2-incubating-SNAPSHOT/tamaya-classloader-support-0.2-incubating-SNAPSHOT.pom
[JENKINS] Archiving <https://builds.apache.org/job/Tamaya-Master-branch/ws/modules/functions/pom.xml>
to org.apache.tamaya.ext/tamaya-functions/0.2-incubating-SNAPSHOT/tamaya-functions-0.2-incubating-SNAPSHOT.pom
[JENKINS] Archiving <https://builds.apache.org/job/Tamaya-Master-branch/ws/modules/remote/pom.xml>
to org.apache.tamaya.ext/tamaya-remote/0.2-incubating-SNAPSHOT/tamaya-remote-0.2-incubating-SNAPSHOT.pom
[JENKINS] Archiving <https://builds.apache.org/job/Tamaya-Master-branch/ws/modules/resolver/pom.xml>
to org.apache.tamaya.ext/tamaya-resolver/0.2-incubating-SNAPSHOT/tamaya-resolver-0.2-incubating-SNAPSHOT.pom
[JENKINS] Archiving <https://builds.apache.org/job/Tamaya-Master-branch/ws/modules/integration/osgi/general/pom.xml>
to org.apache.tamaya.ext/tamaya-osgi-general/0.2-incubating-SNAPSHOT/tamaya-osgi-general-0.2-incubating-SNAPSHOT.pom
No prior successful build to compare, so performing full copy of artifacts
[JENKINS] Archiving <https://builds.apache.org/job/Tamaya-Master-branch/ws/modules/integration/pom.xml>
to org.apache.tamaya.ext/tamaya-integration/0.2-incubating-SNAPSHOT/tamaya-integration-0.2-incubating-SNAPSHOT.pom
[JENKINS] Archiving <https://builds.apache.org/job/Tamaya-Master-branch/ws/core/pom.xml>
to org.apache.tamaya/tamaya-core/0.2-incubating-SNAPSHOT/tamaya-core-0.2-incubating-SNAPSHOT.pom
[JENKINS] Archiving <https://builds.apache.org/job/Tamaya-Master-branch/ws/pom.xml>
to org.apache.tamaya/tamaya-all/0.2-incubating-SNAPSHOT/tamaya-all-0.2-incubating-SNAPSHOT.pom
[JENKINS] Archiving <https://builds.apache.org/job/Tamaya-Master-branch/ws/modules/builder/pom.xml>
to org.apache.tamaya.ext/tamaya-builder/0.2-incubating-SNAPSHOT/tamaya-builder-0.2-incubating-SNAPSHOT.pom
[JENKINS] Archiving <https://builds.apache.org/job/Tamaya-Master-branch/ws/modules/integration/cdi/pom.xml>
to org.apache.tamaya.ext/tamaya-cdi/0.2-incubating-SNAPSHOT/tamaya-cdi-0.2-incubating-SNAPSHOT.pom
[JENKINS] Archiving <https://builds.apache.org/job/Tamaya-Master-branch/ws/docs/pom.xml>
to org.apache.tamaya/tamaya-docs/0.2-incubating-SNAPSHOT/tamaya-docs-0.2-incubating-SNAPSHOT.pom
channel stopped

Mime
View raw message