tamaya-commits mailing list archives

Site index · List index
Message view « Date » · « Thread »
Top « Date » · « Thread »
From Apache Jenkins Server <jenk...@builds.apache.org>
Subject Build failed in Jenkins: Tamaya-Master-branch #403
Date Tue, 06 Oct 2015 07:57:14 GMT
See <https://builds.apache.org/job/Tamaya-Master-branch/403/changes>

Changes:

[anatole] TAMAYA-114: Added base module with common SPI implementations.

[anatole] TAMAYA-114: Added base module with common SPI implementations.

[anatole] Implemented multi classpath environment PropertySourceProvider, with

[anatole] TAMAYA-115: Implemented multi classpath environment

[anatole] Renamed some annotations to align with new CDI based injection

[anatole] Added support for enrich PropertySources and Configs.

[anatole] Implemented multi classpath environment PropertySourceProvider, with

[anatole] Added javadocs and test fixes.

[anatole] TAMAYA-116: Added first integration code for Sabot CDI injection

------------------------------------------
Started by an SCM change
[EnvInject] - Loading node environment variables.
Building remotely on ubuntu3 (Ubuntu ubuntu legacy-ubuntu) in workspace <https://builds.apache.org/job/Tamaya-Master-branch/ws/>
 > git rev-parse --is-inside-work-tree # timeout=10
Fetching changes from the remote Git repository
 > git config remote.origin.url https://git-wip-us.apache.org/repos/asf/incubator-tamaya.git
# timeout=10
Fetching upstream changes from https://git-wip-us.apache.org/repos/asf/incubator-tamaya.git
 > git --version # timeout=10
 > git -c core.askpass=true fetch --tags --progress https://git-wip-us.apache.org/repos/asf/incubator-tamaya.git
+refs/heads/*:refs/remotes/origin/*
 > git rev-parse refs/remotes/origin/master^{commit} # timeout=10
 > git rev-parse refs/remotes/origin/origin/master^{commit} # timeout=10
Checking out Revision d0f38b68831787fd410385d9d47b81962bc70b6e (refs/remotes/origin/master)
 > git config core.sparsecheckout # timeout=10
 > git checkout -f d0f38b68831787fd410385d9d47b81962bc70b6e
 > git rev-list be2d6b8e2178f06a1bc3a651ca71c25b8dfe5d79 # timeout=10
Parsing POMs
ERROR: Failed to parse POMs
java.io.IOException: remote file operation failed: <https://builds.apache.org/job/Tamaya-Master-branch/ws/>
at hudson.remoting.Channel@390dfa46:ubuntu3: hudson.remoting.ProxyException: hudson.maven.MavenModuleSetBuild$MavenExecutionException:
org.apache.maven.project.ProjectBuildingException: Some problems were encountered while processing
the POMs:
[WARNING] 'dependencies.dependency.scope' for org.apache.tamaya:tamaya-core:jar must be one
of [provided, compile, runtime, test, system] but is 'Test'. @ line 52, column 20
[ERROR] Child module <https://builds.apache.org/job/Tamaya-Master-branch/ws/modules/integration/cdi>
of <https://builds.apache.org/job/Tamaya-Master-branch/ws/modules/integration/pom.xml>
does not exist @ 

	at hudson.FilePath.act(FilePath.java:985)
	at hudson.FilePath.act(FilePath.java:967)
	at hudson.maven.MavenModuleSetBuild$MavenModuleSetBuildExecution.parsePoms(MavenModuleSetBuild.java:960)
	at hudson.maven.MavenModuleSetBuild$MavenModuleSetBuildExecution.doRun(MavenModuleSetBuild.java:679)
	at hudson.model.AbstractBuild$AbstractBuildExecution.run(AbstractBuild.java:536)
	at hudson.model.Run.execute(Run.java:1738)
	at hudson.maven.MavenModuleSetBuild.run(MavenModuleSetBuild.java:531)
	at hudson.model.ResourceController.execute(ResourceController.java:98)
	at hudson.model.Executor.run(Executor.java:381)
Caused by: hudson.remoting.ProxyException: hudson.maven.MavenModuleSetBuild$MavenExecutionException:
org.apache.maven.project.ProjectBuildingException: Some problems were encountered while processing
the POMs:
[WARNING] 'dependencies.dependency.scope' for org.apache.tamaya:tamaya-core:jar must be one
of [provided, compile, runtime, test, system] but is 'Test'. @ line 52, column 20
[ERROR] Child module <https://builds.apache.org/job/Tamaya-Master-branch/ws/modules/integration/cdi>
of <https://builds.apache.org/job/Tamaya-Master-branch/ws/modules/integration/pom.xml>
does not exist @ 

	at hudson.maven.MavenModuleSetBuild$PomParser.invoke(MavenModuleSetBuild.java:1364)
	at hudson.maven.MavenModuleSetBuild$PomParser.invoke(MavenModuleSetBuild.java:1098)
	at hudson.FilePath$FileCallableWrapper.call(FilePath.java:2688)
	at hudson.remoting.UserRequest.perform(UserRequest.java:121)
	at hudson.remoting.UserRequest.perform(UserRequest.java:49)
	at hudson.remoting.Request$2.run(Request.java:326)
	at hudson.remoting.InterceptingExecutorService$1.call(InterceptingExecutorService.java:68)
	at java.util.concurrent.FutureTask.run(FutureTask.java:262)
	at java.util.concurrent.ThreadPoolExecutor.runWorker(ThreadPoolExecutor.java:1145)
	at java.util.concurrent.ThreadPoolExecutor$Worker.run(ThreadPoolExecutor.java:615)
	at java.lang.Thread.run(Thread.java:745)
	at ......remote call to ubuntu3(Native Method)
	at hudson.remoting.Channel.attachCallSiteStackTrace(Channel.java:1413)
	at hudson.remoting.UserResponse.retrieve(UserRequest.java:221)
	at hudson.remoting.Channel.call(Channel.java:778)
	at hudson.FilePath.act(FilePath.java:978)
	... 8 more
Caused by: hudson.remoting.ProxyException: org.apache.maven.project.ProjectBuildingException:
Some problems were encountered while processing the POMs:
[WARNING] 'dependencies.dependency.scope' for org.apache.tamaya:tamaya-core:jar must be one
of [provided, compile, runtime, test, system] but is 'Test'. @ line 52, column 20
[ERROR] Child module <https://builds.apache.org/job/Tamaya-Master-branch/ws/modules/integration/cdi>
of <https://builds.apache.org/job/Tamaya-Master-branch/ws/modules/integration/pom.xml>
does not exist @ 

	at org.apache.maven.project.DefaultProjectBuilder.build(DefaultProjectBuilder.java:364)
	at hudson.maven.MavenEmbedder.buildProjects(MavenEmbedder.java:361)
	at hudson.maven.MavenEmbedder.readProjects(MavenEmbedder.java:331)
	at hudson.maven.MavenModuleSetBuild$PomParser.invoke(MavenModuleSetBuild.java:1301)
	at hudson.maven.MavenModuleSetBuild$PomParser.invoke(MavenModuleSetBuild.java:1098)
	at hudson.FilePath$FileCallableWrapper.call(FilePath.java:2688)
	at hudson.remoting.UserRequest.perform(UserRequest.java:121)
	at hudson.remoting.UserRequest.perform(UserRequest.java:49)
	at hudson.remoting.Request$2.run(Request.java:326)
	at hudson.remoting.InterceptingExecutorService$1.call(InterceptingExecutorService.java:68)
	at java.util.concurrent.FutureTask.run(FutureTask.java:262)
	at java.util.concurrent.ThreadPoolExecutor.runWorker(ThreadPoolExecutor.java:1145)
	at java.util.concurrent.ThreadPoolExecutor$Worker.run(ThreadPoolExecutor.java:615)
	at java.lang.Thread.run(Thread.java:745)

Mime
View raw message