tamaya-commits mailing list archives

Site index · List index
Message view « Date » · « Thread »
Top « Date » · « Thread »
From Apache Jenkins Server <jenk...@builds.apache.org>
Subject Build failed in Jenkins: Tamaya-Master-branch #395
Date Thu, 01 Oct 2015 17:43:23 GMT
See <https://builds.apache.org/job/Tamaya-Master-branch/395/changes>

Changes:

[anatole] TAMAYA-113: Added default getters: fixed implementations of Config.

------------------------------------------
[...truncated 300 lines...]
[INFO] 3 resources included (use -debug for more details)
[INFO] Rat check: Summary of files. Unapproved: 0 unknown: 0 generated: 0 approved: 3 licence.
[WARNING] Failed to getClass for org.apache.maven.plugin.source.SourceJarMojo
[INFO] 
[INFO] <<< maven-source-plugin:2.4:jar (source-jar) @ buildconfigurations <<<
[INFO] 
[INFO] --- maven-source-plugin:2.4:jar (source-jar) @ buildconfigurations ---
[INFO] Building jar: <https://builds.apache.org/job/Tamaya-Master-branch/ws/buildconfigurations/target/buildconfigurations-0.2-incubating-SNAPSHOT-sources.jar>
[INFO] 
[INFO] --- maven-failsafe-plugin:2.18.1:integration-test (default) @ buildconfigurations ---
[INFO] Tests are skipped.
[INFO] 
[INFO] --- maven-failsafe-plugin:2.18.1:verify (default) @ buildconfigurations ---
[INFO] Tests are skipped.
[INFO] 
[INFO] --- maven-install-plugin:2.5.2:install (default-install) @ buildconfigurations ---
[INFO] Installing <https://builds.apache.org/job/Tamaya-Master-branch/ws/buildconfigurations/target/buildconfigurations-0.2-incubating-SNAPSHOT.jar>
to /home/jenkins/jenkins-slave/maven-repositories/1/org/apache/tamaya/buildconfigurations/0.2-incubating-SNAPSHOT/buildconfigurations-0.2-incubating-SNAPSHOT.jar
[INFO] Installing <https://builds.apache.org/job/Tamaya-Master-branch/ws/buildconfigurations/pom.xml>
to /home/jenkins/jenkins-slave/maven-repositories/1/org/apache/tamaya/buildconfigurations/0.2-incubating-SNAPSHOT/buildconfigurations-0.2-incubating-SNAPSHOT.pom
[INFO] Installing <https://builds.apache.org/job/Tamaya-Master-branch/ws/buildconfigurations/target/buildconfigurations-0.2-incubating-SNAPSHOT-sources.jar>
to /home/jenkins/jenkins-slave/maven-repositories/1/org/apache/tamaya/buildconfigurations/0.2-incubating-SNAPSHOT/buildconfigurations-0.2-incubating-SNAPSHOT-sources.jar
[INFO] 
[INFO] --- maven-enforcer-plugin:1.4:enforce (enforce-versions) @ buildconfigurations ---
[INFO] 
[INFO] --- apache-rat-plugin:0.11:check (default) @ buildconfigurations ---
[INFO] 51 implicit excludes (use -debug for more details).
[INFO] Exclude: .git
[INFO] Exclude: derby.log
[INFO] Exclude: **/bootstrap-*
[INFO] Exclude: **/js/jquery-*
[INFO] Exclude: **/*.json
[INFO] Exclude: **/*.adoc
[INFO] Exclude: **/*.md
[INFO] 3 resources included (use -debug for more details)
[INFO] Rat check: Summary of files. Unapproved: 0 unknown: 0 generated: 0 approved: 3 licence.
[INFO] 
[INFO] --- maven-remote-resources-plugin:1.5:process (default) @ buildconfigurations ---
[INFO] 
[INFO] --- maven-resources-plugin:2.7:resources (default-resources) @ buildconfigurations
---
[INFO] Using 'UTF-8' encoding to copy filtered resources.
[INFO] Copying 2 resources
[INFO] Copying 3 resources
[INFO] Copying 3 resources
[INFO] 
[INFO] --- maven-compiler-plugin:3.1:compile (default-compile) @ buildconfigurations ---
[INFO] No sources to compile
[INFO] 
[INFO] >>> findbugs-maven-plugin:3.0.0:check (findbugs-analyze) @ buildconfigurations
>>>
[INFO] 
[INFO] --- findbugs-maven-plugin:3.0.0:findbugs (findbugs) @ buildconfigurations ---
[INFO] 
[INFO] <<< findbugs-maven-plugin:3.0.0:check (findbugs-analyze) @ buildconfigurations
<<<
[INFO] 
[INFO] --- findbugs-maven-plugin:3.0.0:check (findbugs-analyze) @ buildconfigurations ---
[INFO] 
[INFO] --- maven-resources-plugin:2.7:testResources (default-testResources) @ buildconfigurations
---
[INFO] Using 'UTF-8' encoding to copy filtered resources.
[INFO] skip non existing resourceDirectory <https://builds.apache.org/job/Tamaya-Master-branch/ws/buildconfigurations/src/test/resources>
[INFO] Copying 3 resources
[INFO] Copying 3 resources
[INFO] 
[INFO] --- maven-compiler-plugin:3.1:testCompile (default-testCompile) @ buildconfigurations
---
[INFO] No sources to compile
[INFO] 
[INFO] --- maven-surefire-plugin:2.18.1:test (default-test) @ buildconfigurations ---
[INFO] Tests are skipped.
[INFO] 
[INFO] --- maven-jar-plugin:2.5:jar (default-jar) @ buildconfigurations ---
[INFO] 
[INFO] --- maven-site-plugin:3.4:attach-descriptor (attach-descriptor) @ buildconfigurations
---
[INFO] 
[INFO] --- maven-javadoc-plugin:2.9.1:jar (attach-javadocs) @ buildconfigurations ---
[INFO] 
[INFO] >>> maven-source-plugin:2.4:jar (source-jar) @ buildconfigurations >>>
[INFO] 
[INFO] --- maven-enforcer-plugin:1.4:enforce (enforce-versions) @ buildconfigurations ---
[INFO] 
[INFO] --- apache-rat-plugin:0.11:check (default) @ buildconfigurations ---
[INFO] 51 implicit excludes (use -debug for more details).
[INFO] Exclude: .git
[INFO] Exclude: derby.log
[INFO] Exclude: **/bootstrap-*
[INFO] Exclude: **/js/jquery-*
[INFO] Exclude: **/*.json
[INFO] Exclude: **/*.adoc
[INFO] Exclude: **/*.md
[INFO] 3 resources included (use -debug for more details)
[INFO] Rat check: Summary of files. Unapproved: 0 unknown: 0 generated: 0 approved: 3 licence.
[WARNING] Failed to getClass for org.apache.maven.plugin.source.SourceJarMojo
[INFO] 
[INFO] <<< maven-source-plugin:2.4:jar (source-jar) @ buildconfigurations <<<
[INFO] 
[INFO] --- maven-source-plugin:2.4:jar (source-jar) @ buildconfigurations ---
[INFO] 
[INFO] --- maven-failsafe-plugin:2.18.1:integration-test (default) @ buildconfigurations ---
[INFO] Tests are skipped.
[INFO] 
[INFO] --- maven-failsafe-plugin:2.18.1:verify (default) @ buildconfigurations ---
[INFO] Tests are skipped.
[INFO] 
[INFO] --- maven-install-plugin:2.5.2:install (default-install) @ buildconfigurations ---
[INFO] Installing <https://builds.apache.org/job/Tamaya-Master-branch/ws/buildconfigurations/target/buildconfigurations-0.2-incubating-SNAPSHOT.jar>
to /home/jenkins/jenkins-slave/maven-repositories/1/org/apache/tamaya/buildconfigurations/0.2-incubating-SNAPSHOT/buildconfigurations-0.2-incubating-SNAPSHOT.jar
[INFO] Installing <https://builds.apache.org/job/Tamaya-Master-branch/ws/buildconfigurations/pom.xml>
to /home/jenkins/jenkins-slave/maven-repositories/1/org/apache/tamaya/buildconfigurations/0.2-incubating-SNAPSHOT/buildconfigurations-0.2-incubating-SNAPSHOT.pom
[INFO] Installing <https://builds.apache.org/job/Tamaya-Master-branch/ws/buildconfigurations/target/buildconfigurations-0.2-incubating-SNAPSHOT-sources.jar>
to /home/jenkins/jenkins-slave/maven-repositories/1/org/apache/tamaya/buildconfigurations/0.2-incubating-SNAPSHOT/buildconfigurations-0.2-incubating-SNAPSHOT-sources.jar
[INFO] 
[INFO] --- maven-deploy-plugin:2.8.2:deploy (default-deploy) @ buildconfigurations ---
[INFO] Downloading: https://repository.apache.org/content/repositories/snapshots/org/apache/tamaya/buildconfigurations/0.2-incubating-SNAPSHOT/maven-metadata.xml
[INFO] Downloaded: https://repository.apache.org/content/repositories/snapshots/org/apache/tamaya/buildconfigurations/0.2-incubating-SNAPSHOT/maven-metadata.xml
(2 KB at 3.8 KB/sec)
[INFO] Uploading: https://repository.apache.org/content/repositories/snapshots/org/apache/tamaya/buildconfigurations/0.2-incubating-SNAPSHOT/buildconfigurations-0.2-incubating-20151001.174343-30.jar
[INFO] Uploaded: https://repository.apache.org/content/repositories/snapshots/org/apache/tamaya/buildconfigurations/0.2-incubating-SNAPSHOT/buildconfigurations-0.2-incubating-20151001.174343-30.jar
(9 KB at 28.9 KB/sec)
[INFO] Uploading: https://repository.apache.org/content/repositories/snapshots/org/apache/tamaya/buildconfigurations/0.2-incubating-SNAPSHOT/buildconfigurations-0.2-incubating-20151001.174343-30.pom
[INFO] Uploaded: https://repository.apache.org/content/repositories/snapshots/org/apache/tamaya/buildconfigurations/0.2-incubating-SNAPSHOT/buildconfigurations-0.2-incubating-20151001.174343-30.pom
(2 KB at 35.7 KB/sec)
[INFO] Downloading: https://repository.apache.org/content/repositories/snapshots/org/apache/tamaya/buildconfigurations/maven-metadata.xml
[INFO] Downloaded: https://repository.apache.org/content/repositories/snapshots/org/apache/tamaya/buildconfigurations/maven-metadata.xml
(374 B at 0.6 KB/sec)
[INFO] Uploading: https://repository.apache.org/content/repositories/snapshots/org/apache/tamaya/buildconfigurations/0.2-incubating-SNAPSHOT/maven-metadata.xml
[INFO] Uploaded: https://repository.apache.org/content/repositories/snapshots/org/apache/tamaya/buildconfigurations/0.2-incubating-SNAPSHOT/maven-metadata.xml
(2 KB at 10.3 KB/sec)
[INFO] Uploading: https://repository.apache.org/content/repositories/snapshots/org/apache/tamaya/buildconfigurations/maven-metadata.xml
[INFO] Uploaded: https://repository.apache.org/content/repositories/snapshots/org/apache/tamaya/buildconfigurations/maven-metadata.xml
(374 B at 6.1 KB/sec)
[INFO] Uploading: https://repository.apache.org/content/repositories/snapshots/org/apache/tamaya/buildconfigurations/0.2-incubating-SNAPSHOT/buildconfigurations-0.2-incubating-20151001.174343-30-sources.jar
[INFO] Uploaded: https://repository.apache.org/content/repositories/snapshots/org/apache/tamaya/buildconfigurations/0.2-incubating-SNAPSHOT/buildconfigurations-0.2-incubating-20151001.174343-30-sources.jar
(9 KB at 170.9 KB/sec)
[INFO] Uploading: https://repository.apache.org/content/repositories/snapshots/org/apache/tamaya/buildconfigurations/0.2-incubating-SNAPSHOT/maven-metadata.xml
[INFO] Uploaded: https://repository.apache.org/content/repositories/snapshots/org/apache/tamaya/buildconfigurations/0.2-incubating-SNAPSHOT/maven-metadata.xml
(2 KB at 23.1 KB/sec)
[INFO]                                                                         
[INFO] ------------------------------------------------------------------------
[INFO] Building Apache Tamaya API 0.2-incubating-SNAPSHOT
[INFO] ------------------------------------------------------------------------
[INFO] 
[INFO] --- maven-clean-plugin:2.5:clean (default-clean) @ tamaya-api ---
[INFO] Deleting <https://builds.apache.org/job/Tamaya-Master-branch/ws/api/target>
[INFO] 
[INFO] --- maven-enforcer-plugin:1.4:enforce (enforce-versions) @ tamaya-api ---
[INFO] 
[INFO] --- apache-rat-plugin:0.11:check (default) @ tamaya-api ---
[INFO] 51 implicit excludes (use -debug for more details).
[INFO] Exclude: .git
[INFO] Exclude: derby.log
[INFO] Exclude: **/bootstrap-*
[INFO] Exclude: **/js/jquery-*
[INFO] Exclude: **/*.json
[INFO] Exclude: **/*.adoc
[INFO] Exclude: **/*.md
[INFO] 26 resources included (use -debug for more details)
[INFO] Rat check: Summary of files. Unapproved: 0 unknown: 0 generated: 0 approved: 26 licence.
[INFO] 
[INFO] --- maven-remote-resources-plugin:1.5:process (default) @ tamaya-api ---
[INFO] 
[INFO] --- maven-resources-plugin:2.7:resources (default-resources) @ tamaya-api ---
[INFO] Using 'UTF-8' encoding to copy filtered resources.
[INFO] skip non existing resourceDirectory <https://builds.apache.org/job/Tamaya-Master-branch/ws/api/src/main/resources>
[INFO] Copying 3 resources
[INFO] 
[INFO] --- maven-compiler-plugin:3.1:compile (default-compile) @ tamaya-api ---
[INFO] Changes detected - recompiling the module!
[INFO] Compiling 16 source files to <https://builds.apache.org/job/Tamaya-Master-branch/ws/api/target/classes>
[WARNING] bootstrap class path not set in conjunction with -source 1.7
[WARNING] <https://builds.apache.org/job/Tamaya-Master-branch/ws/api/src/main/java/org/apache/tamaya/TypeLiteral.java>:
<https://builds.apache.org/job/Tamaya-Master-branch/ws/api/src/main/java/org/apache/tamaya/TypeLiteral.java>
uses unchecked or unsafe operations.
[WARNING] <https://builds.apache.org/job/Tamaya-Master-branch/ws/api/src/main/java/org/apache/tamaya/TypeLiteral.java>:
Recompile with -Xlint:unchecked for details.
[INFO] 
[INFO] >>> findbugs-maven-plugin:3.0.0:check (findbugs-analyze) @ tamaya-api >>>
[INFO] 
[INFO] --- findbugs-maven-plugin:3.0.0:findbugs (findbugs) @ tamaya-api ---
[INFO] Fork Value is true
[INFO] ------------------------------------------------------------------------
[INFO] Reactor Summary:
[INFO] 
[INFO] Apache Tamaya ..................................... SUCCESS [ 19.728 s]
[INFO] Apache Tamaya Build Configuration ................. SUCCESS [  4.912 s]
[INFO] Apache Tamaya API ................................. FAILURE [  1.266 s]
[INFO] Apache Tamaya Core Implementation ................. SKIPPED
[INFO] Apache Tamaya Extension Modules ................... SKIPPED
[INFO] Apache Tamaya Resource Services ................... SKIPPED
[INFO] Apache Tamaya Format Services ..................... SKIPPED
[INFO] Apache Tamaya JSON Support ........................ SKIPPED
[INFO] Apache Tamaya Builder ............................. SKIPPED
[INFO] Apache Tamaya Event and dynamic Update Extensions . SKIPPED
[INFO] Apache Tamaya Resolver Services ................... SKIPPED
[INFO] Apache Tamaya Extension Modules: Configuration Model Infrastructure  SKIPPED
[INFO] Apache Tamaya Injection Support ................... SKIPPED
[INFO] Apache Tamaya Common Functional Extensions ........ SKIPPED
[INFO] Apache Tamaya Modules - Java Management Extensions  SKIPPED
[INFO] Apache Tamaya Modules: Server Extension ........... SKIPPED
[INFO] Apache Tamaya Remote PropertySource ............... SKIPPED
[INFO] Apache Tamaya Optional Configuration Backend ...... SKIPPED
[INFO] Apache Tamaya Modules -Classloader Support ........ SKIPPED
[INFO] tamaya-integration ................................ SKIPPED
[INFO] Apache Tamaya Modules Integration - Spring ........ SKIPPED
[INFO] Apache Tamaya Documentation ....................... SKIPPED
[INFO] Apache Tamaya Examples ............................ SKIPPED
[INFO] Apache Tamaya Example: Minimal Version ............ SKIPPED
[INFO] Apache Tamaya Example: Simple Property Source Version  SKIPPED
[INFO] Apache Tamaya Example: Resource Location .......... SKIPPED
[INFO] Apache Tamaya Example: Value Resolution ........... SKIPPED
[INFO] Apache Tamaya Example: File Observer .............. SKIPPED
[INFO] Apache Tamaya Example: Configuration Injection .... SKIPPED
[INFO] Apache Tamaya Example: Builder .................... SKIPPED
[INFO] Apache Tamaya Example: Remote ..................... SKIPPED
[INFO] Apache Tamaya Example: Remote (Server) ............ SKIPPED
[INFO] Apache Tamaya Example: Remote (Client) ............ SKIPPED
[INFO] Apache Tamaya Distribution ........................ SKIPPED
[INFO] ------------------------------------------------------------------------
[INFO] BUILD FAILURE
[INFO] ------------------------------------------------------------------------
[INFO] Total time: 30.041 s
[INFO] Finished at: 2015-10-01T17:43:49+00:00
[INFO] Final Memory: 56M/512M
[INFO] ------------------------------------------------------------------------
[ERROR] Could not find resource 'findbugs/findbugs-exclude.xml'. -> [Help 1]
[ERROR] 
[ERROR] To see the full stack trace of the errors, re-run Maven with the -e switch.
[ERROR] Re-run Maven using the -X switch to enable full debug logging.
[ERROR] 
[ERROR] For more information about the errors and possible solutions, please read the following
articles:
[ERROR] [Help 1] http://cwiki.apache.org/confluence/display/MAVEN/ResourceNotFoundException
[JENKINS] Archiving <https://builds.apache.org/job/Tamaya-Master-branch/ws/modules/injection/pom.xml>
to org.apache.tamaya.ext/tamaya-injection/0.2-incubating-SNAPSHOT/tamaya-injection-0.2-incubating-SNAPSHOT.pom
[JENKINS] Archiving <https://builds.apache.org/job/Tamaya-Master-branch/ws/examples/6-fileobserver-example/pom.xml>
to org.apache.tamaya.examples/tamaya-example-fileobserver/0.2-incubating-SNAPSHOT/tamaya-example-fileobserver-0.2-incubating-SNAPSHOT.pom
[JENKINS] Archiving <https://builds.apache.org/job/Tamaya-Master-branch/ws/examples/8-remote-example/pom.xml>
to org.apache.tamaya.examples/tamaya-example-remote/0.2-incubating-SNAPSHOT/tamaya-example-remote-0.2-incubating-SNAPSHOT.pom
[JENKINS] Archiving <https://builds.apache.org/job/Tamaya-Master-branch/ws/modules/json/pom.xml>
to org.apache.tamaya.ext/tamaya-json/0.2-incubating-SNAPSHOT/tamaya-json-0.2-incubating-SNAPSHOT.pom
[JENKINS] Archiving <https://builds.apache.org/job/Tamaya-Master-branch/ws/examples/7-builder-example/pom.xml>
to org.apache.tamaya.examples/tamaya-example-builder/0.2-incubating-SNAPSHOT/tamaya-example-builder-0.2-incubating-SNAPSHOT.pom
[JENKINS] Archiving <https://builds.apache.org/job/Tamaya-Master-branch/ws/examples/1-minimal-example/pom.xml>
to org.apache.tamaya.examples/tamaya-example-minimal/0.2-incubating-SNAPSHOT/tamaya-example-minimal-0.2-incubating-SNAPSHOT.pom
[JENKINS] Archiving <https://builds.apache.org/job/Tamaya-Master-branch/ws/buildconfigurations/pom.xml>
to org.apache.tamaya/buildconfigurations/0.2-incubating-SNAPSHOT/buildconfigurations-0.2-incubating-SNAPSHOT.pom
[JENKINS] Archiving <https://builds.apache.org/job/Tamaya-Master-branch/ws/buildconfigurations/target/buildconfigurations-0.2-incubating-SNAPSHOT.jar>
to org.apache.tamaya/buildconfigurations/0.2-incubating-20151001.174343-30/buildconfigurations-0.2-incubating-20151001.174343-30.jar
[JENKINS] Archiving <https://builds.apache.org/job/Tamaya-Master-branch/ws/buildconfigurations/target/buildconfigurations-0.2-incubating-SNAPSHOT-sources.jar>
to org.apache.tamaya/buildconfigurations/0.2-incubating-20151001.174343-30/buildconfigurations-0.2-incubating-20151001.174343-30-sources.jar
[JENKINS] Archiving <https://builds.apache.org/job/Tamaya-Master-branch/ws/examples/3-resources-example/pom.xml>
to org.apache.tamaya.examples/tamaya-example-resources/0.2-incubating-SNAPSHOT/tamaya-example-resources-0.2-incubating-SNAPSHOT.pom
[JENKINS] Archiving <https://builds.apache.org/job/Tamaya-Master-branch/ws/examples/8-remote-example/server/pom.xml>
to org.apache.tamaya.examples/tamaya-example-remote-server/0.2-incubating-SNAPSHOT/tamaya-example-remote-server-0.2-incubating-SNAPSHOT.pom
[JENKINS] Archiving <https://builds.apache.org/job/Tamaya-Master-branch/ws/examples/pom.xml>
to org.apache.tamaya.ext/tamaya-examples/0.2-incubating-SNAPSHOT/tamaya-examples-0.2-incubating-SNAPSHOT.pom
[JENKINS] Archiving <https://builds.apache.org/job/Tamaya-Master-branch/ws/examples/8-remote-example/client/pom.xml>
to org.apache.tamaya.examples/tamaya-example-remote-client/0.2-incubating-SNAPSHOT/tamaya-example-remote-client-0.2-incubating-SNAPSHOT.pom
[JENKINS] Archiving <https://builds.apache.org/job/Tamaya-Master-branch/ws/modules/optional/pom.xml>
to org.apache.tamaya.ext/tamaya-optional/0.2-incubating-SNAPSHOT/tamaya-optional-0.2-incubating-SNAPSHOT.pom
[JENKINS] Archiving <https://builds.apache.org/job/Tamaya-Master-branch/ws/examples/2-simple-propertysource-example/pom.xml>
to org.apache.tamaya.examples/tamaya-example-simple-propertysource/0.2-incubating-SNAPSHOT/tamaya-example-simple-propertysource-0.2-incubating-SNAPSHOT.pom
[JENKINS] Archiving <https://builds.apache.org/job/Tamaya-Master-branch/ws/modules/resources/pom.xml>
to org.apache.tamaya.ext/tamaya-resources/0.2-incubating-SNAPSHOT/tamaya-resources-0.2-incubating-SNAPSHOT.pom
[JENKINS] Archiving <https://builds.apache.org/job/Tamaya-Master-branch/ws/modules/management/pom.xml>
to org.apache.tamaya.ext/tamaya-management/0.2-incubating-SNAPSHOT/tamaya-management-0.2-incubating-SNAPSHOT.pom
[JENKINS] Archiving <https://builds.apache.org/job/Tamaya-Master-branch/ws/distribution/pom.xml>
to org.apache.tamaya/tamaya-distribution/0.2-incubating-SNAPSHOT/tamaya-distribution-0.2-incubating-SNAPSHOT.pom
[JENKINS] Archiving <https://builds.apache.org/job/Tamaya-Master-branch/ws/modules/integration/spring/pom.xml>
to org.apache.tamaya.ext/tamaya-spring/0.2-incubating-SNAPSHOT/tamaya-spring-0.2-incubating-SNAPSHOT.pom
[JENKINS] Archiving <https://builds.apache.org/job/Tamaya-Master-branch/ws/examples/4-resolver-example/pom.xml>
to org.apache.tamaya.examples/tamaya-example-resolver/0.2-incubating-SNAPSHOT/tamaya-example-resolver-0.2-incubating-SNAPSHOT.pom
[JENKINS] Archiving <https://builds.apache.org/job/Tamaya-Master-branch/ws/modules/events/pom.xml>
to org.apache.tamaya.ext/tamaya-events/0.2-incubating-SNAPSHOT/tamaya-events-0.2-incubating-SNAPSHOT.pom
[JENKINS] Archiving <https://builds.apache.org/job/Tamaya-Master-branch/ws/modules/formats/pom.xml>
to org.apache.tamaya.ext/tamaya-formats/0.2-incubating-SNAPSHOT/tamaya-formats-0.2-incubating-SNAPSHOT.pom
[JENKINS] Archiving <https://builds.apache.org/job/Tamaya-Master-branch/ws/examples/5-injection-example/pom.xml>
to org.apache.tamaya.examples/tamaya-example-injection/0.2-incubating-SNAPSHOT/tamaya-example-injection-0.2-incubating-SNAPSHOT.pom
[JENKINS] Archiving <https://builds.apache.org/job/Tamaya-Master-branch/ws/modules/pom.xml>
to org.apache.tamaya.ext/tamaya-extensions/0.2-incubating-SNAPSHOT/tamaya-extensions-0.2-incubating-SNAPSHOT.pom
[JENKINS] Archiving <https://builds.apache.org/job/Tamaya-Master-branch/ws/api/pom.xml>
to org.apache.tamaya/tamaya-api/0.2-incubating-SNAPSHOT/tamaya-api-0.2-incubating-SNAPSHOT.pom
[JENKINS] Archiving <https://builds.apache.org/job/Tamaya-Master-branch/ws/modules/server/pom.xml>
to org.apache.tamaya.ext/tamaya-server/0.2-incubating-SNAPSHOT/tamaya-server-0.2-incubating-SNAPSHOT.pom
[JENKINS] Archiving <https://builds.apache.org/job/Tamaya-Master-branch/ws/modules/model/pom.xml>
to org.apache.tamaya.ext.model/tamaya-model/0.2-incubating-SNAPSHOT/tamaya-model-0.2-incubating-SNAPSHOT.pom
[JENKINS] Archiving <https://builds.apache.org/job/Tamaya-Master-branch/ws/modules/classloader-support/pom.xml>
to org.apache.tamaya.ext/tamaya-classloader-support/0.2-incubating-SNAPSHOT/tamaya-classloader-support-0.2-incubating-SNAPSHOT.pom
[JENKINS] Archiving <https://builds.apache.org/job/Tamaya-Master-branch/ws/modules/functions/pom.xml>
to org.apache.tamaya.ext/tamaya-functions/0.2-incubating-SNAPSHOT/tamaya-functions-0.2-incubating-SNAPSHOT.pom
[JENKINS] Archiving <https://builds.apache.org/job/Tamaya-Master-branch/ws/modules/remote/pom.xml>
to org.apache.tamaya.ext/tamaya-remote/0.2-incubating-SNAPSHOT/tamaya-remote-0.2-incubating-SNAPSHOT.pom
[JENKINS] Archiving <https://builds.apache.org/job/Tamaya-Master-branch/ws/modules/resolver/pom.xml>
to org.apache.tamaya.ext/tamaya-resolver/0.2-incubating-SNAPSHOT/tamaya-resolver-0.2-incubating-SNAPSHOT.pom
[JENKINS] Archiving <https://builds.apache.org/job/Tamaya-Master-branch/ws/modules/integration/pom.xml>
to org.apache.tamaya.ext/tamaya-integration/0.2-incubating-SNAPSHOT/tamaya-integration-0.2-incubating-SNAPSHOT.pom
[JENKINS] Archiving <https://builds.apache.org/job/Tamaya-Master-branch/ws/core/pom.xml>
to org.apache.tamaya/tamaya-core/0.2-incubating-SNAPSHOT/tamaya-core-0.2-incubating-SNAPSHOT.pom
[JENKINS] Archiving <https://builds.apache.org/job/Tamaya-Master-branch/ws/pom.xml>
to org.apache.tamaya/tamaya-all/0.2-incubating-SNAPSHOT/tamaya-all-0.2-incubating-SNAPSHOT.pom
[JENKINS] Archiving <https://builds.apache.org/job/Tamaya-Master-branch/ws/target/tamaya-all-0.2-incubating-SNAPSHOT-site.xml>
to org.apache.tamaya/tamaya-all/0.2-incubating-20151001.174338-32/tamaya-all-0.2-incubating-20151001.174338-32-site.xml
[JENKINS] Archiving <https://builds.apache.org/job/Tamaya-Master-branch/ws/modules/builder/pom.xml>
to org.apache.tamaya.ext/tamaya-builder/0.2-incubating-SNAPSHOT/tamaya-builder-0.2-incubating-SNAPSHOT.pom
[JENKINS] Archiving <https://builds.apache.org/job/Tamaya-Master-branch/ws/docs/pom.xml>
to org.apache.tamaya/tamaya-docs/0.2-incubating-SNAPSHOT/tamaya-docs-0.2-incubating-SNAPSHOT.pom
channel stopped

Mime
View raw message