tamaya-commits mailing list archives

Site index · List index
Message view « Date » · « Thread »
Top « Date » · « Thread »
From Apache Jenkins Server <jenk...@builds.apache.org>
Subject Build failed in Jenkins: Tamaya-Master-branch #388
Date Sat, 26 Sep 2015 01:53:16 GMT
See <https://builds.apache.org/job/Tamaya-Master-branch/388/changes>

Changes:

[anatole] TAMAYA-112: Add Module Support for Collections - adding configuration data, adaptive
combination policy and PropertyConverter skeletons,

------------------------------------------
Started by an SCM change
Started by an SCM change
Started by an SCM change
Started by an SCM change
Started by an SCM change
Started by an SCM change
Started by an SCM change
Started by an SCM change
[EnvInject] - Loading node environment variables.
Building remotely on ubuntu3 (Ubuntu ubuntu legacy-ubuntu) in workspace <https://builds.apache.org/job/Tamaya-Master-branch/ws/>
 > git rev-parse --is-inside-work-tree # timeout=10
Fetching changes from the remote Git repository
 > git config remote.origin.url https://git-wip-us.apache.org/repos/asf/incubator-tamaya.git
# timeout=10
Fetching upstream changes from https://git-wip-us.apache.org/repos/asf/incubator-tamaya.git
 > git --version # timeout=10
 > git fetch --tags --progress https://git-wip-us.apache.org/repos/asf/incubator-tamaya.git
+refs/heads/*:refs/remotes/origin/*
 > git rev-parse refs/remotes/origin/master^{commit} # timeout=10
 > git rev-parse refs/remotes/origin/origin/master^{commit} # timeout=10
Checking out Revision 64793cefff79c6c097a164545be1d569c1848758 (refs/remotes/origin/master)
 > git config core.sparsecheckout # timeout=10
 > git checkout -f 64793cefff79c6c097a164545be1d569c1848758
 > git rev-list 0f3bae97ccab9dc18052d2819ead3e9ce8816bc7 # timeout=10
Parsing POMs
ERROR: Failed to parse POMs
java.io.IOException: remote file operation failed: <https://builds.apache.org/job/Tamaya-Master-branch/ws/>
at hudson.remoting.Channel@35cb1c13:ubuntu3
	at hudson.FilePath.act(FilePath.java:916)
	at hudson.FilePath.act(FilePath.java:893)
	at hudson.maven.MavenModuleSetBuild$MavenModuleSetBuildExecution.parsePoms(MavenModuleSetBuild.java:950)
	at hudson.maven.MavenModuleSetBuild$MavenModuleSetBuildExecution.doRun(MavenModuleSetBuild.java:677)
	at hudson.model.AbstractBuild$AbstractBuildExecution.run(AbstractBuild.java:529)
	at hudson.model.Run.execute(Run.java:1706)
	at hudson.maven.MavenModuleSetBuild.run(MavenModuleSetBuild.java:529)
	at hudson.model.ResourceController.execute(ResourceController.java:88)
	at hudson.model.Executor.run(Executor.java:232)
Caused by: hudson.remoting.ProxyException: hudson.maven.MavenModuleSetBuild$MavenExecutionException:
org.apache.maven.project.ProjectBuildingException: Some problems were encountered while processing
the POMs:
[WARNING] 'dependencies.dependency.scope' for org.apache.tamaya:tamaya-java7-core:jar must
be one of [provided, compile, runtime, test, system] but is 'Test'. @ line 52, column 20
[ERROR] Child module <https://builds.apache.org/job/Tamaya-Master-branch/ws/modules/integration/cdi>
of <https://builds.apache.org/job/Tamaya-Master-branch/ws/modules/integration/pom.xml>
does not exist @ 

	at hudson.maven.MavenModuleSetBuild$PomParser.invoke(MavenModuleSetBuild.java:1354)
	at hudson.maven.MavenModuleSetBuild$PomParser.invoke(MavenModuleSetBuild.java:1088)
	at hudson.FilePath$FileCallableWrapper.call(FilePath.java:2474)
	at hudson.remoting.UserRequest.perform(UserRequest.java:118)
	at hudson.remoting.UserRequest.perform(UserRequest.java:48)
	at hudson.remoting.Request$2.run(Request.java:328)
	at hudson.remoting.InterceptingExecutorService$1.call(InterceptingExecutorService.java:72)
	at java.util.concurrent.FutureTask.run(FutureTask.java:262)
	at java.util.concurrent.ThreadPoolExecutor.runWorker(ThreadPoolExecutor.java:1145)
	at java.util.concurrent.ThreadPoolExecutor$Worker.run(ThreadPoolExecutor.java:615)
	at java.lang.Thread.run(Thread.java:745)
Caused by: hudson.remoting.ProxyException: org.apache.maven.project.ProjectBuildingException:
Some problems were encountered while processing the POMs:
[WARNING] 'dependencies.dependency.scope' for org.apache.tamaya:tamaya-java7-core:jar must
be one of [provided, compile, runtime, test, system] but is 'Test'. @ line 52, column 20
[ERROR] Child module <https://builds.apache.org/job/Tamaya-Master-branch/ws/modules/integration/cdi>
of <https://builds.apache.org/job/Tamaya-Master-branch/ws/modules/integration/pom.xml>
does not exist @ 

	at org.apache.maven.project.DefaultProjectBuilder.build(DefaultProjectBuilder.java:364)
	at hudson.maven.MavenEmbedder.buildProjects(MavenEmbedder.java:361)
	at hudson.maven.MavenEmbedder.readProjects(MavenEmbedder.java:331)
	at hudson.maven.MavenModuleSetBuild$PomParser.invoke(MavenModuleSetBuild.java:1291)
	... 10 more

Mime
View raw message