tamaya-commits mailing list archives

Site index · List index
Message view « Date » · « Thread »
Top « Date » · « Thread »
From Apache Jenkins Server <jenk...@builds.apache.org>
Subject Build failed in Jenkins: Tamaya-Master-branch #246
Date Sat, 21 Mar 2015 20:30:51 GMT
See <https://builds.apache.org/job/Tamaya-Master-branch/246/changes>

Changes:

[plexus] Removed unused imports

[plexus] Removed unused import.

------------------------------------------
[...truncated 2273 lines...]
[INFO] Skipping execution of surefire because it has already been run for this configuration
[JENKINS] Recording test results[INFO] 
[INFO] --- maven-failsafe-plugin:2.17:verify (default) @ tamaya-formats ---
[INFO] Failsafe report directory: <https://builds.apache.org/job/Tamaya-Master-branch/ws/modules/formats/target/failsafe-reports>

[JENKINS] Recording test results[INFO] 
[INFO] --- maven-install-plugin:2.5.2:install (default-install) @ tamaya-formats ---
[INFO] Installing <https://builds.apache.org/job/Tamaya-Master-branch/ws/modules/formats/target/tamaya-formats-0.1-incubating-SNAPSHOT.jar>
to /home/jenkins/jenkins-slave/maven-repositories/1/org/apache/tamaya/ext/tamaya-formats/0.1-incubating-SNAPSHOT/tamaya-formats-0.1-incubating-SNAPSHOT.jar
[INFO] Installing <https://builds.apache.org/job/Tamaya-Master-branch/ws/modules/formats/pom.xml>
to /home/jenkins/jenkins-slave/maven-repositories/1/org/apache/tamaya/ext/tamaya-formats/0.1-incubating-SNAPSHOT/tamaya-formats-0.1-incubating-SNAPSHOT.pom

[INFO] 
[INFO] --- maven-deploy-plugin:2.8.2:deploy (default-deploy) @ tamaya-formats ---
[INFO] Downloading: https://repository.apache.org/content/repositories/snapshots/org/apache/tamaya/ext/tamaya-formats/0.1-incubating-SNAPSHOT/maven-metadata.xml
[INFO] Downloaded: https://repository.apache.org/content/repositories/snapshots/org/apache/tamaya/ext/tamaya-formats/0.1-incubating-SNAPSHOT/maven-metadata.xml
(815 B at 1.7 KB/sec)
[INFO] Uploading: https://repository.apache.org/content/repositories/snapshots/org/apache/tamaya/ext/tamaya-formats/0.1-incubating-SNAPSHOT/tamaya-formats-0.1-incubating-20150321.203038-89.jar
[INFO] Uploaded: https://repository.apache.org/content/repositories/snapshots/org/apache/tamaya/ext/tamaya-formats/0.1-incubating-SNAPSHOT/tamaya-formats-0.1-incubating-20150321.203038-89.jar
(25 KB at 97.9 KB/sec)
[INFO] Uploading: https://repository.apache.org/content/repositories/snapshots/org/apache/tamaya/ext/tamaya-formats/0.1-incubating-SNAPSHOT/tamaya-formats-0.1-incubating-20150321.203038-89.pom
[INFO] Uploaded: https://repository.apache.org/content/repositories/snapshots/org/apache/tamaya/ext/tamaya-formats/0.1-incubating-SNAPSHOT/tamaya-formats-0.1-incubating-20150321.203038-89.pom
(3 KB at 16.9 KB/sec)
[INFO] Downloading: https://repository.apache.org/content/repositories/snapshots/org/apache/tamaya/ext/tamaya-formats/maven-metadata.xml
[INFO] Downloaded: https://repository.apache.org/content/repositories/snapshots/org/apache/tamaya/ext/tamaya-formats/maven-metadata.xml
(460 B at 4.5 KB/sec)
[INFO] Uploading: https://repository.apache.org/content/repositories/snapshots/org/apache/tamaya/ext/tamaya-formats/0.1-incubating-SNAPSHOT/maven-metadata.xml
[INFO] Uploaded: https://repository.apache.org/content/repositories/snapshots/org/apache/tamaya/ext/tamaya-formats/0.1-incubating-SNAPSHOT/maven-metadata.xml
(815 B at 1.9 KB/sec)
[INFO] Uploading: https://repository.apache.org/content/repositories/snapshots/org/apache/tamaya/ext/tamaya-formats/maven-metadata.xml
[INFO] Uploaded: https://repository.apache.org/content/repositories/snapshots/org/apache/tamaya/ext/tamaya-formats/maven-metadata.xml
(460 B at 3.5 KB/sec)
[INFO]                                                                         
[INFO] ------------------------------------------------------------------------
[INFO] Building Apache Tamaya JSON Support 0.1-incubating-SNAPSHOT
[INFO] ------------------------------------------------------------------------
[INFO] Downloading: http://repository.apache.org/snapshots/com/fasterxml/jackson/core/jackson-databind/2.5.1/jackson-databind-2.5.1.pom
[INFO] Downloading: http://repo.maven.apache.org/maven2/com/fasterxml/jackson/core/jackson-databind/2.5.1/jackson-databind-2.5.1.pom
[INFO] Downloaded: http://repo.maven.apache.org/maven2/com/fasterxml/jackson/core/jackson-databind/2.5.1/jackson-databind-2.5.1.pom
(6 KB at 41.8 KB/sec)
[INFO] Downloading: http://repository.apache.org/snapshots/com/fasterxml/jackson/core/jackson-core/2.5.1/jackson-core-2.5.1.pom
[INFO] Downloading: http://repo.maven.apache.org/maven2/com/fasterxml/jackson/core/jackson-core/2.5.1/jackson-core-2.5.1.pom
[INFO] Downloaded: http://repo.maven.apache.org/maven2/com/fasterxml/jackson/core/jackson-core/2.5.1/jackson-core-2.5.1.pom
(5 KB at 62.1 KB/sec)
[INFO] Downloading: http://repository.apache.org/snapshots/com/fasterxml/jackson/core/jackson-databind/2.5.1/jackson-databind-2.5.1.jar
[INFO] Downloading: http://repository.apache.org/snapshots/com/fasterxml/jackson/core/jackson-core/2.5.1/jackson-core-2.5.1.jar
[INFO] Downloading: http://repo.maven.apache.org/maven2/com/fasterxml/jackson/core/jackson-databind/2.5.1/jackson-databind-2.5.1.jar
[INFO] Downloading: http://repo.maven.apache.org/maven2/com/fasterxml/jackson/core/jackson-core/2.5.1/jackson-core-2.5.1.jar
[INFO] Downloaded: http://repo.maven.apache.org/maven2/com/fasterxml/jackson/core/jackson-core/2.5.1/jackson-core-2.5.1.jar
(225 KB at 699.3 KB/sec)
[INFO] Downloaded: http://repo.maven.apache.org/maven2/com/fasterxml/jackson/core/jackson-databind/2.5.1/jackson-databind-2.5.1.jar
(1113 KB at 1765.4 KB/sec)
[INFO] 
[INFO] --- maven-clean-plugin:2.5:clean (default-clean) @ tamaya-json ---
[INFO] Deleting <https://builds.apache.org/job/Tamaya-Master-branch/ws/modules/json/target>
[INFO] 
[INFO] --- maven-enforcer-plugin:1.4:enforce (enforce-versions) @ tamaya-json ---
[INFO] 
[INFO] --- apache-rat-plugin:0.11:check (default) @ tamaya-json ---
[INFO] 51 implicit excludes (use -debug for more details).
[INFO] Exclude: **/*/MANIFEST.MF
[INFO] Exclude: .git
[INFO] Exclude: .gitignore
[INFO] Exclude: derby.log
[INFO] Exclude: **/META-INF/services/*
[INFO] Exclude: **/bootstrap-*
[INFO] Exclude: **/js/jquery-*
[INFO] Exclude: **/*.json
[INFO] 16 resources included (use -debug for more details)
Warning:  org.apache.xerces.jaxp.SAXParserImpl$JAXPSAXParser: Property 'http://www.oracle.com/xml/jaxp/properties/entityExpansionLimit'
is not recognized.
Compiler warnings:
  WARNING:  'org.apache.xerces.jaxp.SAXParserImpl: Property 'http://javax.xml.XMLConstants/property/accessExternalDTD'
is not recognized.'
Warning:  org.apache.xerces.parsers.SAXParser: Feature 'http://javax.xml.XMLConstants/feature/secure-processing'
is not recognized.
Warning:  org.apache.xerces.parsers.SAXParser: Property 'http://javax.xml.XMLConstants/property/accessExternalDTD'
is not recognized.
Warning:  org.apache.xerces.parsers.SAXParser: Property 'http://www.oracle.com/xml/jaxp/properties/entityExpansionLimit'
is not recognized.
[INFO] Rat check: Summary of files. Unapproved: 0 unknown: 0 generated: 0 approved: 16 licence.
[INFO] 
[INFO] --- maven-remote-resources-plugin:1.5:process (default) @ tamaya-json ---
[INFO] 
[INFO] --- maven-resources-plugin:2.6:resources (default-resources) @ tamaya-json ---
[INFO] Using 'UTF-8' encoding to copy filtered resources.
[INFO] Copying 2 resources
[INFO] Copying 3 resources
[INFO] 
[INFO] --- maven-compiler-plugin:3.1:compile (default-compile) @ tamaya-json ---
[INFO] Changes detected - recompiling the module!
[INFO] Compiling 5 source files to <https://builds.apache.org/job/Tamaya-Master-branch/ws/modules/json/target/classes>
[INFO] -------------------------------------------------------------
[ERROR] COMPILATION ERROR : 
[INFO] -------------------------------------------------------------
[ERROR] <https://builds.apache.org/job/Tamaya-Master-branch/ws/modules/json/src/main/java/org/apache/tamaya/json/JSONConfigurationFormat.java>:[31,8]
org.apache.tamaya.json.JSONConfigurationFormat is not abstract and does not override abstract
method getName() in org.apache.tamaya.format.ConfigurationFormat
[ERROR] <https://builds.apache.org/job/Tamaya-Master-branch/ws/modules/json/src/main/java/org/apache/tamaya/json/JSONFormat.java>:[42,8]
org.apache.tamaya.json.JSONFormat is not abstract and does not override abstract method getName()
in org.apache.tamaya.format.ConfigurationFormat
[INFO] 2 errors 
[INFO] -------------------------------------------------------------
[INFO] ------------------------------------------------------------------------
[INFO] Reactor Summary:
[INFO] 
[INFO] Apache Tamaya ..................................... SUCCESS [ 21.262 s]
[INFO] Apache Tamaya Build Configuration ................. SUCCESS [  4.530 s]
[INFO] Apache Tamaya Java 7 Parent ....................... SUCCESS [  3.474 s]
[INFO] Apache Tamaya Java 7 API .......................... SUCCESS [ 15.860 s]
[INFO] Apache Tamaya Java 7 Core ......................... SUCCESS [ 21.810 s]
[INFO] Apache Tamaya Java 8 Parent ....................... SUCCESS [  5.354 s]
[INFO] Apache Tamaya Java 8 API .......................... SUCCESS [ 17.027 s]
[INFO] Apache Tamaya Java 8 Core ......................... SUCCESS [ 27.709 s]
[INFO] Apache Tamaya Extension Modules ................... SUCCESS [  5.058 s]
[INFO] Apache Tamaya Resource Services ................... SUCCESS [ 24.215 s]
[INFO] Apache Tamaya Format Services ..................... SUCCESS [ 17.808 s]
[INFO] Apache Tamaya JSON Support ........................ FAILURE [  2.386 s]
[INFO] Apache Tamaya Builder ............................. SKIPPED
[INFO] Apache Tamaya API Extensions ...................... SKIPPED
[INFO] Apache Tamaya Resolver Services ................... SKIPPED
[INFO] Apache Tamaya Injection Support ................... SKIPPED
[INFO] Apache Tamaya Event and dynamic Update Extensions . SKIPPED
[INFO] ------------------------------------------------------------------------
[INFO] BUILD FAILURE
[INFO] ------------------------------------------------------------------------
[INFO] Total time: 02:59 min
[INFO] Finished at: 2015-03-21T20:30:47+00:00
[INFO] Final Memory: 70M/813M
[INFO] ------------------------------------------------------------------------
[ERROR] Failed to execute goal org.apache.maven.plugins:maven-compiler-plugin:3.1:compile
(default-compile) on project tamaya-json: Compilation failure: Compilation failure:
[ERROR] <https://builds.apache.org/job/Tamaya-Master-branch/ws/modules/json/src/main/java/org/apache/tamaya/json/JSONConfigurationFormat.java>:[31,8]
org.apache.tamaya.json.JSONConfigurationFormat is not abstract and does not override abstract
method getName() in org.apache.tamaya.format.ConfigurationFormat
[ERROR] <https://builds.apache.org/job/Tamaya-Master-branch/ws/modules/json/src/main/java/org/apache/tamaya/json/JSONFormat.java>:[42,8]
org.apache.tamaya.json.JSONFormat is not abstract and does not override abstract method getName()
in org.apache.tamaya.format.ConfigurationFormat
[ERROR] -> [Help 1]
[ERROR] 
[ERROR] To see the full stack trace of the errors, re-run Maven with the -e switch.
[ERROR] Re-run Maven using the -X switch to enable full debug logging.
[ERROR] 
[ERROR] For more information about the errors and possible solutions, please read the following
articles:
[ERROR] [Help 1] http://cwiki.apache.org/confluence/display/MAVEN/MojoFailureException
[ERROR] 
[ERROR] After correcting the problems, you can resume the build with the command
[ERROR]   mvn <goals> -rf :tamaya-json
[JENKINS] Archiving <https://builds.apache.org/job/Tamaya-Master-branch/ws/java7/core/pom.xml>
to org.apache.tamaya/tamaya-java7-core/0.1-incubating-SNAPSHOT/tamaya-java7-core-0.1-incubating-SNAPSHOT.pom
[JENKINS] Archiving <https://builds.apache.org/job/Tamaya-Master-branch/ws/java7/core/target/tamaya-java7-core-0.1-incubating-SNAPSHOT.jar>
to org.apache.tamaya/tamaya-java7-core/0.1-incubating-20150321.202856-66/tamaya-java7-core-0.1-incubating-20150321.202856-66.jar
Sending artifact delta relative to Tamaya-Master-branch » Apache Tamaya Java 7 Core #245
Archived 2 artifacts
Archive block size is 32768
Received 0 blocks and 65566 bytes
Compression is 0.0%
Took 0.11 sec
[JENKINS] Archiving <https://builds.apache.org/job/Tamaya-Master-branch/ws/modules/injection/pom.xml>
to org.apache.tamaya.ext/tamaya-injection/0.1-incubating-SNAPSHOT/tamaya-injection-0.1-incubating-SNAPSHOT.pom
Sending artifact delta relative to Tamaya-Master-branch » Apache Tamaya Injection Support
#242
Archived 1 artifacts
Archive block size is 32768
Received 0 blocks and 2317 bytes
Compression is 0.0%
Took 70 ms
[JENKINS] Archiving <https://builds.apache.org/job/Tamaya-Master-branch/ws/modules/json/pom.xml>
to org.apache.tamaya.ext/tamaya-json/0.1-incubating-SNAPSHOT/tamaya-json-0.1-incubating-SNAPSHOT.pom
Sending artifact delta relative to Tamaya-Master-branch » Apache Tamaya JSON Support #242
Archived 1 artifacts
Archive block size is 32768
Received 0 blocks and 5377 bytes
Compression is 0.0%
Took 70 ms
[JENKINS] Archiving <https://builds.apache.org/job/Tamaya-Master-branch/ws/modules/events/pom.xml>
to org.apache.tamaya.ext/tamaya-events/0.1-incubating-SNAPSHOT/tamaya-events-0.1-incubating-SNAPSHOT.pom
Sending artifact delta relative to Tamaya-Master-branch » Apache Tamaya Event and dynamic
Update Extensions #242
Archived 1 artifacts
Archive block size is 32768
Received 0 blocks and 2269 bytes
Compression is 0.0%
Took 69 ms
[JENKINS] Archiving <https://builds.apache.org/job/Tamaya-Master-branch/ws/modules/formats/pom.xml>
to org.apache.tamaya.ext/tamaya-formats/0.1-incubating-SNAPSHOT/tamaya-formats-0.1-incubating-SNAPSHOT.pom
[JENKINS] Archiving <https://builds.apache.org/job/Tamaya-Master-branch/ws/modules/formats/target/tamaya-formats-0.1-incubating-SNAPSHOT.jar>
to org.apache.tamaya.ext/tamaya-formats/0.1-incubating-20150321.203038-89/tamaya-formats-0.1-incubating-20150321.203038-89.jar
Sending artifact delta relative to Tamaya-Master-branch » Apache Tamaya Format Services #242
Archived 2 artifacts
Archive block size is 32768
Received 0 blocks and 27761 bytes
Compression is 0.0%
Took 74 ms
[JENKINS] Archiving <https://builds.apache.org/job/Tamaya-Master-branch/ws/java8/api/pom.xml>
to org.apache.tamaya/tamaya-api/0.1-incubating-SNAPSHOT/tamaya-api-0.1-incubating-SNAPSHOT.pom
[JENKINS] Archiving <https://builds.apache.org/job/Tamaya-Master-branch/ws/java8/api/target/tamaya-api-0.1-incubating-SNAPSHOT.jar>
to org.apache.tamaya/tamaya-api/0.1-incubating-20150321.202920-107/tamaya-api-0.1-incubating-20150321.202920-107.jar
Sending artifact delta relative to Tamaya-Master-branch » Apache Tamaya Java 8 API #245
Archived 2 artifacts
Archive block size is 32768
Received 0 blocks and 22498 bytes
Compression is 0.0%
Took 74 ms
[JENKINS] Archiving <https://builds.apache.org/job/Tamaya-Master-branch/ws/modules/pom.xml>
to org.apache.tamaya.ext/tamaya-extensions/0.1-incubating-SNAPSHOT/tamaya-extensions-0.1-incubating-SNAPSHOT.pom
Sending artifact delta relative to Tamaya-Master-branch » Apache Tamaya Extension Modules
#245
Archived 1 artifacts
Archive block size is 32768
Received 0 blocks and 4215 bytes
Compression is 0.0%
Took 70 ms
[JENKINS] Archiving <https://builds.apache.org/job/Tamaya-Master-branch/ws/buildconfigurations/pom.xml>
to org.apache.tamaya/buildconfigurations/0.1-incubating-SNAPSHOT/buildconfigurations-0.1-incubating-SNAPSHOT.pom
[JENKINS] Archiving <https://builds.apache.org/job/Tamaya-Master-branch/ws/buildconfigurations/target/buildconfigurations-0.1-incubating-SNAPSHOT.jar>
to org.apache.tamaya/buildconfigurations/0.1-incubating-20150321.202814-98/buildconfigurations-0.1-incubating-20150321.202814-98.jar
Sending artifact delta relative to Tamaya-Master-branch » Apache Tamaya Build Configuration
#245
Archived 2 artifacts
Archive block size is 32768
Received 0 blocks and 10729 bytes
Compression is 0.0%
Took 72 ms
[JENKINS] Archiving <https://builds.apache.org/job/Tamaya-Master-branch/ws/modules/resolver/pom.xml>
to org.apache.tamaya.ext/tamaya-resolver/0.1-incubating-SNAPSHOT/tamaya-resolver-0.1-incubating-SNAPSHOT.pom
Sending artifact delta relative to Tamaya-Master-branch » Apache Tamaya Resolver Services
#242
Archived 1 artifacts
Archive block size is 32768
Received 0 blocks and 2311 bytes
Compression is 0.0%
Took 70 ms
[JENKINS] Archiving <https://builds.apache.org/job/Tamaya-Master-branch/ws/java8/pom.xml>
to org.apache.tamaya/tamaya-java8/0.1-incubating-SNAPSHOT/tamaya-java8-0.1-incubating-SNAPSHOT.pom
Sending artifact delta relative to Tamaya-Master-branch » Apache Tamaya Java 8 Parent #245
Archived 1 artifacts
Archive block size is 32768
Received 0 blocks and 3741 bytes
Compression is 0.0%
Took 70 ms
[JENKINS] Archiving <https://builds.apache.org/job/Tamaya-Master-branch/ws/pom.xml>
to org.apache.tamaya/tamaya-all/0.1-incubating-SNAPSHOT/tamaya-all-0.1-incubating-SNAPSHOT.pom
Sending artifact delta relative to Tamaya-Master-branch » Apache Tamaya #245
Archived 1 artifacts
Archive block size is 32768
Received 0 blocks and 29159 bytes
Compression is 0.0%
Took 73 ms
[JENKINS] Archiving <https://builds.apache.org/job/Tamaya-Master-branch/ws/java7/pom.xml>
to org.apache.tamaya/tamaya-java7/0.1-incubating-SNAPSHOT/tamaya-java7-0.1-incubating-SNAPSHOT.pom
Sending artifact delta relative to Tamaya-Master-branch » Apache Tamaya Java 7 Parent #245
Archived 1 artifacts
Archive block size is 32768
Received 0 blocks and 4284 bytes
Compression is 0.0%
Took 70 ms
[JENKINS] Archiving <https://builds.apache.org/job/Tamaya-Master-branch/ws/java8/core/pom.xml>
to org.apache.tamaya/tamaya-core/0.1-incubating-SNAPSHOT/tamaya-core-0.1-incubating-SNAPSHOT.pom
[JENKINS] Archiving <https://builds.apache.org/job/Tamaya-Master-branch/ws/java8/core/target/tamaya-core-0.1-incubating-SNAPSHOT.jar>
to org.apache.tamaya/tamaya-core/0.1-incubating-20150321.202947-99/tamaya-core-0.1-incubating-20150321.202947-99.jar
Sending artifact delta relative to Tamaya-Master-branch » Apache Tamaya Java 8 Core #245
Archived 2 artifacts
Archive block size is 32768
Received 0 blocks and 73900 bytes
Compression is 0.0%
Took 0.11 sec
[JENKINS] Archiving <https://builds.apache.org/job/Tamaya-Master-branch/ws/modules/builder/pom.xml>
to org.apache.tamaya.ext/tamaya-builder/0.1-incubating-SNAPSHOT/tamaya-builder-0.1-incubating-SNAPSHOT.pom
Sending artifact delta relative to Tamaya-Master-branch » Apache Tamaya Builder #242
Archived 1 artifacts
Archive block size is 32768
Received 0 blocks and 2901 bytes
Compression is 0.0%
Took 70 ms
[JENKINS] Archiving <https://builds.apache.org/job/Tamaya-Master-branch/ws/modules/apiextensions/pom.xml>
to org.apache.tamaya.ext/tamaya-apiextensions/0.1-incubating-SNAPSHOT/tamaya-apiextensions-0.1-incubating-SNAPSHOT.pom
Sending artifact delta relative to Tamaya-Master-branch » Apache Tamaya API Extensions #242
Archived 1 artifacts
Archive block size is 32768
Received 0 blocks and 1721 bytes
Compression is 0.0%
Took 76 ms
[JENKINS] Archiving <https://builds.apache.org/job/Tamaya-Master-branch/ws/modules/resources/pom.xml>
to org.apache.tamaya.ext/tamaya-resources/0.1-incubating-SNAPSHOT/tamaya-resources-0.1-incubating-SNAPSHOT.pom
[JENKINS] Archiving <https://builds.apache.org/job/Tamaya-Master-branch/ws/modules/resources/target/tamaya-resources-0.1-incubating-SNAPSHOT.jar>
to org.apache.tamaya.ext/tamaya-resources/0.1-incubating-20150321.203018-91/tamaya-resources-0.1-incubating-20150321.203018-91.jar
Sending artifact delta relative to Tamaya-Master-branch » Apache Tamaya Resource Services
#242
Archived 2 artifacts
Archive block size is 32768
Received 0 blocks and 31718 bytes
Compression is 0.0%
Took 74 ms
[JENKINS] Archiving <https://builds.apache.org/job/Tamaya-Master-branch/ws/java7/api/pom.xml>
to org.apache.tamaya/tamaya-java7-api/0.1-incubating-SNAPSHOT/tamaya-java7-api-0.1-incubating-SNAPSHOT.pom
[JENKINS] Archiving <https://builds.apache.org/job/Tamaya-Master-branch/ws/java7/api/target/tamaya-java7-api-0.1-incubating-SNAPSHOT.jar>
to org.apache.tamaya/tamaya-java7-api/0.1-incubating-20150321.202834-115/tamaya-java7-api-0.1-incubating-20150321.202834-115.jar
Sending artifact delta relative to Tamaya-Master-branch » Apache Tamaya Java 7 API #245
Archived 2 artifacts
Archive block size is 32768
Received 0 blocks and 18690 bytes
Compression is 0.0%
Took 72 ms
channel stopped

Mime
View raw message