tamaya-commits mailing list archives

Site index · List index
Message view « Date » · « Thread »
Top « Date » · « Thread »
From Apache Jenkins Server <jenk...@builds.apache.org>
Subject Build failed in Jenkins: Tamaya-Master-branch #244
Date Sat, 21 Mar 2015 17:46:15 GMT
See <https://builds.apache.org/job/Tamaya-Master-branch/244/changes>

Changes:

[anatole] Renamed main accessor, starting with Config substring.

[anatole] Added first couple of examples.

------------------------------------------
[...truncated 1850 lines...]
[INFO] --- apache-rat-plugin:0.11:check (default) @ tamaya-extensions ---
[INFO] 59 implicit excludes (use -debug for more details).
[INFO] Exclude: **/*/MANIFEST.MF
[INFO] Exclude: .git
[INFO] Exclude: .gitignore
[INFO] Exclude: derby.log
[INFO] Exclude: **/META-INF/services/*
[INFO] Exclude: **/bootstrap-*
[INFO] Exclude: **/js/jquery-*
[INFO] Exclude: **/*.json
[INFO] 1 resources included (use -debug for more details)
Warning:  org.apache.xerces.jaxp.SAXParserImpl$JAXPSAXParser: Property 'http://www.oracle.com/xml/jaxp/properties/entityExpansionLimit'
is not recognized.
Compiler warnings:
  WARNING:  'org.apache.xerces.jaxp.SAXParserImpl: Property 'http://javax.xml.XMLConstants/property/accessExternalDTD'
is not recognized.'
Warning:  org.apache.xerces.parsers.SAXParser: Feature 'http://javax.xml.XMLConstants/feature/secure-processing'
is not recognized.
Warning:  org.apache.xerces.parsers.SAXParser: Property 'http://javax.xml.XMLConstants/property/accessExternalDTD'
is not recognized.
Warning:  org.apache.xerces.parsers.SAXParser: Property 'http://www.oracle.com/xml/jaxp/properties/entityExpansionLimit'
is not recognized.
[INFO] Rat check: Summary of files. Unapproved: 0 unknown: 0 generated: 0 approved: 1 licence.
[INFO] 
[INFO] --- maven-remote-resources-plugin:1.5:process (default) @ tamaya-extensions ---
[INFO] 
[INFO] >>> findbugs-maven-plugin:3.0.0:check (findbugs-analyze) @ tamaya-extensions
>>>
[INFO] 
[INFO] --- findbugs-maven-plugin:3.0.0:findbugs (findbugs) @ tamaya-extensions ---
[INFO] 
[INFO] <<< findbugs-maven-plugin:3.0.0:check (findbugs-analyze) @ tamaya-extensions
<<<
[INFO] 
[INFO] --- findbugs-maven-plugin:3.0.0:check (findbugs-analyze) @ tamaya-extensions ---
[INFO] 
[INFO] --- maven-checkstyle-plugin:2.14:check (verify-style) @ tamaya-extensions ---
[INFO] 
[INFO] --- maven-site-plugin:3.3:attach-descriptor (attach-descriptor) @ tamaya-extensions
---
[INFO] 
[INFO] --- maven-javadoc-plugin:2.9.1:jar (attach-javadocs) @ tamaya-extensions ---
[INFO] Skipping javadoc generation
[INFO] 
[INFO] --- maven-failsafe-plugin:2.17:integration-test (default) @ tamaya-extensions ---
[INFO] No tests to run.
[INFO] Skipping execution of surefire because it has already been run for this configuration
[JENKINS] Recording test results[INFO] 
[INFO] --- maven-failsafe-plugin:2.17:verify (default) @ tamaya-extensions ---
[INFO] No tests to run.

[JENKINS] Recording test results[INFO] 
[INFO] --- maven-install-plugin:2.5.2:install (default-install) @ tamaya-extensions ---
[INFO] Installing <https://builds.apache.org/job/Tamaya-Master-branch/ws/modules/pom.xml>
to /home/jenkins/jenkins-slave/maven-repositories/0/org/apache/tamaya/ext/tamaya-extensions/0.1-incubating-SNAPSHOT/tamaya-extensions-0.1-incubating-SNAPSHOT.pom

[INFO] 
[INFO] --- maven-deploy-plugin:2.8.2:deploy (default-deploy) @ tamaya-extensions ---
[INFO] Downloading: https://repository.apache.org/content/repositories/snapshots/org/apache/tamaya/ext/tamaya-extensions/0.1-incubating-SNAPSHOT/maven-metadata.xml
[INFO] Downloaded: https://repository.apache.org/content/repositories/snapshots/org/apache/tamaya/ext/tamaya-extensions/0.1-incubating-SNAPSHOT/maven-metadata.xml
(635 B at 0.9 KB/sec)
[INFO] Uploading: https://repository.apache.org/content/repositories/snapshots/org/apache/tamaya/ext/tamaya-extensions/0.1-incubating-SNAPSHOT/tamaya-extensions-0.1-incubating-20150321.174602-97.pom
[INFO] Uploaded: https://repository.apache.org/content/repositories/snapshots/org/apache/tamaya/ext/tamaya-extensions/0.1-incubating-SNAPSHOT/tamaya-extensions-0.1-incubating-20150321.174602-97.pom
(4 KB at 14.4 KB/sec)
[INFO] Downloading: https://repository.apache.org/content/repositories/snapshots/org/apache/tamaya/ext/tamaya-extensions/maven-metadata.xml
[INFO] Downloaded: https://repository.apache.org/content/repositories/snapshots/org/apache/tamaya/ext/tamaya-extensions/maven-metadata.xml
(463 B at 0.7 KB/sec)
[INFO] Uploading: https://repository.apache.org/content/repositories/snapshots/org/apache/tamaya/ext/tamaya-extensions/0.1-incubating-SNAPSHOT/maven-metadata.xml
[INFO] Uploaded: https://repository.apache.org/content/repositories/snapshots/org/apache/tamaya/ext/tamaya-extensions/0.1-incubating-SNAPSHOT/maven-metadata.xml
(635 B at 1.8 KB/sec)
[INFO] Uploading: https://repository.apache.org/content/repositories/snapshots/org/apache/tamaya/ext/tamaya-extensions/maven-metadata.xml
[INFO] Uploaded: https://repository.apache.org/content/repositories/snapshots/org/apache/tamaya/ext/tamaya-extensions/maven-metadata.xml
(463 B at 1.9 KB/sec)
[INFO]                                                                         
[INFO] ------------------------------------------------------------------------
[INFO] Building Apache Tamaya Resource Services 0.1-incubating-SNAPSHOT
[INFO] ------------------------------------------------------------------------
[INFO] 
[INFO] --- maven-clean-plugin:2.5:clean (default-clean) @ tamaya-resources ---
[INFO] Deleting <https://builds.apache.org/job/Tamaya-Master-branch/ws/modules/resources/target>
[INFO] 
[INFO] --- maven-enforcer-plugin:1.4:enforce (enforce-versions) @ tamaya-resources ---
[INFO] 
[INFO] --- apache-rat-plugin:0.11:check (default) @ tamaya-resources ---
[INFO] 51 implicit excludes (use -debug for more details).
[INFO] Exclude: **/*/MANIFEST.MF
[INFO] Exclude: .git
[INFO] Exclude: .gitignore
[INFO] Exclude: derby.log
[INFO] Exclude: **/META-INF/services/*
[INFO] Exclude: **/bootstrap-*
[INFO] Exclude: **/js/jquery-*
[INFO] Exclude: **/*.json
[INFO] 23 resources included (use -debug for more details)
Warning:  org.apache.xerces.jaxp.SAXParserImpl$JAXPSAXParser: Property 'http://www.oracle.com/xml/jaxp/properties/entityExpansionLimit'
is not recognized.
Compiler warnings:
  WARNING:  'org.apache.xerces.jaxp.SAXParserImpl: Property 'http://javax.xml.XMLConstants/property/accessExternalDTD'
is not recognized.'
Warning:  org.apache.xerces.parsers.SAXParser: Feature 'http://javax.xml.XMLConstants/feature/secure-processing'
is not recognized.
Warning:  org.apache.xerces.parsers.SAXParser: Property 'http://javax.xml.XMLConstants/property/accessExternalDTD'
is not recognized.
Warning:  org.apache.xerces.parsers.SAXParser: Property 'http://www.oracle.com/xml/jaxp/properties/entityExpansionLimit'
is not recognized.
[INFO] Rat check: Summary of files. Unapproved: 1 unknown: 1 generated: 0 approved: 22 licence.
[INFO] ------------------------------------------------------------------------
[INFO] Reactor Summary:
[INFO] 
[INFO] Apache Tamaya ..................................... SUCCESS [ 27.694 s]
[INFO] Apache Tamaya Build Configuration ................. SUCCESS [  5.669 s]
[INFO] Apache Tamaya Java 7 Parent ....................... SUCCESS [  4.516 s]
[INFO] Apache Tamaya Java 7 API .......................... SUCCESS [ 18.797 s]
[INFO] Apache Tamaya Java 7 Core ......................... SUCCESS [ 24.069 s]
[INFO] Apache Tamaya Java 8 Parent ....................... SUCCESS [ 50.305 s]
[INFO] Apache Tamaya Java 8 API .......................... SUCCESS [ 21.586 s]
[INFO] Apache Tamaya Java 8 Core ......................... SUCCESS [ 33.685 s]
[INFO] Apache Tamaya Extension Modules ................... SUCCESS [  5.361 s]
[INFO] Apache Tamaya Resource Services ................... FAILURE [  0.389 s]
[INFO] Apache Tamaya Format Services ..................... SKIPPED
[INFO] Apache Tamaya JSON Support ........................ SKIPPED
[INFO] Apache Tamaya Builder ............................. SKIPPED
[INFO] Apache Tamaya API Extensions ...................... SKIPPED
[INFO] Apache Tamaya Resolver Services ................... SKIPPED
[INFO] Apache Tamaya Injection Support ................... SKIPPED
[INFO] Apache Tamaya Event and dynamic Update Extensions . SKIPPED
[INFO] ------------------------------------------------------------------------
[INFO] BUILD FAILURE
[INFO] ------------------------------------------------------------------------
[INFO] Total time: 03:23 min
[INFO] Finished at: 2015-03-21T17:46:10+00:00
[INFO] Final Memory: 65M/734M
[INFO] ------------------------------------------------------------------------
[ERROR] Failed to execute goal org.apache.rat:apache-rat-plugin:0.11:check (default) on project
tamaya-resources: Too many files with unapproved license: 1 See RAT report in: <https://builds.apache.org/job/Tamaya-Master-branch/ws/modules/resources/target/rat.txt>
-> [Help 1]
[ERROR] 
[ERROR] To see the full stack trace of the errors, re-run Maven with the -e switch.
[ERROR] Re-run Maven using the -X switch to enable full debug logging.
[ERROR] 
[ERROR] For more information about the errors and possible solutions, please read the following
articles:
[ERROR] [Help 1] http://cwiki.apache.org/confluence/display/MAVEN/MojoFailureException
[ERROR] 
[ERROR] After correcting the problems, you can resume the build with the command
[ERROR]   mvn <goals> -rf :tamaya-resources
[JENKINS] Archiving <https://builds.apache.org/job/Tamaya-Master-branch/ws/java7/core/pom.xml>
to org.apache.tamaya/tamaya-java7-core/0.1-incubating-SNAPSHOT/tamaya-java7-core-0.1-incubating-SNAPSHOT.pom
[JENKINS] Archiving <https://builds.apache.org/job/Tamaya-Master-branch/ws/java7/core/target/tamaya-java7-core-0.1-incubating-SNAPSHOT.jar>
to org.apache.tamaya/tamaya-java7-core/0.1-incubating-20150321.174408-64/tamaya-java7-core-0.1-incubating-20150321.174408-64.jar
Sending artifact delta relative to Tamaya-Master-branch » Apache Tamaya Java 7 Core #243
Archived 2 artifacts
Archive block size is 32768
Received 0 blocks and 65566 bytes
Compression is 0.0%
Took 0.17 sec
[JENKINS] Archiving <https://builds.apache.org/job/Tamaya-Master-branch/ws/modules/injection/pom.xml>
to org.apache.tamaya.ext/tamaya-injection/0.1-incubating-SNAPSHOT/tamaya-injection-0.1-incubating-SNAPSHOT.pom
Sending artifact delta relative to Tamaya-Master-branch » Apache Tamaya Injection Support
#242
Archived 1 artifacts
Archive block size is 32768
Received 0 blocks and 2317 bytes
Compression is 0.0%
Took 0.15 sec
[JENKINS] Archiving <https://builds.apache.org/job/Tamaya-Master-branch/ws/modules/json/pom.xml>
to org.apache.tamaya.ext/tamaya-json/0.1-incubating-SNAPSHOT/tamaya-json-0.1-incubating-SNAPSHOT.pom
Sending artifact delta relative to Tamaya-Master-branch » Apache Tamaya JSON Support #242
Archived 1 artifacts
Archive block size is 32768
Received 0 blocks and 5377 bytes
Compression is 0.0%
Took 0.18 sec
[JENKINS] Archiving <https://builds.apache.org/job/Tamaya-Master-branch/ws/modules/events/pom.xml>
to org.apache.tamaya.ext/tamaya-events/0.1-incubating-SNAPSHOT/tamaya-events-0.1-incubating-SNAPSHOT.pom
Sending artifact delta relative to Tamaya-Master-branch » Apache Tamaya Event and dynamic
Update Extensions #242
Archived 1 artifacts
Archive block size is 32768
Received 0 blocks and 2269 bytes
Compression is 0.0%
Took 0.11 sec
[JENKINS] Archiving <https://builds.apache.org/job/Tamaya-Master-branch/ws/modules/formats/pom.xml>
to org.apache.tamaya.ext/tamaya-formats/0.1-incubating-SNAPSHOT/tamaya-formats-0.1-incubating-SNAPSHOT.pom
Sending artifact delta relative to Tamaya-Master-branch » Apache Tamaya Format Services #242
Archived 1 artifacts
Archive block size is 32768
Received 0 blocks and 2473 bytes
Compression is 0.0%
Took 0.1 sec
[JENKINS] Archiving <https://builds.apache.org/job/Tamaya-Master-branch/ws/java8/api/pom.xml>
to org.apache.tamaya/tamaya-api/0.1-incubating-SNAPSHOT/tamaya-api-0.1-incubating-SNAPSHOT.pom
[JENKINS] Archiving <https://builds.apache.org/job/Tamaya-Master-branch/ws/java8/api/target/tamaya-api-0.1-incubating-SNAPSHOT.jar>
to org.apache.tamaya/tamaya-api/0.1-incubating-20150321.174521-105/tamaya-api-0.1-incubating-20150321.174521-105.jar
Sending artifact delta relative to Tamaya-Master-branch » Apache Tamaya Java 8 API #243
Archived 2 artifacts
Archive block size is 32768
Received 0 blocks and 22498 bytes
Compression is 0.0%
Took 0.1 sec
[JENKINS] Archiving <https://builds.apache.org/job/Tamaya-Master-branch/ws/modules/pom.xml>
to org.apache.tamaya.ext/tamaya-extensions/0.1-incubating-SNAPSHOT/tamaya-extensions-0.1-incubating-SNAPSHOT.pom
Sending artifact delta relative to Tamaya-Master-branch » Apache Tamaya Extension Modules
#243
Archived 1 artifacts
Archive block size is 32768
Received 0 blocks and 4215 bytes
Compression is 0.0%
Took 97 ms
[JENKINS] Archiving <https://builds.apache.org/job/Tamaya-Master-branch/ws/buildconfigurations/pom.xml>
to org.apache.tamaya/buildconfigurations/0.1-incubating-SNAPSHOT/buildconfigurations-0.1-incubating-SNAPSHOT.pom
[JENKINS] Archiving <https://builds.apache.org/job/Tamaya-Master-branch/ws/buildconfigurations/target/buildconfigurations-0.1-incubating-SNAPSHOT.jar>
to org.apache.tamaya/buildconfigurations/0.1-incubating-20150321.174320-96/buildconfigurations-0.1-incubating-20150321.174320-96.jar
Sending artifact delta relative to Tamaya-Master-branch » Apache Tamaya Build Configuration
#243
Archived 2 artifacts
Archive block size is 32768
Received 0 blocks and 10729 bytes
Compression is 0.0%
Took 0.15 sec
[JENKINS] Archiving <https://builds.apache.org/job/Tamaya-Master-branch/ws/modules/resolver/pom.xml>
to org.apache.tamaya.ext/tamaya-resolver/0.1-incubating-SNAPSHOT/tamaya-resolver-0.1-incubating-SNAPSHOT.pom
Sending artifact delta relative to Tamaya-Master-branch » Apache Tamaya Resolver Services
#242
Archived 1 artifacts
Archive block size is 32768
Received 0 blocks and 2311 bytes
Compression is 0.0%
Took 0.15 sec
[JENKINS] Archiving <https://builds.apache.org/job/Tamaya-Master-branch/ws/java8/pom.xml>
to org.apache.tamaya/tamaya-java8/0.1-incubating-SNAPSHOT/tamaya-java8-0.1-incubating-SNAPSHOT.pom
Sending artifact delta relative to Tamaya-Master-branch » Apache Tamaya Java 8 Parent #243
Archived 1 artifacts
Archive block size is 32768
Received 0 blocks and 3741 bytes
Compression is 0.0%
Took 71 ms
[JENKINS] Archiving <https://builds.apache.org/job/Tamaya-Master-branch/ws/pom.xml>
to org.apache.tamaya/tamaya-all/0.1-incubating-SNAPSHOT/tamaya-all-0.1-incubating-SNAPSHOT.pom
Sending artifact delta relative to Tamaya-Master-branch » Apache Tamaya #243
Archived 1 artifacts
Archive block size is 32768
Received 0 blocks and 29159 bytes
Compression is 0.0%
Took 73 ms
[JENKINS] Archiving <https://builds.apache.org/job/Tamaya-Master-branch/ws/java7/pom.xml>
to org.apache.tamaya/tamaya-java7/0.1-incubating-SNAPSHOT/tamaya-java7-0.1-incubating-SNAPSHOT.pom
Sending artifact delta relative to Tamaya-Master-branch » Apache Tamaya Java 7 Parent #243
Archived 1 artifacts
Archive block size is 32768
Received 0 blocks and 4284 bytes
Compression is 0.0%
Took 71 ms
[JENKINS] Archiving <https://builds.apache.org/job/Tamaya-Master-branch/ws/java8/core/pom.xml>
to org.apache.tamaya/tamaya-core/0.1-incubating-SNAPSHOT/tamaya-core-0.1-incubating-SNAPSHOT.pom
[JENKINS] Archiving <https://builds.apache.org/job/Tamaya-Master-branch/ws/java8/core/target/tamaya-core-0.1-incubating-SNAPSHOT.jar>
to org.apache.tamaya/tamaya-core/0.1-incubating-20150321.174555-97/tamaya-core-0.1-incubating-20150321.174555-97.jar
Sending artifact delta relative to Tamaya-Master-branch » Apache Tamaya Java 8 Core #243
Archived 2 artifacts
Archive block size is 32768
Received 0 blocks and 73900 bytes
Compression is 0.0%
Took 0.11 sec
[JENKINS] Archiving <https://builds.apache.org/job/Tamaya-Master-branch/ws/modules/builder/pom.xml>
to org.apache.tamaya.ext/tamaya-builder/0.1-incubating-SNAPSHOT/tamaya-builder-0.1-incubating-SNAPSHOT.pom
Sending artifact delta relative to Tamaya-Master-branch » Apache Tamaya Builder #242
Archived 1 artifacts
Archive block size is 32768
Received 0 blocks and 2901 bytes
Compression is 0.0%
Took 0.17 sec
[JENKINS] Archiving <https://builds.apache.org/job/Tamaya-Master-branch/ws/modules/apiextensions/pom.xml>
to org.apache.tamaya.ext/tamaya-apiextensions/0.1-incubating-SNAPSHOT/tamaya-apiextensions-0.1-incubating-SNAPSHOT.pom
Sending artifact delta relative to Tamaya-Master-branch » Apache Tamaya API Extensions #242
Archived 1 artifacts
Archive block size is 32768
Received 0 blocks and 1721 bytes
Compression is 0.0%
Took 0.1 sec
[JENKINS] Archiving <https://builds.apache.org/job/Tamaya-Master-branch/ws/modules/resources/pom.xml>
to org.apache.tamaya.ext/tamaya-resources/0.1-incubating-SNAPSHOT/tamaya-resources-0.1-incubating-SNAPSHOT.pom
Sending artifact delta relative to Tamaya-Master-branch » Apache Tamaya Resource Services
#242
Archived 1 artifacts
Archive block size is 32768
Received 0 blocks and 1853 bytes
Compression is 0.0%
Took 72 ms
[JENKINS] Archiving <https://builds.apache.org/job/Tamaya-Master-branch/ws/java7/api/pom.xml>
to org.apache.tamaya/tamaya-java7-api/0.1-incubating-SNAPSHOT/tamaya-java7-api-0.1-incubating-SNAPSHOT.pom
[JENKINS] Archiving <https://builds.apache.org/job/Tamaya-Master-branch/ws/java7/api/target/tamaya-java7-api-0.1-incubating-SNAPSHOT.jar>
to org.apache.tamaya/tamaya-java7-api/0.1-incubating-20150321.174343-113/tamaya-java7-api-0.1-incubating-20150321.174343-113.jar
Sending artifact delta relative to Tamaya-Master-branch » Apache Tamaya Java 7 API #243
Archived 2 artifacts
Archive block size is 32768
Received 0 blocks and 18690 bytes
Compression is 0.0%
Took 98 ms
channel stopped

Mime
View raw message