tamaya-commits mailing list archives

Site index · List index
Message view « Date » · « Thread »
Top « Date » · « Thread »
From Apache Jenkins Server <jenk...@builds.apache.org>
Subject Build failed in Jenkins: Tamaya-Master-branch #210
Date Sat, 14 Feb 2015 01:28:41 GMT
See <https://builds.apache.org/job/Tamaya-Master-branch/210/changes>

Changes:

[plexus] Disabled the formats module as it not compile.

[plexus] Fixed code style layout errors.

[plexus] Added module for API extensions which are currently not part of the main API. JavaDoc
will follow.

[plexus] Fixed RAT and CheckStyle errors.

[anatole] TAMAYA-63: Fixed checlstyle warnings.

[anatole] Fixed checkstyle issues.

[anatole] Reduced memory consumption for failsafe plugin.

[anatole] Just updated refactoring done on dormant part (not compiling).

[anatole] Removed useless things on dormant.

[anatole] Added ConfiguratoinFOrmats singleton to formats module.

------------------------------------------
[...truncated 3353 lines...]
  symbol:   class ConfigurationData
  location: package org.apache.tamaya.format
[ERROR] <https://builds.apache.org/job/Tamaya-Master-branch/ws/modules/formats/src/main/java/org/apache/tamaya/format/formats/IniConfigurationFormat.java>:[43,12]
cannot find symbol
  symbol:   class ConfigurationData
  location: class org.apache.tamaya.format.formats.IniConfigurationFormat
[ERROR] <https://builds.apache.org/job/Tamaya-Master-branch/ws/modules/formats/src/main/java/org/apache/tamaya/format/BaseSimpleFormatPropertySourceProvider.java>:[66,73]
cannot find symbol
  symbol:   class ConfigurationData
  location: class org.apache.tamaya.format.BaseSimpleFormatPropertySourceProvider
[ERROR] <https://builds.apache.org/job/Tamaya-Master-branch/ws/modules/formats/src/main/java/org/apache/tamaya/format/BasePathBasedMultiFormatPropertySourceProvider.java>:[113,25]
cannot find symbol
  symbol:   class ConfigurationData
  location: class org.apache.tamaya.format.BasePathBasedMultiFormatPropertySourceProvider
[ERROR] <https://builds.apache.org/job/Tamaya-Master-branch/ws/modules/formats/src/main/java/org/apache/tamaya/format/FlattenedDefaultPropertySource.java>:[39,37]
cannot find symbol
  symbol:   variable ConfigurationData
  location: class org.apache.tamaya.format.FlattenedDefaultPropertySource
[ERROR] <https://builds.apache.org/job/Tamaya-Master-branch/ws/modules/formats/src/main/java/org/apache/tamaya/format/ConfigurationFormats.java>:[72,9]
cannot find symbol
  symbol:   class ConfigurationData
  location: class org.apache.tamaya.format.ConfigurationFormats
[ERROR] <https://builds.apache.org/job/Tamaya-Master-branch/ws/modules/formats/src/main/java/org/apache/tamaya/format/ConfigurationDataBuilder.java>:[100,28]
cannot find symbol
  symbol:   variable ConfigurationData
  location: class org.apache.tamaya.format.ConfigurationDataBuilder
[ERROR] <https://builds.apache.org/job/Tamaya-Master-branch/ws/modules/formats/src/main/java/org/apache/tamaya/format/ConfigurationDataBuilder.java>:[121,30]
cannot find symbol
  symbol:   variable ConfigurationData
  location: class org.apache.tamaya.format.ConfigurationDataBuilder
[ERROR] <https://builds.apache.org/job/Tamaya-Master-branch/ws/modules/formats/src/main/java/org/apache/tamaya/format/ConfigurationDataBuilder.java>:[129,20]
cannot find symbol
  symbol:   class ConfigurationData
  location: class org.apache.tamaya.format.ConfigurationDataBuilder
[ERROR] <https://builds.apache.org/job/Tamaya-Master-branch/ws/modules/formats/src/main/java/org/apache/tamaya/format/formats/IniConfigurationFormat.java>:[70,45]
cannot find symbol
  symbol:   variable ConfigurationData
  location: class org.apache.tamaya.format.formats.IniConfigurationFormat
[INFO] 21 errors 
[INFO] -------------------------------------------------------------
[INFO] ------------------------------------------------------------------------
[INFO] Reactor Summary:
[INFO] 
[INFO] Apache Tamaya ..................................... SUCCESS [ 24.377 s]
[INFO] Apache Tamaya Build Configuration ................. SUCCESS [  4.572 s]
[INFO] Apache Tamaya Java 7 Parent ....................... SUCCESS [  3.501 s]
[INFO] Apache Tamaya Java 7 API .......................... SUCCESS [ 16.338 s]
[INFO] Apache Tamaya Java 7 Core ......................... SUCCESS [ 21.121 s]
[INFO] Apache Tamaya Java 8 Parent ....................... SUCCESS [  4.197 s]
[INFO] Apache Tamaya Java 8 API .......................... SUCCESS [ 15.637 s]
[INFO] Apache Tamaya Java 8 Core ......................... SUCCESS [ 32.632 s]
[INFO] Apache Tamaya Extension Modules ................... SUCCESS [  4.018 s]
[INFO] Apache Tamaya Builder ............................. SUCCESS [ 17.036 s]
[INFO] Apache Tamaya API Extensions ...................... SUCCESS [ 11.288 s]
[INFO] Apache Tamaya Resource Services ................... SUCCESS [ 17.318 s]
[INFO] Apache Tamaya Resolver Services ................... SUCCESS [ 17.543 s]
[INFO] Apache Tamaya Injection Support ................... SUCCESS [ 18.675 s]
[INFO] Apache Tamaya Format Services ..................... FAILURE [  0.709 s]
[INFO] Apache Tamaya JSON Support ........................ SKIPPED
[INFO] ------------------------------------------------------------------------
[INFO] BUILD FAILURE
[INFO] ------------------------------------------------------------------------
[INFO] Total time: 03:43 min
[INFO] Finished at: 2015-02-14T01:28:36+00:00
[INFO] Final Memory: 72M/835M
[INFO] ------------------------------------------------------------------------
[ERROR] Failed to execute goal org.apache.maven.plugins:maven-compiler-plugin:3.1:compile
(default-compile) on project tamaya-formats: Compilation failure: Compilation failure:
[ERROR] <https://builds.apache.org/job/Tamaya-Master-branch/ws/modules/formats/src/main/java/org/apache/tamaya/format/ConfigurationFormat.java>:[53,5]
cannot find symbol
[ERROR] symbol:   class ConfigurationData
[ERROR] location: interface org.apache.tamaya.format.ConfigurationFormat
[ERROR] <https://builds.apache.org/job/Tamaya-Master-branch/ws/modules/formats/src/main/java/org/apache/tamaya/format/formats/PropertiesXmlFormat.java>:[21,32]
cannot find symbol
[ERROR] symbol:   class ConfigurationData
[ERROR] location: package org.apache.tamaya.format
[ERROR] <https://builds.apache.org/job/Tamaya-Master-branch/ws/modules/formats/src/main/java/org/apache/tamaya/format/formats/PropertiesXmlFormat.java>:[46,12]
cannot find symbol
[ERROR] symbol:   class ConfigurationData
[ERROR] location: class org.apache.tamaya.format.formats.PropertiesXmlFormat
[ERROR] <https://builds.apache.org/job/Tamaya-Master-branch/ws/modules/formats/src/main/java/org/apache/tamaya/format/BasePathBasedMultiFormatPropertySourceProvider.java>:[94,70]
cannot find symbol
[ERROR] symbol:   class ConfigurationData
[ERROR] location: class org.apache.tamaya.format.BasePathBasedMultiFormatPropertySourceProvider
[ERROR] <https://builds.apache.org/job/Tamaya-Master-branch/ws/modules/formats/src/main/java/org/apache/tamaya/format/FlattenedDefaultPropertySource.java>:[38,43]
cannot find symbol
[ERROR] symbol:   class ConfigurationData
[ERROR] location: class org.apache.tamaya.format.FlattenedDefaultPropertySource
[ERROR] <https://builds.apache.org/job/Tamaya-Master-branch/ws/modules/formats/src/main/java/org/apache/tamaya/format/ConfigurationFormats.java>:[59,19]
cannot find symbol
[ERROR] symbol:   class ConfigurationData
[ERROR] location: class org.apache.tamaya.format.ConfigurationFormats
[ERROR] <https://builds.apache.org/job/Tamaya-Master-branch/ws/modules/formats/src/main/java/org/apache/tamaya/format/ConfigurationFormats.java>:[71,19]
cannot find symbol
[ERROR] symbol:   class ConfigurationData
[ERROR] location: class org.apache.tamaya.format.ConfigurationFormats
[ERROR] <https://builds.apache.org/job/Tamaya-Master-branch/ws/modules/formats/src/main/java/org/apache/tamaya/format/ConfigurationDataBuilder.java>:[62,47]
cannot find symbol
[ERROR] symbol:   class ConfigurationData
[ERROR] location: class org.apache.tamaya.format.ConfigurationDataBuilder
[ERROR] <https://builds.apache.org/job/Tamaya-Master-branch/ws/modules/formats/src/main/java/org/apache/tamaya/format/ConfigurationDataBuilder.java>:[128,12]
cannot find symbol
[ERROR] symbol:   class ConfigurationData
[ERROR] location: class org.apache.tamaya.format.ConfigurationDataBuilder
[ERROR] <https://builds.apache.org/job/Tamaya-Master-branch/ws/modules/formats/src/main/java/org/apache/tamaya/format/formats/PropertiesFormat.java>:[21,32]
cannot find symbol
[ERROR] symbol:   class ConfigurationData
[ERROR] location: package org.apache.tamaya.format
[ERROR] <https://builds.apache.org/job/Tamaya-Master-branch/ws/modules/formats/src/main/java/org/apache/tamaya/format/formats/PropertiesFormat.java>:[47,12]
cannot find symbol
[ERROR] symbol:   class ConfigurationData
[ERROR] location: class org.apache.tamaya.format.formats.PropertiesFormat
[ERROR] <https://builds.apache.org/job/Tamaya-Master-branch/ws/modules/formats/src/main/java/org/apache/tamaya/format/formats/IniConfigurationFormat.java>:[22,32]
cannot find symbol
[ERROR] symbol:   class ConfigurationData
[ERROR] location: package org.apache.tamaya.format
[ERROR] <https://builds.apache.org/job/Tamaya-Master-branch/ws/modules/formats/src/main/java/org/apache/tamaya/format/formats/IniConfigurationFormat.java>:[43,12]
cannot find symbol
[ERROR] symbol:   class ConfigurationData
[ERROR] location: class org.apache.tamaya.format.formats.IniConfigurationFormat
[ERROR] <https://builds.apache.org/job/Tamaya-Master-branch/ws/modules/formats/src/main/java/org/apache/tamaya/format/BaseSimpleFormatPropertySourceProvider.java>:[66,73]
cannot find symbol
[ERROR] symbol:   class ConfigurationData
[ERROR] location: class org.apache.tamaya.format.BaseSimpleFormatPropertySourceProvider
[ERROR] <https://builds.apache.org/job/Tamaya-Master-branch/ws/modules/formats/src/main/java/org/apache/tamaya/format/BasePathBasedMultiFormatPropertySourceProvider.java>:[113,25]
cannot find symbol
[ERROR] symbol:   class ConfigurationData
[ERROR] location: class org.apache.tamaya.format.BasePathBasedMultiFormatPropertySourceProvider
[ERROR] <https://builds.apache.org/job/Tamaya-Master-branch/ws/modules/formats/src/main/java/org/apache/tamaya/format/FlattenedDefaultPropertySource.java>:[39,37]
cannot find symbol
[ERROR] symbol:   variable ConfigurationData
[ERROR] location: class org.apache.tamaya.format.FlattenedDefaultPropertySource
[ERROR] <https://builds.apache.org/job/Tamaya-Master-branch/ws/modules/formats/src/main/java/org/apache/tamaya/format/ConfigurationFormats.java>:[72,9]
cannot find symbol
[ERROR] symbol:   class ConfigurationData
[ERROR] location: class org.apache.tamaya.format.ConfigurationFormats
[ERROR] <https://builds.apache.org/job/Tamaya-Master-branch/ws/modules/formats/src/main/java/org/apache/tamaya/format/ConfigurationDataBuilder.java>:[100,28]
cannot find symbol
[ERROR] symbol:   variable ConfigurationData
[ERROR] location: class org.apache.tamaya.format.ConfigurationDataBuilder
[ERROR] <https://builds.apache.org/job/Tamaya-Master-branch/ws/modules/formats/src/main/java/org/apache/tamaya/format/ConfigurationDataBuilder.java>:[121,30]
cannot find symbol
[ERROR] symbol:   variable ConfigurationData
[ERROR] location: class org.apache.tamaya.format.ConfigurationDataBuilder
[ERROR] <https://builds.apache.org/job/Tamaya-Master-branch/ws/modules/formats/src/main/java/org/apache/tamaya/format/ConfigurationDataBuilder.java>:[129,20]
cannot find symbol
[ERROR] symbol:   class ConfigurationData
[ERROR] location: class org.apache.tamaya.format.ConfigurationDataBuilder
[ERROR] <https://builds.apache.org/job/Tamaya-Master-branch/ws/modules/formats/src/main/java/org/apache/tamaya/format/formats/IniConfigurationFormat.java>:[70,45]
cannot find symbol
[ERROR] symbol:   variable ConfigurationData
[ERROR] location: class org.apache.tamaya.format.formats.IniConfigurationFormat
[ERROR] -> [Help 1]
[ERROR] 
[ERROR] To see the full stack trace of the errors, re-run Maven with the -e switch.
[ERROR] Re-run Maven using the -X switch to enable full debug logging.
[ERROR] 
[ERROR] For more information about the errors and possible solutions, please read the following
articles:
[ERROR] [Help 1] http://cwiki.apache.org/confluence/display/MAVEN/MojoFailureException
[ERROR] 
[ERROR] After correcting the problems, you can resume the build with the command
[ERROR]   mvn <goals> -rf :tamaya-formats
[JENKINS] Archiving <https://builds.apache.org/job/Tamaya-Master-branch/ws/java7/core/pom.xml>
to org.apache.tamaya/tamaya-java7-core/0.1-incubating-SNAPSHOT/tamaya-java7-core-0.1-incubating-SNAPSHOT.pom
[JENKINS] Archiving <https://builds.apache.org/job/Tamaya-Master-branch/ws/java7/core/target/tamaya-java7-core-0.1-incubating-SNAPSHOT.jar>
to org.apache.tamaya/tamaya-java7-core/0.1-incubating-20150214.012605-33/tamaya-java7-core-0.1-incubating-20150214.012605-33.jar
Sending artifact delta relative to Tamaya-Master-branch » Apache Tamaya Java 7 Core #209
Archived 2 artifacts
Archive block size is 32768
Received 0 blocks and 66406 bytes
Compression is 0.0%
Took 0.19 sec
[JENKINS] Archiving <https://builds.apache.org/job/Tamaya-Master-branch/ws/modules/injection/pom.xml>
to org.apache.tamaya.ext/tamaya-injection/0.1-incubating-SNAPSHOT/tamaya-injection-0.1-incubating-SNAPSHOT.pom
[JENKINS] Archiving <https://builds.apache.org/job/Tamaya-Master-branch/ws/modules/injection/target/tamaya-injection-0.1-incubating-SNAPSHOT.jar>
to org.apache.tamaya.ext/tamaya-injection/0.1-incubating-20150214.012829-48/tamaya-injection-0.1-incubating-20150214.012829-48.jar
Sending artifact delta relative to Tamaya-Master-branch » Apache Tamaya Injection Support
#208
Archived 2 artifacts
Archive block size is 32768
Received 0 blocks and 43815 bytes
Compression is 0.0%
Took 0.1 sec
[JENKINS] Archiving <https://builds.apache.org/job/Tamaya-Master-branch/ws/modules/json/pom.xml>
to org.apache.tamaya.ext/tamaya-json/0.1-incubating-SNAPSHOT/tamaya-json-0.1-incubating-SNAPSHOT.pom
Sending artifact delta relative to Tamaya-Master-branch » Apache Tamaya JSON Support #208
Archived 1 artifacts
Archive block size is 32768
Received 0 blocks and 5178 bytes
Compression is 0.0%
Took 94 ms
[JENKINS] Archiving <https://builds.apache.org/job/Tamaya-Master-branch/ws/modules/formats/pom.xml>
to org.apache.tamaya.ext/tamaya-formats/0.1-incubating-SNAPSHOT/tamaya-formats-0.1-incubating-SNAPSHOT.pom
Sending artifact delta relative to Tamaya-Master-branch » Apache Tamaya Format Services #208
Archived 1 artifacts
Archive block size is 32768
Received 0 blocks and 1922 bytes
Compression is 0.0%
Took 70 ms
[JENKINS] Archiving <https://builds.apache.org/job/Tamaya-Master-branch/ws/java8/api/pom.xml>
to org.apache.tamaya/tamaya-api/0.1-incubating-SNAPSHOT/tamaya-api-0.1-incubating-SNAPSHOT.pom
[JENKINS] Archiving <https://builds.apache.org/job/Tamaya-Master-branch/ws/java8/api/target/tamaya-api-0.1-incubating-SNAPSHOT.jar>
to org.apache.tamaya/tamaya-api/0.1-incubating-20150214.012626-76/tamaya-api-0.1-incubating-20150214.012626-76.jar
Sending artifact delta relative to Tamaya-Master-branch » Apache Tamaya Java 8 API #209
Archived 2 artifacts
Archive block size is 32768
Received 0 blocks and 18999 bytes
Compression is 0.0%
Took 0.13 sec
[JENKINS] Archiving <https://builds.apache.org/job/Tamaya-Master-branch/ws/modules/pom.xml>
to org.apache.tamaya.ext/tamaya-extensions/0.1-incubating-SNAPSHOT/tamaya-extensions-0.1-incubating-SNAPSHOT.pom
Sending artifact delta relative to Tamaya-Master-branch » Apache Tamaya Extension Modules
#208
Archived 1 artifacts
Archive block size is 32768
Received 0 blocks and 4183 bytes
Compression is 0.0%
Took 75 ms
[JENKINS] Archiving <https://builds.apache.org/job/Tamaya-Master-branch/ws/buildconfigurations/pom.xml>
to org.apache.tamaya/buildconfigurations/0.1-incubating-SNAPSHOT/buildconfigurations-0.1-incubating-SNAPSHOT.pom
[JENKINS] Archiving <https://builds.apache.org/job/Tamaya-Master-branch/ws/buildconfigurations/target/buildconfigurations-0.1-incubating-SNAPSHOT.jar>
to org.apache.tamaya/buildconfigurations/0.1-incubating-20150214.012522-62/buildconfigurations-0.1-incubating-20150214.012522-62.jar
Sending artifact delta relative to Tamaya-Master-branch » Apache Tamaya Build Configuration
#209
Archived 2 artifacts
Archive block size is 32768
Received 0 blocks and 10729 bytes
Compression is 0.0%
Took 0.1 sec
[JENKINS] Archiving <https://builds.apache.org/job/Tamaya-Master-branch/ws/modules/resolver/pom.xml>
to org.apache.tamaya.ext/tamaya-resolver/0.1-incubating-SNAPSHOT/tamaya-resolver-0.1-incubating-SNAPSHOT.pom
[JENKINS] Archiving <https://builds.apache.org/job/Tamaya-Master-branch/ws/modules/resolver/target/tamaya-resolver-0.1-incubating-SNAPSHOT.jar>
to org.apache.tamaya.ext/tamaya-resolver/0.1-incubating-20150214.012809-64/tamaya-resolver-0.1-incubating-20150214.012809-64.jar
Sending artifact delta relative to Tamaya-Master-branch » Apache Tamaya Resolver Services
#208
Archived 2 artifacts
Archive block size is 32768
Received 0 blocks and 26106 bytes
Compression is 0.0%
Took 0.11 sec
[JENKINS] Archiving <https://builds.apache.org/job/Tamaya-Master-branch/ws/java8/pom.xml>
to org.apache.tamaya/tamaya-java8/0.1-incubating-SNAPSHOT/tamaya-java8-0.1-incubating-SNAPSHOT.pom
Sending artifact delta relative to Tamaya-Master-branch » Apache Tamaya Java 8 Parent #209
Archived 1 artifacts
Archive block size is 32768
Received 0 blocks and 3741 bytes
Compression is 0.0%
Took 97 ms
[JENKINS] Archiving <https://builds.apache.org/job/Tamaya-Master-branch/ws/pom.xml>
to org.apache.tamaya/tamaya-all/0.1-incubating-SNAPSHOT/tamaya-all-0.1-incubating-SNAPSHOT.pom
Sending artifact delta relative to Tamaya-Master-branch » Apache Tamaya #209
Archived 1 artifacts
Archive block size is 32768
Received 0 blocks and 28937 bytes
Compression is 0.0%
Took 94 ms
[JENKINS] Archiving <https://builds.apache.org/job/Tamaya-Master-branch/ws/java7/pom.xml>
to org.apache.tamaya/tamaya-java7/0.1-incubating-SNAPSHOT/tamaya-java7-0.1-incubating-SNAPSHOT.pom
Sending artifact delta relative to Tamaya-Master-branch » Apache Tamaya Java 7 Parent #209
Archived 1 artifacts
Archive block size is 32768
Received 0 blocks and 4284 bytes
Compression is 0.0%
Took 72 ms
[JENKINS] Archiving <https://builds.apache.org/job/Tamaya-Master-branch/ws/java8/core/pom.xml>
to org.apache.tamaya/tamaya-core/0.1-incubating-SNAPSHOT/tamaya-core-0.1-incubating-SNAPSHOT.pom
[JENKINS] Archiving <https://builds.apache.org/job/Tamaya-Master-branch/ws/java8/core/target/tamaya-core-0.1-incubating-SNAPSHOT.jar>
to org.apache.tamaya/tamaya-core/0.1-incubating-20150214.012659-68/tamaya-core-0.1-incubating-20150214.012659-68.jar
Sending artifact delta relative to Tamaya-Master-branch » Apache Tamaya Java 8 Core #208
Archived 2 artifacts
Archive block size is 32768
Received 0 blocks and 70977 bytes
Compression is 0.0%
Took 0.12 sec
[JENKINS] Archiving <https://builds.apache.org/job/Tamaya-Master-branch/ws/modules/builder/pom.xml>
to org.apache.tamaya.ext/tamaya-builder/0.1-incubating-SNAPSHOT/tamaya-builder-0.1-incubating-SNAPSHOT.pom
[JENKINS] Archiving <https://builds.apache.org/job/Tamaya-Master-branch/ws/modules/builder/target/tamaya-builder-0.1-incubating-SNAPSHOT.jar>
to org.apache.tamaya.ext/tamaya-builder/0.1-incubating-20150214.012721-30/tamaya-builder-0.1-incubating-20150214.012721-30.jar
Sending artifact delta relative to Tamaya-Master-branch » Apache Tamaya Builder #208
Archived 2 artifacts
Archive block size is 32768
Received 0 blocks and 18844 bytes
Compression is 0.0%
Took 0.11 sec
[JENKINS] Archiving <https://builds.apache.org/job/Tamaya-Master-branch/ws/modules/apiextensions/pom.xml>
to org.apache.tamaya.ext/tamaya-apiextensions/0.1-incubating-SNAPSHOT/tamaya-apiextensions-0.1-incubating-SNAPSHOT.pom
[JENKINS] Archiving <https://builds.apache.org/job/Tamaya-Master-branch/ws/modules/apiextensions/target/tamaya-apiextensions-0.1-incubating-SNAPSHOT.jar>
to org.apache.tamaya.ext/tamaya-apiextensions/0.1-incubating-20150214.012734-1/tamaya-apiextensions-0.1-incubating-20150214.012734-1.jar
No prior successful build to compare, so performing full copy of artifacts
[JENKINS] Archiving <https://builds.apache.org/job/Tamaya-Master-branch/ws/modules/resources/pom.xml>
to org.apache.tamaya.ext/tamaya-resources/0.1-incubating-SNAPSHOT/tamaya-resources-0.1-incubating-SNAPSHOT.pom
[JENKINS] Archiving <https://builds.apache.org/job/Tamaya-Master-branch/ws/modules/resources/target/tamaya-resources-0.1-incubating-SNAPSHOT.jar>
to org.apache.tamaya.ext/tamaya-resources/0.1-incubating-20150214.012751-65/tamaya-resources-0.1-incubating-20150214.012751-65.jar
Sending artifact delta relative to Tamaya-Master-branch » Apache Tamaya Resource Services
#208
Archived 2 artifacts
Archive block size is 32768
Received 0 blocks and 26186 bytes
Compression is 0.0%
Took 0.1 sec
[JENKINS] Archiving <https://builds.apache.org/job/Tamaya-Master-branch/ws/java7/api/pom.xml>
to org.apache.tamaya/tamaya-java7-api/0.1-incubating-SNAPSHOT/tamaya-java7-api-0.1-incubating-SNAPSHOT.pom
[JENKINS] Archiving <https://builds.apache.org/job/Tamaya-Master-branch/ws/java7/api/target/tamaya-java7-api-0.1-incubating-SNAPSHOT.jar>
to org.apache.tamaya/tamaya-java7-api/0.1-incubating-20150214.012543-80/tamaya-java7-api-0.1-incubating-20150214.012543-80.jar
Sending artifact delta relative to Tamaya-Master-branch » Apache Tamaya Java 7 API #209
Archived 2 artifacts
Archive block size is 32768
Received 0 blocks and 17608 bytes
Compression is 0.0%
Took 0.1 sec
channel stopped

Mime
View raw message