tamaya-commits mailing list archives

Site index · List index
Message view « Date » · « Thread »
Top « Date » · « Thread »
From Apache Jenkins Server <jenk...@builds.apache.org>
Subject Build failed in Jenkins: Tamaya-Master-branch #211
Date Sat, 14 Feb 2015 18:47:22 GMT
See <https://builds.apache.org/job/Tamaya-Master-branch/211/changes>

Changes:

[anatole] Extended ConfigurationFormat interface. Added additional logic for checking on names/extensions.

[anatole] Extended ConfigurationFormats. Added simple tests.

------------------------------------------
[...truncated 3173 lines...]
[ERROR] <https://builds.apache.org/job/Tamaya-Master-branch/ws/modules/formats/src/main/java/org/apache/tamaya/format/BasePathBasedMultiFormatPropertySourceProvider.java>:[114,25]
cannot find symbol
  symbol:   class ConfigurationData
  location: class org.apache.tamaya.format.BasePathBasedMultiFormatPropertySourceProvider
[ERROR] <https://builds.apache.org/job/Tamaya-Master-branch/ws/modules/formats/src/main/java/org/apache/tamaya/format/FlattenedDefaultPropertySource.java>:[39,37]
cannot find symbol
  symbol:   variable ConfigurationData
  location: class org.apache.tamaya.format.FlattenedDefaultPropertySource
[ERROR] <https://builds.apache.org/job/Tamaya-Master-branch/ws/modules/formats/src/main/java/org/apache/tamaya/format/ConfigurationFormats.java>:[122,9]
cannot find symbol
  symbol:   class ConfigurationData
  location: class org.apache.tamaya.format.ConfigurationFormats
[ERROR] <https://builds.apache.org/job/Tamaya-Master-branch/ws/modules/formats/src/main/java/org/apache/tamaya/format/ConfigurationDataBuilder.java>:[99,28]
cannot find symbol
  symbol:   variable ConfigurationData
  location: class org.apache.tamaya.format.ConfigurationDataBuilder
[ERROR] <https://builds.apache.org/job/Tamaya-Master-branch/ws/modules/formats/src/main/java/org/apache/tamaya/format/ConfigurationDataBuilder.java>:[120,30]
cannot find symbol
  symbol:   variable ConfigurationData
  location: class org.apache.tamaya.format.ConfigurationDataBuilder
[ERROR] <https://builds.apache.org/job/Tamaya-Master-branch/ws/modules/formats/src/main/java/org/apache/tamaya/format/ConfigurationDataBuilder.java>:[128,20]
cannot find symbol
  symbol:   class ConfigurationData
  location: class org.apache.tamaya.format.ConfigurationDataBuilder
[ERROR] <https://builds.apache.org/job/Tamaya-Master-branch/ws/modules/formats/src/main/java/org/apache/tamaya/format/formats/IniConfigurationFormat.java>:[77,45]
cannot find symbol
  symbol:   variable ConfigurationData
  location: class org.apache.tamaya.format.formats.IniConfigurationFormat
[INFO] 22 errors 
[INFO] -------------------------------------------------------------
[INFO] ------------------------------------------------------------------------
[INFO] Reactor Summary:
[INFO] 
[INFO] Apache Tamaya ..................................... SUCCESS [ 23.049 s]
[INFO] Apache Tamaya Build Configuration ................. SUCCESS [  5.707 s]
[INFO] Apache Tamaya Java 7 Parent ....................... SUCCESS [  4.830 s]
[INFO] Apache Tamaya Java 7 API .......................... SUCCESS [ 16.558 s]
[INFO] Apache Tamaya Java 7 Core ......................... SUCCESS [ 23.229 s]
[INFO] Apache Tamaya Java 8 Parent ....................... SUCCESS [  6.538 s]
[INFO] Apache Tamaya Java 8 API .......................... SUCCESS [ 18.569 s]
[INFO] Apache Tamaya Java 8 Core ......................... SUCCESS [ 27.960 s]
[INFO] Apache Tamaya Extension Modules ................... SUCCESS [  5.309 s]
[INFO] Apache Tamaya Builder ............................. SUCCESS [ 17.459 s]
[INFO] Apache Tamaya API Extensions ...................... SUCCESS [ 13.693 s]
[INFO] Apache Tamaya Resource Services ................... SUCCESS [ 19.053 s]
[INFO] Apache Tamaya Resolver Services ................... SUCCESS [ 20.652 s]
[INFO] Apache Tamaya Injection Support ................... SUCCESS [ 19.296 s]
[INFO] Apache Tamaya Format Services ..................... FAILURE [  0.727 s]
[INFO] Apache Tamaya JSON Support ........................ SKIPPED
[INFO] ------------------------------------------------------------------------
[INFO] BUILD FAILURE
[INFO] ------------------------------------------------------------------------
[INFO] Total time: 03:57 min
[INFO] Finished at: 2015-02-14T18:47:17+00:00
[INFO] Final Memory: 72M/825M
[INFO] ------------------------------------------------------------------------
[ERROR] Failed to execute goal org.apache.maven.plugins:maven-compiler-plugin:3.1:compile
(default-compile) on project tamaya-formats: Compilation failure: Compilation failure:
[ERROR] <https://builds.apache.org/job/Tamaya-Master-branch/ws/modules/formats/src/main/java/org/apache/tamaya/format/ConfigurationFormat.java>:[91,5]
cannot find symbol
[ERROR] symbol:   class ConfigurationData
[ERROR] location: interface org.apache.tamaya.format.ConfigurationFormat
[ERROR] <https://builds.apache.org/job/Tamaya-Master-branch/ws/modules/formats/src/main/java/org/apache/tamaya/format/formats/PropertiesXmlFormat.java>:[21,32]
cannot find symbol
[ERROR] symbol:   class ConfigurationData
[ERROR] location: package org.apache.tamaya.format
[ERROR] <https://builds.apache.org/job/Tamaya-Master-branch/ws/modules/formats/src/main/java/org/apache/tamaya/format/formats/PropertiesXmlFormat.java>:[52,12]
cannot find symbol
[ERROR] symbol:   class ConfigurationData
[ERROR] location: class org.apache.tamaya.format.formats.PropertiesXmlFormat
[ERROR] <https://builds.apache.org/job/Tamaya-Master-branch/ws/modules/formats/src/main/java/org/apache/tamaya/format/BasePathBasedMultiFormatPropertySourceProvider.java>:[95,70]
cannot find symbol
[ERROR] symbol:   class ConfigurationData
[ERROR] location: class org.apache.tamaya.format.BasePathBasedMultiFormatPropertySourceProvider
[ERROR] <https://builds.apache.org/job/Tamaya-Master-branch/ws/modules/formats/src/main/java/org/apache/tamaya/format/FlattenedDefaultPropertySource.java>:[38,43]
cannot find symbol
[ERROR] symbol:   class ConfigurationData
[ERROR] location: class org.apache.tamaya.format.FlattenedDefaultPropertySource
[ERROR] <https://builds.apache.org/job/Tamaya-Master-branch/ws/modules/formats/src/main/java/org/apache/tamaya/format/ConfigurationFormats.java>:[77,19]
cannot find symbol
[ERROR] symbol:   class ConfigurationData
[ERROR] location: class org.apache.tamaya.format.ConfigurationFormats
[ERROR] <https://builds.apache.org/job/Tamaya-Master-branch/ws/modules/formats/src/main/java/org/apache/tamaya/format/ConfigurationFormats.java>:[90,19]
cannot find symbol
[ERROR] symbol:   class ConfigurationData
[ERROR] location: class org.apache.tamaya.format.ConfigurationFormats
[ERROR] <https://builds.apache.org/job/Tamaya-Master-branch/ws/modules/formats/src/main/java/org/apache/tamaya/format/ConfigurationFormats.java>:[103,19]
cannot find symbol
[ERROR] symbol:   class ConfigurationData
[ERROR] location: class org.apache.tamaya.format.ConfigurationFormats
[ERROR] <https://builds.apache.org/job/Tamaya-Master-branch/ws/modules/formats/src/main/java/org/apache/tamaya/format/ConfigurationDataBuilder.java>:[61,47]
cannot find symbol
[ERROR] symbol:   class ConfigurationData
[ERROR] location: class org.apache.tamaya.format.ConfigurationDataBuilder
[ERROR] <https://builds.apache.org/job/Tamaya-Master-branch/ws/modules/formats/src/main/java/org/apache/tamaya/format/ConfigurationDataBuilder.java>:[127,12]
cannot find symbol
[ERROR] symbol:   class ConfigurationData
[ERROR] location: class org.apache.tamaya.format.ConfigurationDataBuilder
[ERROR] <https://builds.apache.org/job/Tamaya-Master-branch/ws/modules/formats/src/main/java/org/apache/tamaya/format/formats/PropertiesFormat.java>:[21,32]
cannot find symbol
[ERROR] symbol:   class ConfigurationData
[ERROR] location: package org.apache.tamaya.format
[ERROR] <https://builds.apache.org/job/Tamaya-Master-branch/ws/modules/formats/src/main/java/org/apache/tamaya/format/formats/PropertiesFormat.java>:[55,12]
cannot find symbol
[ERROR] symbol:   class ConfigurationData
[ERROR] location: class org.apache.tamaya.format.formats.PropertiesFormat
[ERROR] <https://builds.apache.org/job/Tamaya-Master-branch/ws/modules/formats/src/main/java/org/apache/tamaya/format/formats/IniConfigurationFormat.java>:[22,32]
cannot find symbol
[ERROR] symbol:   class ConfigurationData
[ERROR] location: package org.apache.tamaya.format
[ERROR] <https://builds.apache.org/job/Tamaya-Master-branch/ws/modules/formats/src/main/java/org/apache/tamaya/format/formats/IniConfigurationFormat.java>:[50,12]
cannot find symbol
[ERROR] symbol:   class ConfigurationData
[ERROR] location: class org.apache.tamaya.format.formats.IniConfigurationFormat
[ERROR] <https://builds.apache.org/job/Tamaya-Master-branch/ws/modules/formats/src/main/java/org/apache/tamaya/format/BaseSimpleFormatPropertySourceProvider.java>:[66,73]
cannot find symbol
[ERROR] symbol:   class ConfigurationData
[ERROR] location: class org.apache.tamaya.format.BaseSimpleFormatPropertySourceProvider
[ERROR] <https://builds.apache.org/job/Tamaya-Master-branch/ws/modules/formats/src/main/java/org/apache/tamaya/format/BasePathBasedMultiFormatPropertySourceProvider.java>:[114,25]
cannot find symbol
[ERROR] symbol:   class ConfigurationData
[ERROR] location: class org.apache.tamaya.format.BasePathBasedMultiFormatPropertySourceProvider
[ERROR] <https://builds.apache.org/job/Tamaya-Master-branch/ws/modules/formats/src/main/java/org/apache/tamaya/format/FlattenedDefaultPropertySource.java>:[39,37]
cannot find symbol
[ERROR] symbol:   variable ConfigurationData
[ERROR] location: class org.apache.tamaya.format.FlattenedDefaultPropertySource
[ERROR] <https://builds.apache.org/job/Tamaya-Master-branch/ws/modules/formats/src/main/java/org/apache/tamaya/format/ConfigurationFormats.java>:[122,9]
cannot find symbol
[ERROR] symbol:   class ConfigurationData
[ERROR] location: class org.apache.tamaya.format.ConfigurationFormats
[ERROR] <https://builds.apache.org/job/Tamaya-Master-branch/ws/modules/formats/src/main/java/org/apache/tamaya/format/ConfigurationDataBuilder.java>:[99,28]
cannot find symbol
[ERROR] symbol:   variable ConfigurationData
[ERROR] location: class org.apache.tamaya.format.ConfigurationDataBuilder
[ERROR] <https://builds.apache.org/job/Tamaya-Master-branch/ws/modules/formats/src/main/java/org/apache/tamaya/format/ConfigurationDataBuilder.java>:[120,30]
cannot find symbol
[ERROR] symbol:   variable ConfigurationData
[ERROR] location: class org.apache.tamaya.format.ConfigurationDataBuilder
[ERROR] <https://builds.apache.org/job/Tamaya-Master-branch/ws/modules/formats/src/main/java/org/apache/tamaya/format/ConfigurationDataBuilder.java>:[128,20]
cannot find symbol
[ERROR] symbol:   class ConfigurationData
[ERROR] location: class org.apache.tamaya.format.ConfigurationDataBuilder
[ERROR] <https://builds.apache.org/job/Tamaya-Master-branch/ws/modules/formats/src/main/java/org/apache/tamaya/format/formats/IniConfigurationFormat.java>:[77,45]
cannot find symbol
[ERROR] symbol:   variable ConfigurationData
[ERROR] location: class org.apache.tamaya.format.formats.IniConfigurationFormat
[ERROR] -> [Help 1]
[ERROR] 
[ERROR] To see the full stack trace of the errors, re-run Maven with the -e switch.
[ERROR] Re-run Maven using the -X switch to enable full debug logging.
[ERROR] 
[ERROR] For more information about the errors and possible solutions, please read the following
articles:
[ERROR] [Help 1] http://cwiki.apache.org/confluence/display/MAVEN/MojoFailureException
[ERROR] 
[ERROR] After correcting the problems, you can resume the build with the command
[ERROR]   mvn <goals> -rf :tamaya-formats
[JENKINS] Archiving <https://builds.apache.org/job/Tamaya-Master-branch/ws/java7/core/pom.xml>
to org.apache.tamaya/tamaya-java7-core/0.1-incubating-SNAPSHOT/tamaya-java7-core-0.1-incubating-SNAPSHOT.pom
[JENKINS] Archiving <https://builds.apache.org/job/Tamaya-Master-branch/ws/java7/core/target/tamaya-java7-core-0.1-incubating-SNAPSHOT.jar>
to org.apache.tamaya/tamaya-java7-core/0.1-incubating-20150214.184434-34/tamaya-java7-core-0.1-incubating-20150214.184434-34.jar
Sending artifact delta relative to Tamaya-Master-branch » Apache Tamaya Java 7 Core #210
Archived 2 artifacts
Archive block size is 32768
Received 0 blocks and 66406 bytes
Compression is 0.0%
Took 0.29 sec
[JENKINS] Archiving <https://builds.apache.org/job/Tamaya-Master-branch/ws/modules/injection/pom.xml>
to org.apache.tamaya.ext/tamaya-injection/0.1-incubating-SNAPSHOT/tamaya-injection-0.1-incubating-SNAPSHOT.pom
[JENKINS] Archiving <https://builds.apache.org/job/Tamaya-Master-branch/ws/modules/injection/target/tamaya-injection-0.1-incubating-SNAPSHOT.jar>
to org.apache.tamaya.ext/tamaya-injection/0.1-incubating-20150214.184709-49/tamaya-injection-0.1-incubating-20150214.184709-49.jar
Sending artifact delta relative to Tamaya-Master-branch » Apache Tamaya Injection Support
#210
Archived 2 artifacts
Archive block size is 32768
Received 0 blocks and 43815 bytes
Compression is 0.0%
Took 0.12 sec
[JENKINS] Archiving <https://builds.apache.org/job/Tamaya-Master-branch/ws/modules/json/pom.xml>
to org.apache.tamaya.ext/tamaya-json/0.1-incubating-SNAPSHOT/tamaya-json-0.1-incubating-SNAPSHOT.pom
Sending artifact delta relative to Tamaya-Master-branch » Apache Tamaya JSON Support #208
Archived 1 artifacts
Archive block size is 32768
Received 0 blocks and 5178 bytes
Compression is 0.0%
Took 0.12 sec
[JENKINS] Archiving <https://builds.apache.org/job/Tamaya-Master-branch/ws/modules/formats/pom.xml>
to org.apache.tamaya.ext/tamaya-formats/0.1-incubating-SNAPSHOT/tamaya-formats-0.1-incubating-SNAPSHOT.pom
Sending artifact delta relative to Tamaya-Master-branch » Apache Tamaya Format Services #208
Archived 1 artifacts
Archive block size is 32768
Received 0 blocks and 2335 bytes
Compression is 0.0%
Took 0.12 sec
[JENKINS] Archiving <https://builds.apache.org/job/Tamaya-Master-branch/ws/java8/api/pom.xml>
to org.apache.tamaya/tamaya-api/0.1-incubating-SNAPSHOT/tamaya-api-0.1-incubating-SNAPSHOT.pom
[JENKINS] Archiving <https://builds.apache.org/job/Tamaya-Master-branch/ws/java8/api/target/tamaya-api-0.1-incubating-SNAPSHOT.jar>
to org.apache.tamaya/tamaya-api/0.1-incubating-20150214.184500-77/tamaya-api-0.1-incubating-20150214.184500-77.jar
Sending artifact delta relative to Tamaya-Master-branch » Apache Tamaya Java 8 API #210
Archived 2 artifacts
Archive block size is 32768
Received 0 blocks and 18999 bytes
Compression is 0.0%
Took 0.14 sec
[JENKINS] Archiving <https://builds.apache.org/job/Tamaya-Master-branch/ws/modules/pom.xml>
to org.apache.tamaya.ext/tamaya-extensions/0.1-incubating-SNAPSHOT/tamaya-extensions-0.1-incubating-SNAPSHOT.pom
Sending artifact delta relative to Tamaya-Master-branch » Apache Tamaya Extension Modules
#210
Archived 1 artifacts
Archive block size is 32768
Received 0 blocks and 4183 bytes
Compression is 0.0%
Took 86 ms
[JENKINS] Archiving <https://builds.apache.org/job/Tamaya-Master-branch/ws/buildconfigurations/pom.xml>
to org.apache.tamaya/buildconfigurations/0.1-incubating-SNAPSHOT/buildconfigurations-0.1-incubating-SNAPSHOT.pom
[JENKINS] Archiving <https://builds.apache.org/job/Tamaya-Master-branch/ws/buildconfigurations/target/buildconfigurations-0.1-incubating-SNAPSHOT.jar>
to org.apache.tamaya/buildconfigurations/0.1-incubating-20150214.184348-63/buildconfigurations-0.1-incubating-20150214.184348-63.jar
Sending artifact delta relative to Tamaya-Master-branch » Apache Tamaya Build Configuration
#210
Archived 2 artifacts
Archive block size is 32768
Received 0 blocks and 10729 bytes
Compression is 0.0%
Took 0.14 sec
[JENKINS] Archiving <https://builds.apache.org/job/Tamaya-Master-branch/ws/modules/resolver/pom.xml>
to org.apache.tamaya.ext/tamaya-resolver/0.1-incubating-SNAPSHOT/tamaya-resolver-0.1-incubating-SNAPSHOT.pom
[JENKINS] Archiving <https://builds.apache.org/job/Tamaya-Master-branch/ws/modules/resolver/target/tamaya-resolver-0.1-incubating-SNAPSHOT.jar>
to org.apache.tamaya.ext/tamaya-resolver/0.1-incubating-20150214.184649-65/tamaya-resolver-0.1-incubating-20150214.184649-65.jar
Sending artifact delta relative to Tamaya-Master-branch » Apache Tamaya Resolver Services
#210
Archived 2 artifacts
Archive block size is 32768
Received 0 blocks and 26106 bytes
Compression is 0.0%
Took 82 ms
[JENKINS] Archiving <https://builds.apache.org/job/Tamaya-Master-branch/ws/java8/pom.xml>
to org.apache.tamaya/tamaya-java8/0.1-incubating-SNAPSHOT/tamaya-java8-0.1-incubating-SNAPSHOT.pom
Sending artifact delta relative to Tamaya-Master-branch » Apache Tamaya Java 8 Parent #210
Archived 1 artifacts
Archive block size is 32768
Received 0 blocks and 3741 bytes
Compression is 0.0%
Took 82 ms
[JENKINS] Archiving <https://builds.apache.org/job/Tamaya-Master-branch/ws/pom.xml>
to org.apache.tamaya/tamaya-all/0.1-incubating-SNAPSHOT/tamaya-all-0.1-incubating-SNAPSHOT.pom
Sending artifact delta relative to Tamaya-Master-branch » Apache Tamaya #210
Archived 1 artifacts
Archive block size is 32768
Received 0 blocks and 28937 bytes
Compression is 0.0%
Took 85 ms
[JENKINS] Archiving <https://builds.apache.org/job/Tamaya-Master-branch/ws/java7/pom.xml>
to org.apache.tamaya/tamaya-java7/0.1-incubating-SNAPSHOT/tamaya-java7-0.1-incubating-SNAPSHOT.pom
Sending artifact delta relative to Tamaya-Master-branch » Apache Tamaya Java 7 Parent #210
Archived 1 artifacts
Archive block size is 32768
Received 0 blocks and 4284 bytes
Compression is 0.0%
Took 75 ms
[JENKINS] Archiving <https://builds.apache.org/job/Tamaya-Master-branch/ws/java8/core/pom.xml>
to org.apache.tamaya/tamaya-core/0.1-incubating-SNAPSHOT/tamaya-core-0.1-incubating-SNAPSHOT.pom
[JENKINS] Archiving <https://builds.apache.org/job/Tamaya-Master-branch/ws/java8/core/target/tamaya-core-0.1-incubating-SNAPSHOT.jar>
to org.apache.tamaya/tamaya-core/0.1-incubating-20150214.184530-69/tamaya-core-0.1-incubating-20150214.184530-69.jar
Sending artifact delta relative to Tamaya-Master-branch » Apache Tamaya Java 8 Core #210
Archived 2 artifacts
Archive block size is 32768
Received 0 blocks and 70977 bytes
Compression is 0.0%
Took 0.16 sec
[JENKINS] Archiving <https://builds.apache.org/job/Tamaya-Master-branch/ws/modules/builder/pom.xml>
to org.apache.tamaya.ext/tamaya-builder/0.1-incubating-SNAPSHOT/tamaya-builder-0.1-incubating-SNAPSHOT.pom
[JENKINS] Archiving <https://builds.apache.org/job/Tamaya-Master-branch/ws/modules/builder/target/tamaya-builder-0.1-incubating-SNAPSHOT.jar>
to org.apache.tamaya.ext/tamaya-builder/0.1-incubating-20150214.184554-31/tamaya-builder-0.1-incubating-20150214.184554-31.jar
Sending artifact delta relative to Tamaya-Master-branch » Apache Tamaya Builder #210
Archived 2 artifacts
Archive block size is 32768
Received 0 blocks and 18844 bytes
Compression is 0.0%
Took 0.14 sec
[JENKINS] Archiving <https://builds.apache.org/job/Tamaya-Master-branch/ws/modules/apiextensions/pom.xml>
to org.apache.tamaya.ext/tamaya-apiextensions/0.1-incubating-SNAPSHOT/tamaya-apiextensions-0.1-incubating-SNAPSHOT.pom
[JENKINS] Archiving <https://builds.apache.org/job/Tamaya-Master-branch/ws/modules/apiextensions/target/tamaya-apiextensions-0.1-incubating-SNAPSHOT.jar>
to org.apache.tamaya.ext/tamaya-apiextensions/0.1-incubating-20150214.184608-2/tamaya-apiextensions-0.1-incubating-20150214.184608-2.jar
Sending artifact delta relative to Tamaya-Master-branch » Apache Tamaya API Extensions #210
Archived 2 artifacts
Archive block size is 32768
Received 0 blocks and 8427 bytes
Compression is 0.0%
Took 90 ms
[JENKINS] Archiving <https://builds.apache.org/job/Tamaya-Master-branch/ws/modules/resources/pom.xml>
to org.apache.tamaya.ext/tamaya-resources/0.1-incubating-SNAPSHOT/tamaya-resources-0.1-incubating-SNAPSHOT.pom
[JENKINS] Archiving <https://builds.apache.org/job/Tamaya-Master-branch/ws/modules/resources/target/tamaya-resources-0.1-incubating-SNAPSHOT.jar>
to org.apache.tamaya.ext/tamaya-resources/0.1-incubating-20150214.184627-66/tamaya-resources-0.1-incubating-20150214.184627-66.jar
Sending artifact delta relative to Tamaya-Master-branch » Apache Tamaya Resource Services
#210
Archived 2 artifacts
Archive block size is 32768
Received 0 blocks and 26186 bytes
Compression is 0.0%
Took 88 ms
[JENKINS] Archiving <https://builds.apache.org/job/Tamaya-Master-branch/ws/java7/api/pom.xml>
to org.apache.tamaya/tamaya-java7-api/0.1-incubating-SNAPSHOT/tamaya-java7-api-0.1-incubating-SNAPSHOT.pom
[JENKINS] Archiving <https://builds.apache.org/job/Tamaya-Master-branch/ws/java7/api/target/tamaya-java7-api-0.1-incubating-SNAPSHOT.jar>
to org.apache.tamaya/tamaya-java7-api/0.1-incubating-20150214.184411-81/tamaya-java7-api-0.1-incubating-20150214.184411-81.jar
Sending artifact delta relative to Tamaya-Master-branch » Apache Tamaya Java 7 API #210
Archived 2 artifacts
Archive block size is 32768
Received 0 blocks and 17608 bytes
Compression is 0.0%
Took 88 ms
channel stopped

Mime
View raw message