tamaya-commits mailing list archives

Site index · List index
Message view « Date » · « Thread »
Top « Date » · « Thread »
From Apache Jenkins Server <jenk...@builds.apache.org>
Subject Build failed in Jenkins: Tamaya-Master-branch #221
Date Sat, 28 Feb 2015 22:45:13 GMT
See <https://builds.apache.org/job/Tamaya-Master-branch/221/changes>

Changes:

[anatole] Updated documentation.

------------------------------------------
[...truncated 1880 lines...]
[INFO] <<< findbugs-maven-plugin:3.0.0:check (findbugs-analyze) @ tamaya-extensions
<<<
[INFO] 
[INFO] --- findbugs-maven-plugin:3.0.0:check (findbugs-analyze) @ tamaya-extensions ---
[INFO] 
[INFO] --- maven-checkstyle-plugin:2.13:check (verify-style) @ tamaya-extensions ---
[INFO] 
[INFO] 
[INFO] --- maven-site-plugin:3.3:attach-descriptor (attach-descriptor) @ tamaya-extensions
---
[INFO] 
[INFO] --- maven-javadoc-plugin:2.9.1:jar (attach-javadocs) @ tamaya-extensions ---
[INFO] Skipping javadoc generation
[INFO] 
[INFO] --- maven-failsafe-plugin:2.17:integration-test (default) @ tamaya-extensions ---
[INFO] No tests to run.
[INFO] Skipping execution of surefire because it has already been run for this configuration
[JENKINS] Recording test results[INFO] 
[INFO] --- maven-failsafe-plugin:2.17:verify (default) @ tamaya-extensions ---
[INFO] No tests to run.

[JENKINS] Recording test results[INFO] 
[INFO] --- maven-install-plugin:2.5.2:install (default-install) @ tamaya-extensions ---
[INFO] Installing <https://builds.apache.org/job/Tamaya-Master-branch/ws/modules/pom.xml>
to /home/jenkins/jenkins-slave/maven-repositories/0/org/apache/tamaya/ext/tamaya-extensions/0.1-incubating-SNAPSHOT/tamaya-extensions-0.1-incubating-SNAPSHOT.pom

[INFO] 
[INFO] --- maven-deploy-plugin:2.8.2:deploy (default-deploy) @ tamaya-extensions ---
[INFO] Downloading: https://repository.apache.org/content/repositories/snapshots/org/apache/tamaya/ext/tamaya-extensions/0.1-incubating-SNAPSHOT/maven-metadata.xml
[INFO] Downloaded: https://repository.apache.org/content/repositories/snapshots/org/apache/tamaya/ext/tamaya-extensions/0.1-incubating-SNAPSHOT/maven-metadata.xml
(635 B at 2.4 KB/sec)
[INFO] Uploading: https://repository.apache.org/content/repositories/snapshots/org/apache/tamaya/ext/tamaya-extensions/0.1-incubating-SNAPSHOT/tamaya-extensions-0.1-incubating-20150228.224501-75.pom
[INFO] Uploaded: https://repository.apache.org/content/repositories/snapshots/org/apache/tamaya/ext/tamaya-extensions/0.1-incubating-SNAPSHOT/tamaya-extensions-0.1-incubating-20150228.224501-75.pom
(4 KB at 13.9 KB/sec)
[INFO] Downloading: https://repository.apache.org/content/repositories/snapshots/org/apache/tamaya/ext/tamaya-extensions/maven-metadata.xml
[INFO] Downloaded: https://repository.apache.org/content/repositories/snapshots/org/apache/tamaya/ext/tamaya-extensions/maven-metadata.xml
(463 B at 2.5 KB/sec)
[INFO] Uploading: https://repository.apache.org/content/repositories/snapshots/org/apache/tamaya/ext/tamaya-extensions/0.1-incubating-SNAPSHOT/maven-metadata.xml
[INFO] Uploaded: https://repository.apache.org/content/repositories/snapshots/org/apache/tamaya/ext/tamaya-extensions/0.1-incubating-SNAPSHOT/maven-metadata.xml
(635 B at 2.2 KB/sec)
[INFO] Uploading: https://repository.apache.org/content/repositories/snapshots/org/apache/tamaya/ext/tamaya-extensions/maven-metadata.xml
[INFO] Uploaded: https://repository.apache.org/content/repositories/snapshots/org/apache/tamaya/ext/tamaya-extensions/maven-metadata.xml
(463 B at 1.4 KB/sec)
[INFO]                                                                         
[INFO] ------------------------------------------------------------------------
[INFO] Building Apache Tamaya Builder 0.1-incubating-SNAPSHOT
[INFO] ------------------------------------------------------------------------
[INFO] 
[INFO] --- maven-clean-plugin:2.5:clean (default-clean) @ tamaya-builder ---
[INFO] Deleting <https://builds.apache.org/job/Tamaya-Master-branch/ws/modules/builder/target>
[INFO] 
[INFO] --- maven-enforcer-plugin:1.4:enforce (enforce-versions) @ tamaya-builder ---
[INFO] 
[INFO] --- apache-rat-plugin:0.11:check (default) @ tamaya-builder ---
[INFO] 51 implicit excludes (use -debug for more details).
[INFO] Exclude: **/*/MANIFEST.MF
[INFO] Exclude: .git
[INFO] Exclude: .gitignore
[INFO] Exclude: derby.log
[INFO] Exclude: **/META-INF/services/*
[INFO] Exclude: **/bootstrap-*
[INFO] Exclude: **/js/jquery-*
[INFO] Exclude: **/*.json
[INFO] 15 resources included (use -debug for more details)
Warning:  org.apache.xerces.jaxp.SAXParserImpl$JAXPSAXParser: Property 'http://www.oracle.com/xml/jaxp/properties/entityExpansionLimit'
is not recognized.
Compiler warnings:
  WARNING:  'org.apache.xerces.jaxp.SAXParserImpl: Property 'http://javax.xml.XMLConstants/property/accessExternalDTD'
is not recognized.'
Warning:  org.apache.xerces.parsers.SAXParser: Feature 'http://javax.xml.XMLConstants/feature/secure-processing'
is not recognized.
Warning:  org.apache.xerces.parsers.SAXParser: Property 'http://javax.xml.XMLConstants/property/accessExternalDTD'
is not recognized.
Warning:  org.apache.xerces.parsers.SAXParser: Property 'http://www.oracle.com/xml/jaxp/properties/entityExpansionLimit'
is not recognized.
[INFO] Rat check: Summary of files. Unapproved: 0 unknown: 0 generated: 0 approved: 15 licence.
[INFO] 
[INFO] --- maven-remote-resources-plugin:1.5:process (default) @ tamaya-builder ---
[INFO] 
[INFO] --- maven-resources-plugin:2.6:resources (default-resources) @ tamaya-builder ---
[INFO] Using 'UTF-8' encoding to copy filtered resources.
[INFO] skip non existing resourceDirectory <https://builds.apache.org/job/Tamaya-Master-branch/ws/modules/builder/src/main/resources>
[INFO] Copying 3 resources
[INFO] 
[INFO] --- maven-compiler-plugin:3.1:compile (default-compile) @ tamaya-builder ---
[INFO] Changes detected - recompiling the module!
[INFO] Compiling 2 source files to <https://builds.apache.org/job/Tamaya-Master-branch/ws/modules/builder/target/classes>
[INFO] -------------------------------------------------------------
[WARNING] COMPILATION WARNING : 
[INFO] -------------------------------------------------------------
[WARNING] <https://builds.apache.org/job/Tamaya-Master-branch/ws/modules/builder/src/main/java/org/apache/tamaya/builder/ConfigurationBuilder.java>:[83,23]
setConfigurationContext(org.apache.tamaya.spi.ConfigurationContext) in org.apache.tamaya.builder.ProgrammaticConfigurationContext.Builder
has been deprecated
[INFO] 1 warning
[INFO] -------------------------------------------------------------
[INFO] -------------------------------------------------------------
[ERROR] COMPILATION ERROR : 
[INFO] -------------------------------------------------------------
[ERROR] <https://builds.apache.org/job/Tamaya-Master-branch/ws/modules/builder/src/main/java/org/apache/tamaya/builder/ProgrammaticConfigurationContext.java>:[56,1]
org.apache.tamaya.builder.ProgrammaticConfigurationContext is not abstract and does not override
abstract method toBuilder() in org.apache.tamaya.spi.ConfigurationContext
[ERROR] <https://builds.apache.org/job/Tamaya-Master-branch/ws/modules/builder/src/main/java/org/apache/tamaya/builder/ProgrammaticConfigurationContext.java>:[158,5]
method does not override or implement a method from a supertype
[ERROR] <https://builds.apache.org/job/Tamaya-Master-branch/ws/modules/builder/src/main/java/org/apache/tamaya/builder/ProgrammaticConfigurationContext.java>:[225,5]
method does not override or implement a method from a supertype
[INFO] 3 errors 
[INFO] -------------------------------------------------------------
[INFO] ------------------------------------------------------------------------
[INFO] Reactor Summary:
[INFO] 
[INFO] Apache Tamaya ..................................... SUCCESS [ 22.169 s]
[INFO] Apache Tamaya Build Configuration ................. SUCCESS [  5.956 s]
[INFO] Apache Tamaya Java 7 Parent ....................... SUCCESS [  4.093 s]
[INFO] Apache Tamaya Java 7 API .......................... SUCCESS [ 19.531 s]
[INFO] Apache Tamaya Java 7 Core ......................... SUCCESS [ 22.174 s]
[INFO] Apache Tamaya Java 8 Parent ....................... SUCCESS [  5.077 s]
[INFO] Apache Tamaya Java 8 API .......................... SUCCESS [ 17.410 s]
[INFO] Apache Tamaya Java 8 Core ......................... SUCCESS [ 30.807 s]
[INFO] Apache Tamaya Extension Modules ................... SUCCESS [  4.508 s]
[INFO] Apache Tamaya Builder ............................. FAILURE [  0.801 s]
[INFO] Apache Tamaya API Extensions ...................... SKIPPED
[INFO] Apache Tamaya Resource Services ................... SKIPPED
[INFO] Apache Tamaya Resolver Services ................... SKIPPED
[INFO] Apache Tamaya Injection Support ................... SKIPPED
[INFO] Apache Tamaya Format Services ..................... SKIPPED
[INFO] Apache Tamaya JSON Support ........................ SKIPPED
[INFO] Apache Tamaya Event and dynamic Update Extensions . SKIPPED
[INFO] ------------------------------------------------------------------------
[INFO] BUILD FAILURE
[INFO] ------------------------------------------------------------------------
[INFO] Total time: 02:24 min
[INFO] Finished at: 2015-02-28T22:45:08+00:00
[INFO] Final Memory: 65M/713M
[INFO] ------------------------------------------------------------------------
[ERROR] Failed to execute goal org.apache.maven.plugins:maven-compiler-plugin:3.1:compile
(default-compile) on project tamaya-builder: Compilation failure: Compilation failure:
[ERROR] <https://builds.apache.org/job/Tamaya-Master-branch/ws/modules/builder/src/main/java/org/apache/tamaya/builder/ProgrammaticConfigurationContext.java>:[56,1]
org.apache.tamaya.builder.ProgrammaticConfigurationContext is not abstract and does not override
abstract method toBuilder() in org.apache.tamaya.spi.ConfigurationContext
[ERROR] <https://builds.apache.org/job/Tamaya-Master-branch/ws/modules/builder/src/main/java/org/apache/tamaya/builder/ProgrammaticConfigurationContext.java>:[158,5]
method does not override or implement a method from a supertype
[ERROR] <https://builds.apache.org/job/Tamaya-Master-branch/ws/modules/builder/src/main/java/org/apache/tamaya/builder/ProgrammaticConfigurationContext.java>:[225,5]
method does not override or implement a method from a supertype
[ERROR] -> [Help 1]
[ERROR] 
[ERROR] To see the full stack trace of the errors, re-run Maven with the -e switch.
[ERROR] Re-run Maven using the -X switch to enable full debug logging.
[ERROR] 
[ERROR] For more information about the errors and possible solutions, please read the following
articles:
[ERROR] [Help 1] http://cwiki.apache.org/confluence/display/MAVEN/MojoFailureException
[ERROR] 
[ERROR] After correcting the problems, you can resume the build with the command
[ERROR]   mvn <goals> -rf :tamaya-builder
[JENKINS] Archiving <https://builds.apache.org/job/Tamaya-Master-branch/ws/java7/core/pom.xml>
to org.apache.tamaya/tamaya-java7-core/0.1-incubating-SNAPSHOT/tamaya-java7-core-0.1-incubating-SNAPSHOT.pom
[JENKINS] Archiving <https://builds.apache.org/job/Tamaya-Master-branch/ws/java7/core/target/tamaya-java7-core-0.1-incubating-SNAPSHOT.jar>
to org.apache.tamaya/tamaya-java7-core/0.1-incubating-20150228.224400-41/tamaya-java7-core-0.1-incubating-20150228.224400-41.jar
Sending artifact delta relative to Tamaya-Master-branch » Apache Tamaya Java 7 Core #220
Archived 2 artifacts
Archive block size is 32768
Received 0 blocks and 65566 bytes
Compression is 0.0%
Took 0.11 sec
[JENKINS] Archiving <https://builds.apache.org/job/Tamaya-Master-branch/ws/modules/injection/pom.xml>
to org.apache.tamaya.ext/tamaya-injection/0.1-incubating-SNAPSHOT/tamaya-injection-0.1-incubating-SNAPSHOT.pom
Sending artifact delta relative to Tamaya-Master-branch » Apache Tamaya Injection Support
#215
Archived 1 artifacts
Archive block size is 32768
Received 0 blocks and 2317 bytes
Compression is 0.0%
Took 72 ms
[JENKINS] Archiving <https://builds.apache.org/job/Tamaya-Master-branch/ws/modules/json/pom.xml>
to org.apache.tamaya.ext/tamaya-json/0.1-incubating-SNAPSHOT/tamaya-json-0.1-incubating-SNAPSHOT.pom
Sending artifact delta relative to Tamaya-Master-branch » Apache Tamaya JSON Support #215
Archived 1 artifacts
Archive block size is 32768
Received 0 blocks and 5377 bytes
Compression is 0.0%
Took 73 ms
[JENKINS] Archiving <https://builds.apache.org/job/Tamaya-Master-branch/ws/modules/events/pom.xml>
to org.apache.tamaya.ext/tamaya-events/0.1-incubating-SNAPSHOT/tamaya-events-0.1-incubating-SNAPSHOT.pom
No prior successful build to compare, so performing full copy of artifacts
[JENKINS] Archiving <https://builds.apache.org/job/Tamaya-Master-branch/ws/modules/formats/pom.xml>
to org.apache.tamaya.ext/tamaya-formats/0.1-incubating-SNAPSHOT/tamaya-formats-0.1-incubating-SNAPSHOT.pom
Sending artifact delta relative to Tamaya-Master-branch » Apache Tamaya Format Services #215
Archived 1 artifacts
Archive block size is 32768
Received 0 blocks and 2335 bytes
Compression is 0.0%
Took 72 ms
[JENKINS] Archiving <https://builds.apache.org/job/Tamaya-Master-branch/ws/java8/api/pom.xml>
to org.apache.tamaya/tamaya-api/0.1-incubating-SNAPSHOT/tamaya-api-0.1-incubating-SNAPSHOT.pom
[JENKINS] Archiving <https://builds.apache.org/job/Tamaya-Master-branch/ws/java8/api/target/tamaya-api-0.1-incubating-SNAPSHOT.jar>
to org.apache.tamaya/tamaya-api/0.1-incubating-20150228.224423-83/tamaya-api-0.1-incubating-20150228.224423-83.jar
Sending artifact delta relative to Tamaya-Master-branch » Apache Tamaya Java 8 API #220
Archived 2 artifacts
Archive block size is 32768
Received 0 blocks and 21857 bytes
Compression is 0.0%
Took 76 ms
[JENKINS] Archiving <https://builds.apache.org/job/Tamaya-Master-branch/ws/modules/pom.xml>
to org.apache.tamaya.ext/tamaya-extensions/0.1-incubating-SNAPSHOT/tamaya-extensions-0.1-incubating-SNAPSHOT.pom
Sending artifact delta relative to Tamaya-Master-branch » Apache Tamaya Extension Modules
#220
Archived 1 artifacts
Archive block size is 32768
Received 0 blocks and 4215 bytes
Compression is 0.0%
Took 73 ms
[JENKINS] Archiving <https://builds.apache.org/job/Tamaya-Master-branch/ws/buildconfigurations/pom.xml>
to org.apache.tamaya/buildconfigurations/0.1-incubating-SNAPSHOT/buildconfigurations-0.1-incubating-SNAPSHOT.pom
[JENKINS] Archiving <https://builds.apache.org/job/Tamaya-Master-branch/ws/buildconfigurations/target/buildconfigurations-0.1-incubating-SNAPSHOT.jar>
to org.apache.tamaya/buildconfigurations/0.1-incubating-20150228.224311-73/buildconfigurations-0.1-incubating-20150228.224311-73.jar
Sending artifact delta relative to Tamaya-Master-branch » Apache Tamaya Build Configuration
#220
Archived 2 artifacts
Archive block size is 32768
Received 0 blocks and 10729 bytes
Compression is 0.0%
Took 74 ms
[JENKINS] Archiving <https://builds.apache.org/job/Tamaya-Master-branch/ws/modules/resolver/pom.xml>
to org.apache.tamaya.ext/tamaya-resolver/0.1-incubating-SNAPSHOT/tamaya-resolver-0.1-incubating-SNAPSHOT.pom
Sending artifact delta relative to Tamaya-Master-branch » Apache Tamaya Resolver Services
#215
Archived 1 artifacts
Archive block size is 32768
Received 0 blocks and 2311 bytes
Compression is 0.0%
Took 72 ms
[JENKINS] Archiving <https://builds.apache.org/job/Tamaya-Master-branch/ws/java8/pom.xml>
to org.apache.tamaya/tamaya-java8/0.1-incubating-SNAPSHOT/tamaya-java8-0.1-incubating-SNAPSHOT.pom
Sending artifact delta relative to Tamaya-Master-branch » Apache Tamaya Java 8 Parent #220
Archived 1 artifacts
Archive block size is 32768
Received 0 blocks and 3741 bytes
Compression is 0.0%
Took 73 ms
[JENKINS] Archiving <https://builds.apache.org/job/Tamaya-Master-branch/ws/pom.xml>
to org.apache.tamaya/tamaya-all/0.1-incubating-SNAPSHOT/tamaya-all-0.1-incubating-SNAPSHOT.pom
Sending artifact delta relative to Tamaya-Master-branch » Apache Tamaya #220
Archived 1 artifacts
Archive block size is 32768
Received 0 blocks and 28937 bytes
Compression is 0.0%
Took 75 ms
[JENKINS] Archiving <https://builds.apache.org/job/Tamaya-Master-branch/ws/java7/pom.xml>
to org.apache.tamaya/tamaya-java7/0.1-incubating-SNAPSHOT/tamaya-java7-0.1-incubating-SNAPSHOT.pom
Sending artifact delta relative to Tamaya-Master-branch » Apache Tamaya Java 7 Parent #220
Archived 1 artifacts
Archive block size is 32768
Received 0 blocks and 4284 bytes
Compression is 0.0%
Took 72 ms
[JENKINS] Archiving <https://builds.apache.org/job/Tamaya-Master-branch/ws/java8/core/pom.xml>
to org.apache.tamaya/tamaya-core/0.1-incubating-SNAPSHOT/tamaya-core-0.1-incubating-SNAPSHOT.pom
[JENKINS] Archiving <https://builds.apache.org/job/Tamaya-Master-branch/ws/java8/core/target/tamaya-core-0.1-incubating-SNAPSHOT.jar>
to org.apache.tamaya/tamaya-core/0.1-incubating-20150228.224451-75/tamaya-core-0.1-incubating-20150228.224451-75.jar
Sending artifact delta relative to Tamaya-Master-branch » Apache Tamaya Java 8 Core #220
Archived 2 artifacts
Archive block size is 32768
Received 0 blocks and 73999 bytes
Compression is 0.0%
Took 0.11 sec
[JENKINS] Archiving <https://builds.apache.org/job/Tamaya-Master-branch/ws/modules/builder/pom.xml>
to org.apache.tamaya.ext/tamaya-builder/0.1-incubating-SNAPSHOT/tamaya-builder-0.1-incubating-SNAPSHOT.pom
Sending artifact delta relative to Tamaya-Master-branch » Apache Tamaya Builder #215
Archived 1 artifacts
Archive block size is 32768
Received 0 blocks and 2473 bytes
Compression is 0.0%
Took 72 ms
[JENKINS] Archiving <https://builds.apache.org/job/Tamaya-Master-branch/ws/modules/apiextensions/pom.xml>
to org.apache.tamaya.ext/tamaya-apiextensions/0.1-incubating-SNAPSHOT/tamaya-apiextensions-0.1-incubating-SNAPSHOT.pom
Sending artifact delta relative to Tamaya-Master-branch » Apache Tamaya API Extensions #215
Archived 1 artifacts
Archive block size is 32768
Received 0 blocks and 1721 bytes
Compression is 0.0%
Took 72 ms
[JENKINS] Archiving <https://builds.apache.org/job/Tamaya-Master-branch/ws/modules/resources/pom.xml>
to org.apache.tamaya.ext/tamaya-resources/0.1-incubating-SNAPSHOT/tamaya-resources-0.1-incubating-SNAPSHOT.pom
Sending artifact delta relative to Tamaya-Master-branch » Apache Tamaya Resource Services
#215
Archived 1 artifacts
Archive block size is 32768
Received 0 blocks and 1853 bytes
Compression is 0.0%
Took 73 ms
[JENKINS] Archiving <https://builds.apache.org/job/Tamaya-Master-branch/ws/java7/api/pom.xml>
to org.apache.tamaya/tamaya-java7-api/0.1-incubating-SNAPSHOT/tamaya-java7-api-0.1-incubating-SNAPSHOT.pom
[JENKINS] Archiving <https://builds.apache.org/job/Tamaya-Master-branch/ws/java7/api/target/tamaya-java7-api-0.1-incubating-SNAPSHOT.jar>
to org.apache.tamaya/tamaya-java7-api/0.1-incubating-20150228.224334-90/tamaya-java7-api-0.1-incubating-20150228.224334-90.jar
Sending artifact delta relative to Tamaya-Master-branch » Apache Tamaya Java 7 API #220
Archived 2 artifacts
Archive block size is 32768
Received 0 blocks and 18688 bytes
Compression is 0.0%
Took 75 ms
channel stopped

Mime
View raw message