tamaya-commits mailing list archives

Site index · List index
Message view « Date » · « Thread »
Top « Date » · « Thread »
From Apache Jenkins Server <jenk...@builds.apache.org>
Subject Build failed in Jenkins: Tamaya-Master-branch #209
Date Thu, 12 Feb 2015 22:40:20 GMT
See <https://builds.apache.org/job/Tamaya-Master-branch/209/changes>

Changes:

[anatole] TAMAYA-43: Tried fix for resolution on Linux box.

[anatole] TAMAYA-43: Removed dep to findbugs/jsr305

[anatole] Reworked format API.

[anatole] TAMAYA-63: Improved/unified implementations for various converters. Aligned tests
for Java 7/8.

[anatole] TAMAYA-63: Improved/unified implementations for various converters. Aligned tests
for Java 7/8.

[anatole] TAMAYA-63: Added NumberConverter.

[anatole] TAMAYA-63: Added tests for EnumConvertger, added bugfix.

[anatole] TAMAYA-63: Added converters for URL, URI and Class.

[anatole] TAMAYA-63: Added converters for URL, URI and Class (Java7).

------------------------------------------
[...truncated 1499 lines...]
[INFO] Downloaded: http://repo.maven.apache.org/maven2/org/jboss/arquillian/container/arquillian-container-spi/1.1.6.Final/arquillian-container-spi-1.1.6.Final.jar
(51 KB at 342.0 KB/sec)
[INFO] Downloading: http://repo.maven.apache.org/maven2/org/jboss/arquillian/junit/arquillian-junit-container/1.1.6.Final/arquillian-junit-container-1.1.6.Final.jar
[INFO] Downloaded: http://repo.maven.apache.org/maven2/org/jboss/shrinkwrap/shrinkwrap-api/1.2.2/shrinkwrap-api-1.2.2.jar
(65 KB at 467.7 KB/sec)
[INFO] Downloading: http://repo.maven.apache.org/maven2/org/jboss/arquillian/junit/arquillian-junit-core/1.1.6.Final/arquillian-junit-core-1.1.6.Final.jar
[INFO] Downloaded: http://repo.maven.apache.org/maven2/org/jboss/arquillian/junit/arquillian-junit-container/1.1.6.Final/arquillian-junit-container-1.1.6.Final.jar
(9 KB at 106.0 KB/sec)
[INFO] Downloading: http://repo.maven.apache.org/maven2/org/jboss/arquillian/test/arquillian-test-api/1.1.6.Final/arquillian-test-api-1.1.6.Final.jar
[INFO] Downloaded: http://repo.maven.apache.org/maven2/org/jboss/arquillian/daemon/arquillian-daemon-protocol-wire/1.0.0.Alpha1/arquillian-daemon-protocol-wire-1.0.0.Alpha1.jar
(4 KB at 24.4 KB/sec)
[INFO] Downloading: http://repo.maven.apache.org/maven2/org/jboss/arquillian/core/arquillian-core-api/1.1.6.Final/arquillian-core-api-1.1.6.Final.jar
[INFO] Downloaded: http://repo.maven.apache.org/maven2/org/jboss/arquillian/daemon/arquillian-daemon-server/1.0.0.Alpha1/arquillian-daemon-server-1.0.0.Alpha1.jar
(24 KB at 216.7 KB/sec)
[INFO] Downloading: http://repo.maven.apache.org/maven2/org/jboss/arquillian/test/arquillian-test-spi/1.1.6.Final/arquillian-test-spi-1.1.6.Final.jar
[INFO] Downloaded: http://repo.maven.apache.org/maven2/org/jboss/arquillian/test/arquillian-test-api/1.1.6.Final/arquillian-test-api-1.1.6.Final.jar
(4 KB at 45.4 KB/sec)
[INFO] Downloading: http://repo.maven.apache.org/maven2/org/jboss/arquillian/core/arquillian-core-spi/1.1.6.Final/arquillian-core-spi-1.1.6.Final.jar
[INFO] Downloaded: http://repo.maven.apache.org/maven2/org/jboss/arquillian/core/arquillian-core-api/1.1.6.Final/arquillian-core-api-1.1.6.Final.jar
(10 KB at 117.9 KB/sec)
[INFO] Downloading: http://repo.maven.apache.org/maven2/org/jboss/arquillian/container/arquillian-container-test-api/1.1.6.Final/arquillian-container-test-api-1.1.6.Final.jar
[INFO] Downloaded: http://repo.maven.apache.org/maven2/org/jboss/arquillian/test/arquillian-test-spi/1.1.6.Final/arquillian-test-spi-1.1.6.Final.jar
(38 KB at 335.6 KB/sec)
[INFO] Downloading: http://repo.maven.apache.org/maven2/org/jboss/arquillian/core/arquillian-core-impl-base/1.1.6.Final/arquillian-core-impl-base-1.1.6.Final.jar
[INFO] Downloaded: http://repo.maven.apache.org/maven2/org/jboss/arquillian/junit/arquillian-junit-core/1.1.6.Final/arquillian-junit-core-1.1.6.Final.jar
(30 KB at 176.2 KB/sec)
[INFO] Downloading: http://repo.maven.apache.org/maven2/org/jboss/arquillian/test/arquillian-test-impl-base/1.1.6.Final/arquillian-test-impl-base-1.1.6.Final.jar
[INFO] Downloaded: http://repo.maven.apache.org/maven2/org/jboss/arquillian/container/arquillian-container-test-api/1.1.6.Final/arquillian-container-test-api-1.1.6.Final.jar
(9 KB at 111.0 KB/sec)
[INFO] Downloading: http://repo.maven.apache.org/maven2/org/jboss/arquillian/container/arquillian-container-impl-base/1.1.6.Final/arquillian-container-impl-base-1.1.6.Final.jar
[INFO] Downloaded: http://repo.maven.apache.org/maven2/org/jboss/arquillian/core/arquillian-core-spi/1.1.6.Final/arquillian-core-spi-1.1.6.Final.jar
(27 KB at 232.1 KB/sec)
[INFO] Downloading: http://repo.maven.apache.org/maven2/org/jboss/arquillian/config/arquillian-config-api/1.1.6.Final/arquillian-config-api-1.1.6.Final.jar
[INFO] Downloaded: http://repo.maven.apache.org/maven2/org/jboss/arquillian/daemon/arquillian-daemon-main/1.0.0.Alpha1/arquillian-daemon-main-1.0.0.Alpha1.jar
(1405 KB at 2425.3 KB/sec)
[INFO] Downloading: http://repo.maven.apache.org/maven2/org/jboss/arquillian/config/arquillian-config-impl-base/1.1.6.Final/arquillian-config-impl-base-1.1.6.Final.jar
[INFO] Downloaded: http://repo.maven.apache.org/maven2/org/jboss/arquillian/test/arquillian-test-impl-base/1.1.6.Final/arquillian-test-impl-base-1.1.6.Final.jar
(25 KB at 180.1 KB/sec)
[INFO] Downloading: http://repo.maven.apache.org/maven2/org/jboss/shrinkwrap/descriptors/shrinkwrap-descriptors-spi/2.0.0-alpha-6/shrinkwrap-descriptors-spi-2.0.0-alpha-6.jar
[INFO] Downloaded: http://repo.maven.apache.org/maven2/org/jboss/arquillian/config/arquillian-config-api/1.1.6.Final/arquillian-config-api-1.1.6.Final.jar
(8 KB at 92.5 KB/sec)
[INFO] Downloading: http://repo.maven.apache.org/maven2/org/jboss/arquillian/container/arquillian-container-test-impl-base/1.1.6.Final/arquillian-container-test-impl-base-1.1.6.Final.jar
[INFO] Downloaded: http://repo.maven.apache.org/maven2/org/jboss/arquillian/container/arquillian-container-impl-base/1.1.6.Final/arquillian-container-impl-base-1.1.6.Final.jar
(77 KB at 530.3 KB/sec)
[INFO] Downloading: http://repo.maven.apache.org/maven2/org/jboss/shrinkwrap/shrinkwrap-impl-base/1.2.2/shrinkwrap-impl-base-1.2.2.jar
[INFO] Downloaded: http://repo.maven.apache.org/maven2/org/jboss/arquillian/core/arquillian-core-impl-base/1.1.6.Final/arquillian-core-impl-base-1.1.6.Final.jar
(60 KB at 317.0 KB/sec)
[INFO] Downloading: http://repo.maven.apache.org/maven2/org/jboss/shrinkwrap/shrinkwrap-spi/1.2.2/shrinkwrap-spi-1.2.2.jar
[INFO] Downloaded: http://repo.maven.apache.org/maven2/org/jboss/shrinkwrap/descriptors/shrinkwrap-descriptors-spi/2.0.0-alpha-6/shrinkwrap-descriptors-spi-2.0.0-alpha-6.jar
(38 KB at 358.0 KB/sec)
[INFO] Downloaded: http://repo.maven.apache.org/maven2/org/jboss/shrinkwrap/shrinkwrap-spi/1.2.2/shrinkwrap-spi-1.2.2.jar
(4 KB at 50.4 KB/sec)
[INFO] Downloaded: http://repo.maven.apache.org/maven2/org/jboss/arquillian/config/arquillian-config-impl-base/1.1.6.Final/arquillian-config-impl-base-1.1.6.Final.jar
(41 KB at 291.2 KB/sec)
[INFO] Downloaded: http://repo.maven.apache.org/maven2/org/jboss/arquillian/container/arquillian-container-test-impl-base/1.1.6.Final/arquillian-container-test-impl-base-1.1.6.Final.jar
(102 KB at 543.7 KB/sec)
[INFO] Downloaded: http://repo.maven.apache.org/maven2/org/jboss/shrinkwrap/shrinkwrap-impl-base/1.2.2/shrinkwrap-impl-base-1.2.2.jar
(183 KB at 851.0 KB/sec)
[INFO] 
[INFO] --- maven-clean-plugin:2.5:clean (default-clean) @ tamaya-core ---
[INFO] Deleting <https://builds.apache.org/job/Tamaya-Master-branch/ws/java8/core/target>
[INFO] 
[INFO] --- maven-enforcer-plugin:1.4:enforce (enforce-versions) @ tamaya-core ---
[INFO] 
[INFO] --- apache-rat-plugin:0.11:check (default) @ tamaya-core ---
[INFO] 51 implicit excludes (use -debug for more details).
[INFO] Exclude: **/*/MANIFEST.MF
[INFO] Exclude: .git
[INFO] Exclude: .gitignore
[INFO] Exclude: derby.log
[INFO] Exclude: **/META-INF/services/*
[INFO] Exclude: **/bootstrap-*
[INFO] Exclude: **/js/jquery-*
[INFO] Exclude: **/*.json
[INFO] 68 resources included (use -debug for more details)
Warning:  org.apache.xerces.jaxp.SAXParserImpl$JAXPSAXParser: Property 'http://www.oracle.com/xml/jaxp/properties/entityExpansionLimit'
is not recognized.
Compiler warnings:
  WARNING:  'org.apache.xerces.jaxp.SAXParserImpl: Property 'http://javax.xml.XMLConstants/property/accessExternalDTD'
is not recognized.'
Warning:  org.apache.xerces.parsers.SAXParser: Feature 'http://javax.xml.XMLConstants/feature/secure-processing'
is not recognized.
Warning:  org.apache.xerces.parsers.SAXParser: Property 'http://javax.xml.XMLConstants/property/accessExternalDTD'
is not recognized.
Warning:  org.apache.xerces.parsers.SAXParser: Property 'http://www.oracle.com/xml/jaxp/properties/entityExpansionLimit'
is not recognized.
[INFO] Rat check: Summary of files. Unapproved: 0 unknown: 0 generated: 0 approved: 68 licence.
[INFO] 
[INFO] --- maven-remote-resources-plugin:1.5:process (default) @ tamaya-core ---
[INFO] 
[INFO] --- maven-resources-plugin:2.6:resources (default-resources) @ tamaya-core ---
[INFO] Using 'UTF-8' encoding to copy filtered resources.
[INFO] Copying 6 resources
[INFO] Copying 3 resources
[INFO] 
[INFO] --- maven-compiler-plugin:3.1:compile (default-compile) @ tamaya-core ---
[INFO] Changes detected - recompiling the module!
[INFO] Compiling 34 source files to <https://builds.apache.org/job/Tamaya-Master-branch/ws/java8/core/target/classes>
[WARNING] <https://builds.apache.org/job/Tamaya-Master-branch/ws/java8/core/src/main/java/org/apache/tamaya/core/internal/DefaultServiceContext.java>:
Some input files use unchecked or unsafe operations.
[WARNING] <https://builds.apache.org/job/Tamaya-Master-branch/ws/java8/core/src/main/java/org/apache/tamaya/core/internal/DefaultServiceContext.java>:
Recompile with -Xlint:unchecked for details.
[INFO] 
[INFO] >>> findbugs-maven-plugin:3.0.0:check (findbugs-analyze) @ tamaya-core >>>
[INFO] 
[INFO] --- findbugs-maven-plugin:3.0.0:findbugs (findbugs) @ tamaya-core ---
[INFO] Fork Value is true
[INFO] Done FindBugs Analysis....
[INFO] 
[INFO] <<< findbugs-maven-plugin:3.0.0:check (findbugs-analyze) @ tamaya-core <<<
[INFO] 
[INFO] --- findbugs-maven-plugin:3.0.0:check (findbugs-analyze) @ tamaya-core ---
[INFO] BugInstance size is 0
[INFO] Error size is 0
[INFO] No errors/warnings found
[INFO] 
[INFO] --- maven-checkstyle-plugin:2.13:check (verify-style) @ tamaya-core ---
[INFO] 
[INFO] There are 13 checkstyle errors.
[ERROR] IntegerConverter.java[64:17] (blocks) RightCurly: '}' should be on the same line.
[ERROR] ShortConverter.java[62:17] (blocks) RightCurly: '}' should be on the same line.
[ERROR] ByteConverter.java[54:17] (blocks) RightCurly: '}' should be on the same line.
[ERROR] URLConverter.java[40:9] (blocks) RightCurly: '}' should be on the same line.
[ERROR] URiConverter.java[24:8] (imports) UnusedImports: Unused import - java.net.URL.
[ERROR] URiConverter.java[41:9] (blocks) RightCurly: '}' should be on the same line.
[ERROR] ClassConverter.java[23:8] (imports) UnusedImports: Unused import - java.util.Locale.
[ERROR] ClassConverter.java[44:9] (blocks) RightCurly: '}' should be on the same line.
[ERROR] ClassConverter.java[50:9] (blocks) RightCurly: '}' should be on the same line.
[ERROR] ClassConverter.java[56:9] (blocks) RightCurly: '}' should be on the same line.
[ERROR] FloatConverter.java[25:8] (imports) UnusedImports: Unused import - java.util.logging.Level.
[ERROR] NumberConverter.java[62:17] (blocks) RightCurly: '}' should be on the same line.
[ERROR] ZoneIdConverter.java[40:9] (blocks) RightCurly: '}' should be on the same line.
[INFO] ------------------------------------------------------------------------
[INFO] Reactor Summary:
[INFO] 
[INFO] Apache Tamaya ..................................... SUCCESS [ 23.972 s]
[INFO] Apache Tamaya Build Configuration ................. SUCCESS [  4.722 s]
[INFO] Apache Tamaya Java 7 Parent ....................... SUCCESS [  3.918 s]
[INFO] Apache Tamaya Java 7 API .......................... SUCCESS [ 16.789 s]
[INFO] Apache Tamaya Java 7 Core ......................... SUCCESS [ 20.745 s]
[INFO] Apache Tamaya Java 8 Parent ....................... SUCCESS [  6.393 s]
[INFO] Apache Tamaya Java 8 API .......................... SUCCESS [ 15.562 s]
[INFO] Apache Tamaya Java 8 Core ......................... FAILURE [ 16.384 s]
[INFO] Apache Tamaya Extension Modules ................... SKIPPED
[INFO] Apache Tamaya Builder ............................. SKIPPED
[INFO] Apache Tamaya Resource Services ................... SKIPPED
[INFO] Apache Tamaya Resolver Services ................... SKIPPED
[INFO] Apache Tamaya Injection Support ................... SKIPPED
[INFO] Apache Tamaya Format Services ..................... SKIPPED
[INFO] Apache Tamaya JSON Support ........................ SKIPPED
[INFO] ------------------------------------------------------------------------
[INFO] BUILD FAILURE
[INFO] ------------------------------------------------------------------------
[INFO] Total time: 01:58 min
[INFO] Finished at: 2015-02-12T22:40:14+00:00
[INFO] Final Memory: 62M/757M
[INFO] ------------------------------------------------------------------------
[ERROR] Failed to execute goal org.apache.maven.plugins:maven-checkstyle-plugin:2.13:check
(verify-style) on project tamaya-core: You have 13 Checkstyle violations. -> [Help 1]
[ERROR] 
[ERROR] To see the full stack trace of the errors, re-run Maven with the -e switch.
[ERROR] Re-run Maven using the -X switch to enable full debug logging.
[ERROR] 
[ERROR] For more information about the errors and possible solutions, please read the following
articles:
[ERROR] [Help 1] http://cwiki.apache.org/confluence/display/MAVEN/MojoFailureException
[ERROR] 
[ERROR] After correcting the problems, you can resume the build with the command
[ERROR]   mvn <goals> -rf :tamaya-core
[JENKINS] Archiving <https://builds.apache.org/job/Tamaya-Master-branch/ws/modules/injection/pom.xml>
to org.apache.tamaya.ext/tamaya-injection/0.1-incubating-SNAPSHOT/tamaya-injection-0.1-incubating-SNAPSHOT.pom
Sending artifact delta relative to Tamaya-Master-branch » Apache Tamaya Injection Support
#208
Archived 1 artifacts
Archive block size is 32768
Received 0 blocks and 2317 bytes
Compression is 0.0%
Took 0.21 sec
[JENKINS] Archiving <https://builds.apache.org/job/Tamaya-Master-branch/ws/java7/core/pom.xml>
to org.apache.tamaya/tamaya-java7-core/0.1-incubating-SNAPSHOT/tamaya-java7-core-0.1-incubating-SNAPSHOT.pom
[JENKINS] Archiving <https://builds.apache.org/job/Tamaya-Master-branch/ws/java7/core/target/tamaya-java7-core-0.1-incubating-SNAPSHOT.jar>
to org.apache.tamaya/tamaya-java7-core/0.1-incubating-20150212.223929-32/tamaya-java7-core-0.1-incubating-20150212.223929-32.jar
Sending artifact delta relative to Tamaya-Master-branch » Apache Tamaya Java 7 Core #208
Archived 2 artifacts
Archive block size is 32768
Received 0 blocks and 66406 bytes
Compression is 0.0%
Took 0.27 sec
[JENKINS] Archiving <https://builds.apache.org/job/Tamaya-Master-branch/ws/modules/resolver/pom.xml>
to org.apache.tamaya.ext/tamaya-resolver/0.1-incubating-SNAPSHOT/tamaya-resolver-0.1-incubating-SNAPSHOT.pom
Sending artifact delta relative to Tamaya-Master-branch » Apache Tamaya Resolver Services
#208
Archived 1 artifacts
Archive block size is 32768
Received 0 blocks and 2311 bytes
Compression is 0.0%
Took 0.19 sec
[JENKINS] Archiving <https://builds.apache.org/job/Tamaya-Master-branch/ws/modules/json/pom.xml>
to org.apache.tamaya.ext/tamaya-json/0.1-incubating-SNAPSHOT/tamaya-json-0.1-incubating-SNAPSHOT.pom
Sending artifact delta relative to Tamaya-Master-branch » Apache Tamaya JSON Support #208
Archived 1 artifacts
Archive block size is 32768
Received 0 blocks and 5178 bytes
Compression is 0.0%
Took 73 ms
[JENKINS] Archiving <https://builds.apache.org/job/Tamaya-Master-branch/ws/java8/pom.xml>
to org.apache.tamaya/tamaya-java8/0.1-incubating-SNAPSHOT/tamaya-java8-0.1-incubating-SNAPSHOT.pom
Sending artifact delta relative to Tamaya-Master-branch » Apache Tamaya Java 8 Parent #208
Archived 1 artifacts
Archive block size is 32768
Received 0 blocks and 3741 bytes
Compression is 0.0%
Took 74 ms
[JENKINS] Archiving <https://builds.apache.org/job/Tamaya-Master-branch/ws/modules/formats/pom.xml>
to org.apache.tamaya.ext/tamaya-formats/0.1-incubating-SNAPSHOT/tamaya-formats-0.1-incubating-SNAPSHOT.pom
Sending artifact delta relative to Tamaya-Master-branch » Apache Tamaya Format Services #208
Archived 1 artifacts
Archive block size is 32768
Received 0 blocks and 2113 bytes
Compression is 0.0%
Took 71 ms
[JENKINS] Archiving <https://builds.apache.org/job/Tamaya-Master-branch/ws/java8/core/pom.xml>
to org.apache.tamaya/tamaya-core/0.1-incubating-SNAPSHOT/tamaya-core-0.1-incubating-SNAPSHOT.pom
Sending artifact delta relative to Tamaya-Master-branch » Apache Tamaya Java 8 Core #208
Archived 1 artifacts
Archive block size is 32768
Received 0 blocks and 4996 bytes
Compression is 0.0%
Took 99 ms
[JENKINS] Archiving <https://builds.apache.org/job/Tamaya-Master-branch/ws/java7/pom.xml>
to org.apache.tamaya/tamaya-java7/0.1-incubating-SNAPSHOT/tamaya-java7-0.1-incubating-SNAPSHOT.pom
Sending artifact delta relative to Tamaya-Master-branch » Apache Tamaya Java 7 Parent #208
Archived 1 artifacts
Archive block size is 32768
Received 0 blocks and 4284 bytes
Compression is 0.0%
Took 88 ms
[JENKINS] Archiving <https://builds.apache.org/job/Tamaya-Master-branch/ws/pom.xml>
to org.apache.tamaya/tamaya-all/0.1-incubating-SNAPSHOT/tamaya-all-0.1-incubating-SNAPSHOT.pom
Sending artifact delta relative to Tamaya-Master-branch » Apache Tamaya #208
Archived 1 artifacts
Archive block size is 32768
Received 0 blocks and 28938 bytes
Compression is 0.0%
Took 0.1 sec
[JENKINS] Archiving <https://builds.apache.org/job/Tamaya-Master-branch/ws/modules/builder/pom.xml>
to org.apache.tamaya.ext/tamaya-builder/0.1-incubating-SNAPSHOT/tamaya-builder-0.1-incubating-SNAPSHOT.pom
Sending artifact delta relative to Tamaya-Master-branch » Apache Tamaya Builder #208
Archived 1 artifacts
Archive block size is 32768
Received 0 blocks and 2473 bytes
Compression is 0.0%
Took 98 ms
[JENKINS] Archiving <https://builds.apache.org/job/Tamaya-Master-branch/ws/modules/pom.xml>
to org.apache.tamaya.ext/tamaya-extensions/0.1-incubating-SNAPSHOT/tamaya-extensions-0.1-incubating-SNAPSHOT.pom
Sending artifact delta relative to Tamaya-Master-branch » Apache Tamaya Extension Modules
#208
Archived 1 artifacts
Archive block size is 32768
Received 0 blocks and 4144 bytes
Compression is 0.0%
Took 81 ms
[JENKINS] Archiving <https://builds.apache.org/job/Tamaya-Master-branch/ws/java8/api/pom.xml>
to org.apache.tamaya/tamaya-api/0.1-incubating-SNAPSHOT/tamaya-api-0.1-incubating-SNAPSHOT.pom
[JENKINS] Archiving <https://builds.apache.org/job/Tamaya-Master-branch/ws/java8/api/target/tamaya-api-0.1-incubating-SNAPSHOT.jar>
to org.apache.tamaya/tamaya-api/0.1-incubating-20150212.223952-75/tamaya-api-0.1-incubating-20150212.223952-75.jar
Sending artifact delta relative to Tamaya-Master-branch » Apache Tamaya Java 8 API #208
Archived 2 artifacts
Archive block size is 32768
Received 0 blocks and 18999 bytes
Compression is 0.0%
Took 0.15 sec
[JENKINS] Archiving <https://builds.apache.org/job/Tamaya-Master-branch/ws/modules/resources/pom.xml>
to org.apache.tamaya.ext/tamaya-resources/0.1-incubating-SNAPSHOT/tamaya-resources-0.1-incubating-SNAPSHOT.pom
Sending artifact delta relative to Tamaya-Master-branch » Apache Tamaya Resource Services
#208
Archived 1 artifacts
Archive block size is 32768
Received 0 blocks and 1853 bytes
Compression is 0.0%
Took 0.2 sec
[JENKINS] Archiving <https://builds.apache.org/job/Tamaya-Master-branch/ws/java7/api/pom.xml>
to org.apache.tamaya/tamaya-java7-api/0.1-incubating-SNAPSHOT/tamaya-java7-api-0.1-incubating-SNAPSHOT.pom
[JENKINS] Archiving <https://builds.apache.org/job/Tamaya-Master-branch/ws/java7/api/target/tamaya-java7-api-0.1-incubating-SNAPSHOT.jar>
to org.apache.tamaya/tamaya-java7-api/0.1-incubating-20150212.223907-79/tamaya-java7-api-0.1-incubating-20150212.223907-79.jar
Sending artifact delta relative to Tamaya-Master-branch » Apache Tamaya Java 7 API #208
Archived 2 artifacts
Archive block size is 32768
Received 0 blocks and 17608 bytes
Compression is 0.0%
Took 0.22 sec
[JENKINS] Archiving <https://builds.apache.org/job/Tamaya-Master-branch/ws/buildconfigurations/pom.xml>
to org.apache.tamaya/buildconfigurations/0.1-incubating-SNAPSHOT/buildconfigurations-0.1-incubating-SNAPSHOT.pom
[JENKINS] Archiving <https://builds.apache.org/job/Tamaya-Master-branch/ws/buildconfigurations/target/buildconfigurations-0.1-incubating-SNAPSHOT.jar>
to org.apache.tamaya/buildconfigurations/0.1-incubating-20150212.223845-61/buildconfigurations-0.1-incubating-20150212.223845-61.jar
Sending artifact delta relative to Tamaya-Master-branch » Apache Tamaya Build Configuration
#208
Archived 2 artifacts
Archive block size is 32768
Received 0 blocks and 10729 bytes
Compression is 0.0%
Took 0.18 sec
channel stopped

Mime
View raw message