tamaya-commits mailing list archives

Site index · List index
Message view « Date » · « Thread »
Top « Date » · « Thread »
From Apache Jenkins Server <jenk...@builds.apache.org>
Subject Build failed in Jenkins: Tamaya-Master-branch #219
Date Sat, 28 Feb 2015 20:58:38 GMT
See <https://builds.apache.org/job/Tamaya-Master-branch/219/changes>

Changes:

[anatole] Updated/added documentation for API and core.

------------------------------------------
[...truncated 595 lines...]
[INFO] 
[INFO] --- maven-compiler-plugin:3.1:testCompile (default-testCompile) @ tamaya-java7-api
---
[INFO] Nothing to compile - all classes are up to date
[INFO] 
[INFO] --- maven-surefire-plugin:2.17:test (default-test) @ tamaya-java7-api ---
[INFO] Skipping execution of surefire because it has already been run for this configuration
[JENKINS] Recording test results
[INFO] 
[INFO] --- maven-jar-plugin:2.5:jar (default-jar) @ tamaya-java7-api ---
[INFO] 
[INFO] --- maven-site-plugin:3.3:attach-descriptor (attach-descriptor) @ tamaya-java7-api
---
[INFO] 
[INFO] --- maven-javadoc-plugin:2.9.1:jar (attach-javadocs) @ tamaya-java7-api ---
[INFO] Skipping javadoc generation
[INFO] 
[INFO] --- maven-failsafe-plugin:2.17:integration-test (default) @ tamaya-java7-api ---
[INFO] Skipping execution of surefire because it has already been run for this configuration
[JENKINS] Recording test results[INFO] 
[INFO] --- maven-failsafe-plugin:2.17:verify (default) @ tamaya-java7-api ---

[INFO] Failsafe report directory: <https://builds.apache.org/job/Tamaya-Master-branch/ws/java7/api/target/failsafe-reports>
[JENKINS] Recording test results[INFO] 
[INFO] --- maven-install-plugin:2.5.2:install (default-install) @ tamaya-java7-api ---
[INFO] Installing <https://builds.apache.org/job/Tamaya-Master-branch/ws/java7/api/target/tamaya-java7-api-0.1-incubating-SNAPSHOT.jar>
to /home/jenkins/jenkins-slave/maven-repositories/1/org/apache/tamaya/tamaya-java7-api/0.1-incubating-SNAPSHOT/tamaya-java7-api-0.1-incubating-SNAPSHOT.jar
[INFO] Installing <https://builds.apache.org/job/Tamaya-Master-branch/ws/java7/api/pom.xml>
to /home/jenkins/jenkins-slave/maven-repositories/1/org/apache/tamaya/tamaya-java7-api/0.1-incubating-SNAPSHOT/tamaya-java7-api-0.1-incubating-SNAPSHOT.pom

[INFO] 
[INFO] --- maven-deploy-plugin:2.8.2:deploy (default-deploy) @ tamaya-java7-api ---
[INFO] Downloading: https://repository.apache.org/content/repositories/snapshots/org/apache/tamaya/tamaya-java7-api/0.1-incubating-SNAPSHOT/maven-metadata.xml
[INFO] Downloaded: https://repository.apache.org/content/repositories/snapshots/org/apache/tamaya/tamaya-java7-api/0.1-incubating-SNAPSHOT/maven-metadata.xml
(813 B at 0.9 KB/sec)
[INFO] Uploading: https://repository.apache.org/content/repositories/snapshots/org/apache/tamaya/tamaya-java7-api/0.1-incubating-SNAPSHOT/tamaya-java7-api-0.1-incubating-20150228.205828-88.jar
[INFO] Uploaded: https://repository.apache.org/content/repositories/snapshots/org/apache/tamaya/tamaya-java7-api/0.1-incubating-SNAPSHOT/tamaya-java7-api-0.1-incubating-20150228.205828-88.jar
(17 KB at 5.3 KB/sec)
[INFO] Uploading: https://repository.apache.org/content/repositories/snapshots/org/apache/tamaya/tamaya-java7-api/0.1-incubating-SNAPSHOT/tamaya-java7-api-0.1-incubating-20150228.205828-88.pom
[INFO] Uploaded: https://repository.apache.org/content/repositories/snapshots/org/apache/tamaya/tamaya-java7-api/0.1-incubating-SNAPSHOT/tamaya-java7-api-0.1-incubating-20150228.205828-88.pom
(2 KB at 21.9 KB/sec)
[INFO] Downloading: https://repository.apache.org/content/repositories/snapshots/org/apache/tamaya/tamaya-java7-api/maven-metadata.xml
[INFO] Downloaded: https://repository.apache.org/content/repositories/snapshots/org/apache/tamaya/tamaya-java7-api/maven-metadata.xml
(302 B at 1.5 KB/sec)
[INFO] Uploading: https://repository.apache.org/content/repositories/snapshots/org/apache/tamaya/tamaya-java7-api/0.1-incubating-SNAPSHOT/maven-metadata.xml
[INFO] Uploaded: https://repository.apache.org/content/repositories/snapshots/org/apache/tamaya/tamaya-java7-api/0.1-incubating-SNAPSHOT/maven-metadata.xml
(813 B at 6.7 KB/sec)
[INFO] Uploading: https://repository.apache.org/content/repositories/snapshots/org/apache/tamaya/tamaya-java7-api/maven-metadata.xml
[INFO] Uploaded: https://repository.apache.org/content/repositories/snapshots/org/apache/tamaya/tamaya-java7-api/maven-metadata.xml
(302 B at 3.8 KB/sec)
[INFO]                                                                         
[INFO] ------------------------------------------------------------------------
[INFO] Building Apache Tamaya Java 7 Core 0.1-incubating-SNAPSHOT
[INFO] ------------------------------------------------------------------------
[INFO] 
[INFO] --- maven-clean-plugin:2.5:clean (default-clean) @ tamaya-java7-core ---
[INFO] Deleting <https://builds.apache.org/job/Tamaya-Master-branch/ws/java7/core/target>
[INFO] 
[INFO] --- maven-enforcer-plugin:1.4:enforce (enforce-versions) @ tamaya-java7-core ---
[INFO] 
[INFO] --- apache-rat-plugin:0.11:check (default) @ tamaya-java7-core ---
[INFO] 51 implicit excludes (use -debug for more details).
[INFO] Exclude: **/*/MANIFEST.MF
[INFO] Exclude: .git
[INFO] Exclude: .gitignore
[INFO] Exclude: derby.log
[INFO] Exclude: **/META-INF/services/*
[INFO] Exclude: **/bootstrap-*
[INFO] Exclude: **/js/jquery-*
[INFO] Exclude: **/*.json
[INFO] 60 resources included (use -debug for more details)
Warning:  org.apache.xerces.jaxp.SAXParserImpl$JAXPSAXParser: Property 'http://www.oracle.com/xml/jaxp/properties/entityExpansionLimit'
is not recognized.
Compiler warnings:
  WARNING:  'org.apache.xerces.jaxp.SAXParserImpl: Property 'http://javax.xml.XMLConstants/property/accessExternalDTD'
is not recognized.'
Warning:  org.apache.xerces.parsers.SAXParser: Feature 'http://javax.xml.XMLConstants/feature/secure-processing'
is not recognized.
Warning:  org.apache.xerces.parsers.SAXParser: Property 'http://javax.xml.XMLConstants/property/accessExternalDTD'
is not recognized.
Warning:  org.apache.xerces.parsers.SAXParser: Property 'http://www.oracle.com/xml/jaxp/properties/entityExpansionLimit'
is not recognized.
[INFO] Rat check: Summary of files. Unapproved: 0 unknown: 0 generated: 0 approved: 60 licence.
[INFO] 
[INFO] --- maven-remote-resources-plugin:1.5:process (default) @ tamaya-java7-core ---
[INFO] 
[INFO] --- maven-resources-plugin:2.6:resources (default-resources) @ tamaya-java7-core ---
[INFO] Using 'UTF-8' encoding to copy filtered resources.
[INFO] Copying 5 resources
[INFO] Copying 3 resources
[INFO] 
[INFO] --- maven-compiler-plugin:3.1:compile (default-compile) @ tamaya-java7-core ---
[INFO] Changes detected - recompiling the module!
[INFO] Compiling 31 source files to <https://builds.apache.org/job/Tamaya-Master-branch/ws/java7/core/target/classes>
[INFO] -------------------------------------------------------------
[WARNING] COMPILATION WARNING : 
[INFO] -------------------------------------------------------------
[WARNING] bootstrap class path not set in conjunction with -source 1.7
[WARNING] <https://builds.apache.org/job/Tamaya-Master-branch/ws/java7/core/src/main/java/org/apache/tamaya/core/internal/converters/EnumConverter.java>:
Some input files use unchecked or unsafe operations.
[WARNING] <https://builds.apache.org/job/Tamaya-Master-branch/ws/java7/core/src/main/java/org/apache/tamaya/core/internal/converters/EnumConverter.java>:
Recompile with -Xlint:unchecked for details.
[INFO] 3 warnings 
[INFO] -------------------------------------------------------------
[INFO] -------------------------------------------------------------
[ERROR] COMPILATION ERROR : 
[INFO] -------------------------------------------------------------
[ERROR] <https://builds.apache.org/job/Tamaya-Master-branch/ws/java7/core/src/main/java/org/apache/tamaya/core/internal/DefaultConfiguration.java>:[224,19]
incompatible types: java.lang.Object cannot be converted to T
[INFO] 1 error
[INFO] -------------------------------------------------------------
[INFO] ------------------------------------------------------------------------
[INFO] Reactor Summary:
[INFO] 
[INFO] Apache Tamaya ..................................... SUCCESS [ 11.709 s]
[INFO] Apache Tamaya Build Configuration ................. SUCCESS [ 15.533 s]
[INFO] Apache Tamaya Java 7 Parent ....................... SUCCESS [  3.032 s]
[INFO] Apache Tamaya Java 7 API .......................... SUCCESS [ 15.457 s]
[INFO] Apache Tamaya Java 7 Core ......................... FAILURE [  1.251 s]
[INFO] Apache Tamaya Java 8 Parent ....................... SKIPPED
[INFO] Apache Tamaya Java 8 API .......................... SKIPPED
[INFO] Apache Tamaya Java 8 Core ......................... SKIPPED
[INFO] Apache Tamaya Extension Modules ................... SKIPPED
[INFO] Apache Tamaya Builder ............................. SKIPPED
[INFO] Apache Tamaya API Extensions ...................... SKIPPED
[INFO] Apache Tamaya Resource Services ................... SKIPPED
[INFO] Apache Tamaya Resolver Services ................... SKIPPED
[INFO] Apache Tamaya Injection Support ................... SKIPPED
[INFO] Apache Tamaya Format Services ..................... SKIPPED
[INFO] Apache Tamaya JSON Support ........................ SKIPPED
[INFO] Apache Tamaya Event and dynamic Update Extensions . SKIPPED
[INFO] ------------------------------------------------------------------------
[INFO] BUILD FAILURE
[INFO] ------------------------------------------------------------------------
[INFO] Total time: 50.567 s
[INFO] Finished at: 2015-02-28T20:58:35+00:00
[INFO] Final Memory: 50M/498M
[INFO] ------------------------------------------------------------------------
[ERROR] Failed to execute goal org.apache.maven.plugins:maven-compiler-plugin:3.1:compile
(default-compile) on project tamaya-java7-core: Compilation failure
[ERROR] <https://builds.apache.org/job/Tamaya-Master-branch/ws/java7/core/src/main/java/org/apache/tamaya/core/internal/DefaultConfiguration.java>:[224,19]
incompatible types: java.lang.Object cannot be converted to T
[ERROR] -> [Help 1]
[ERROR] 
[ERROR] To see the full stack trace of the errors, re-run Maven with the -e switch.
[ERROR] Re-run Maven using the -X switch to enable full debug logging.
[ERROR] 
[ERROR] For more information about the errors and possible solutions, please read the following
articles:
[ERROR] [Help 1] http://cwiki.apache.org/confluence/display/MAVEN/MojoFailureException
[ERROR] 
[ERROR] After correcting the problems, you can resume the build with the command
[ERROR]   mvn <goals> -rf :tamaya-java7-core
[JENKINS] Archiving <https://builds.apache.org/job/Tamaya-Master-branch/ws/java7/core/pom.xml>
to org.apache.tamaya/tamaya-java7-core/0.1-incubating-SNAPSHOT/tamaya-java7-core-0.1-incubating-SNAPSHOT.pom
Sending artifact delta relative to Tamaya-Master-branch ? Apache Tamaya Java 7 Core #215
Archived 1 artifacts
Archive block size is 32768
Received 0 blocks and 2102 bytes
Compression is 0.0%
Took 0.17 sec
[JENKINS] Archiving <https://builds.apache.org/job/Tamaya-Master-branch/ws/modules/injection/pom.xml>
to org.apache.tamaya.ext/tamaya-injection/0.1-incubating-SNAPSHOT/tamaya-injection-0.1-incubating-SNAPSHOT.pom
Sending artifact delta relative to Tamaya-Master-branch ? Apache Tamaya Injection Support
#215
Archived 1 artifacts
Archive block size is 32768
Received 0 blocks and 2317 bytes
Compression is 0.0%
Took 0.12 sec
[JENKINS] Archiving <https://builds.apache.org/job/Tamaya-Master-branch/ws/modules/json/pom.xml>
to org.apache.tamaya.ext/tamaya-json/0.1-incubating-SNAPSHOT/tamaya-json-0.1-incubating-SNAPSHOT.pom
Sending artifact delta relative to Tamaya-Master-branch ? Apache Tamaya JSON Support #215
Archived 1 artifacts
Archive block size is 32768
Received 0 blocks and 5377 bytes
Compression is 0.0%
Took 0.16 sec
[JENKINS] Archiving <https://builds.apache.org/job/Tamaya-Master-branch/ws/modules/events/pom.xml>
to org.apache.tamaya.ext/tamaya-events/0.1-incubating-SNAPSHOT/tamaya-events-0.1-incubating-SNAPSHOT.pom
No prior successful build to compare, so performing full copy of artifacts
[JENKINS] Archiving <https://builds.apache.org/job/Tamaya-Master-branch/ws/modules/formats/pom.xml>
to org.apache.tamaya.ext/tamaya-formats/0.1-incubating-SNAPSHOT/tamaya-formats-0.1-incubating-SNAPSHOT.pom
Sending artifact delta relative to Tamaya-Master-branch ? Apache Tamaya Format Services #215
Archived 1 artifacts
Archive block size is 32768
Received 0 blocks and 2335 bytes
Compression is 0.0%
Took 53 ms
[JENKINS] Archiving <https://builds.apache.org/job/Tamaya-Master-branch/ws/java8/api/pom.xml>
to org.apache.tamaya/tamaya-api/0.1-incubating-SNAPSHOT/tamaya-api-0.1-incubating-SNAPSHOT.pom
Sending artifact delta relative to Tamaya-Master-branch ? Apache Tamaya Java 8 API #215
Archived 1 artifacts
Archive block size is 32768
Received 0 blocks and 1755 bytes
Compression is 0.0%
Took 25 ms
[JENKINS] Archiving <https://builds.apache.org/job/Tamaya-Master-branch/ws/modules/pom.xml>
to org.apache.tamaya.ext/tamaya-extensions/0.1-incubating-SNAPSHOT/tamaya-extensions-0.1-incubating-SNAPSHOT.pom
Sending artifact delta relative to Tamaya-Master-branch ? Apache Tamaya Extension Modules
#215
Archived 1 artifacts
Archive block size is 32768
Received 0 blocks and 4215 bytes
Compression is 0.0%
Took 15 ms
[JENKINS] Archiving <https://builds.apache.org/job/Tamaya-Master-branch/ws/buildconfigurations/pom.xml>
to org.apache.tamaya/buildconfigurations/0.1-incubating-SNAPSHOT/buildconfigurations-0.1-incubating-SNAPSHOT.pom
[JENKINS] Archiving <https://builds.apache.org/job/Tamaya-Master-branch/ws/buildconfigurations/target/buildconfigurations-0.1-incubating-SNAPSHOT.jar>
to org.apache.tamaya/buildconfigurations/0.1-incubating-20150228.205800-71/buildconfigurations-0.1-incubating-20150228.205800-71.jar
Sending artifact delta relative to Tamaya-Master-branch ? Apache Tamaya Build Configuration
#218
Archived 2 artifacts
Archive block size is 32768
Received 0 blocks and 10729 bytes
Compression is 0.0%
Took 96 ms
[JENKINS] Archiving <https://builds.apache.org/job/Tamaya-Master-branch/ws/modules/resolver/pom.xml>
to org.apache.tamaya.ext/tamaya-resolver/0.1-incubating-SNAPSHOT/tamaya-resolver-0.1-incubating-SNAPSHOT.pom
Sending artifact delta relative to Tamaya-Master-branch ? Apache Tamaya Resolver Services
#215
Archived 1 artifacts
Archive block size is 32768
Received 0 blocks and 2311 bytes
Compression is 0.0%
Took 17 ms
[JENKINS] Archiving <https://builds.apache.org/job/Tamaya-Master-branch/ws/java8/pom.xml>
to org.apache.tamaya/tamaya-java8/0.1-incubating-SNAPSHOT/tamaya-java8-0.1-incubating-SNAPSHOT.pom
Sending artifact delta relative to Tamaya-Master-branch ? Apache Tamaya Java 8 Parent #215
Archived 1 artifacts
Archive block size is 32768
Received 0 blocks and 3741 bytes
Compression is 0.0%
Took 9 ms
[JENKINS] Archiving <https://builds.apache.org/job/Tamaya-Master-branch/ws/pom.xml>
to org.apache.tamaya/tamaya-all/0.1-incubating-SNAPSHOT/tamaya-all-0.1-incubating-SNAPSHOT.pom
Sending artifact delta relative to Tamaya-Master-branch ? Apache Tamaya #218
Archived 1 artifacts
Archive block size is 32768
Received 0 blocks and 28937 bytes
Compression is 0.0%
Took 27 ms
[JENKINS] Archiving <https://builds.apache.org/job/Tamaya-Master-branch/ws/java7/pom.xml>
to org.apache.tamaya/tamaya-java7/0.1-incubating-SNAPSHOT/tamaya-java7-0.1-incubating-SNAPSHOT.pom
Sending artifact delta relative to Tamaya-Master-branch ? Apache Tamaya Java 7 Parent #218
Archived 1 artifacts
Archive block size is 32768
Received 0 blocks and 4284 bytes
Compression is 0.0%
Took 11 ms
[JENKINS] Archiving <https://builds.apache.org/job/Tamaya-Master-branch/ws/java8/core/pom.xml>
to org.apache.tamaya/tamaya-core/0.1-incubating-SNAPSHOT/tamaya-core-0.1-incubating-SNAPSHOT.pom
Sending artifact delta relative to Tamaya-Master-branch ? Apache Tamaya Java 8 Core #215
Archived 1 artifacts
Archive block size is 32768
Received 0 blocks and 4996 bytes
Compression is 0.0%
Took 34 ms
[JENKINS] Archiving <https://builds.apache.org/job/Tamaya-Master-branch/ws/modules/builder/pom.xml>
to org.apache.tamaya.ext/tamaya-builder/0.1-incubating-SNAPSHOT/tamaya-builder-0.1-incubating-SNAPSHOT.pom
Sending artifact delta relative to Tamaya-Master-branch ? Apache Tamaya Builder #215
Archived 1 artifacts
Archive block size is 32768
Received 0 blocks and 2473 bytes
Compression is 0.0%
Took 22 ms
[JENKINS] Archiving <https://builds.apache.org/job/Tamaya-Master-branch/ws/modules/apiextensions/pom.xml>
to org.apache.tamaya.ext/tamaya-apiextensions/0.1-incubating-SNAPSHOT/tamaya-apiextensions-0.1-incubating-SNAPSHOT.pom
Sending artifact delta relative to Tamaya-Master-branch ? Apache Tamaya API Extensions #215
Archived 1 artifacts
Archive block size is 32768
Received 0 blocks and 1721 bytes
Compression is 0.0%
Took 23 ms
[JENKINS] Archiving <https://builds.apache.org/job/Tamaya-Master-branch/ws/modules/resources/pom.xml>
to org.apache.tamaya.ext/tamaya-resources/0.1-incubating-SNAPSHOT/tamaya-resources-0.1-incubating-SNAPSHOT.pom
Sending artifact delta relative to Tamaya-Master-branch ? Apache Tamaya Resource Services
#215
Archived 1 artifacts
Archive block size is 32768
Received 0 blocks and 1853 bytes
Compression is 0.0%
Took 17 ms
[JENKINS] Archiving <https://builds.apache.org/job/Tamaya-Master-branch/ws/java7/api/pom.xml>
to org.apache.tamaya/tamaya-java7-api/0.1-incubating-SNAPSHOT/tamaya-java7-api-0.1-incubating-SNAPSHOT.pom
[JENKINS] Archiving <https://builds.apache.org/job/Tamaya-Master-branch/ws/java7/api/target/tamaya-java7-api-0.1-incubating-SNAPSHOT.jar>
to org.apache.tamaya/tamaya-java7-api/0.1-incubating-20150228.205828-88/tamaya-java7-api-0.1-incubating-20150228.205828-88.jar
Sending artifact delta relative to Tamaya-Master-branch ? Apache Tamaya Java 7 API #218
Archived 2 artifacts
Archive block size is 32768
Received 0 blocks and 18700 bytes
Compression is 0.0%
Took 37 ms
channel stopped

Mime
View raw message