tamaya-commits mailing list archives

Site index · List index
Message view « Date » · « Thread »
Top « Date » · « Thread »
From Apache Jenkins Server <jenk...@builds.apache.org>
Subject Build failed in Jenkins: Tamaya-Master-branch #147
Date Tue, 13 Jan 2015 08:13:36 GMT
See <https://builds.apache.org/job/Tamaya-Master-branch/147/changes>

Changes:

[anatole] TAMAYA-49: Added ConfigQuery, ConfigOperator as interfaces to Java 7 and 8. Fixed
some typos.

[anatole] TAMAYA-49: Fixed some typos.

------------------------------------------
[...truncated 191 lines...]
[INFO] --- maven-install-plugin:2.5.2:install (default-install) @ tamaya-java7 ---
[INFO] Installing <https://builds.apache.org/job/Tamaya-Master-branch/ws/java7/pom.xml>
to /home/jenkins/jenkins-slave/maven-repositories/1/org/apache/tamaya/tamaya-java7/0.1-incubating-SNAPSHOT/tamaya-java7-0.1-incubating-SNAPSHOT.pom
[INFO] 
[INFO] --- maven-enforcer-plugin:1.3.1:enforce (enforce-versions) @ tamaya-java7 ---
[INFO] 
[INFO] --- apache-rat-plugin:0.11:check (default) @ tamaya-java7 ---
[INFO] 52 implicit excludes (use -debug for more details).
[INFO] Exclude: **/*/MANIFEST.MF
[INFO] Exclude: .git
[INFO] Exclude: .gitignore
[INFO] Exclude: derby.log
[INFO] Exclude: **/META-INF/services/*
[INFO] Exclude: **/bootstrap-*
[INFO] Exclude: **/js/jquery-*
[INFO] Exclude: **/*.json
[INFO] 1 resources included (use -debug for more details)
Warning:  org.apache.xerces.jaxp.SAXParserImpl$JAXPSAXParser: Property 'http://www.oracle.com/xml/jaxp/properties/entityExpansionLimit'
is not recognized.
Compiler warnings:
  WARNING:  'org.apache.xerces.jaxp.SAXParserImpl: Property 'http://javax.xml.XMLConstants/property/accessExternalDTD'
is not recognized.'
Warning:  org.apache.xerces.parsers.SAXParser: Feature 'http://javax.xml.XMLConstants/feature/secure-processing'
is not recognized.
Warning:  org.apache.xerces.parsers.SAXParser: Property 'http://javax.xml.XMLConstants/property/accessExternalDTD'
is not recognized.
Warning:  org.apache.xerces.parsers.SAXParser: Property 'http://www.oracle.com/xml/jaxp/properties/entityExpansionLimit'
is not recognized.
[INFO] Rat check: Summary of files. Unapproved: 0 unknown: 0 generated: 0 approved: 1 licence.
[INFO] 
[INFO] --- maven-remote-resources-plugin:1.5:process (default) @ tamaya-java7 ---
[INFO] 
[INFO] >>> findbugs-maven-plugin:3.0.0:check (findbugs-analyze) @ tamaya-java7 >>>
[INFO] 
[INFO] --- findbugs-maven-plugin:3.0.0:findbugs (findbugs) @ tamaya-java7 ---
[INFO] 
[INFO] <<< findbugs-maven-plugin:3.0.0:check (findbugs-analyze) @ tamaya-java7 <<<
[INFO] 
[INFO] --- findbugs-maven-plugin:3.0.0:check (findbugs-analyze) @ tamaya-java7 ---
[INFO] 
[INFO] --- maven-checkstyle-plugin:2.13:check (verify-style) @ tamaya-java7 ---
[INFO] 
[INFO] 
[INFO] --- maven-site-plugin:3.3:attach-descriptor (attach-descriptor) @ tamaya-java7 ---
[INFO] 
[INFO] --- maven-javadoc-plugin:2.9.1:jar (attach-javadocs) @ tamaya-java7 ---
[INFO] Skipping javadoc generation
[INFO] 
[INFO] --- maven-install-plugin:2.5.2:install (default-install) @ tamaya-java7 ---
[INFO] Installing <https://builds.apache.org/job/Tamaya-Master-branch/ws/java7/pom.xml>
to /home/jenkins/jenkins-slave/maven-repositories/1/org/apache/tamaya/tamaya-java7/0.1-incubating-SNAPSHOT/tamaya-java7-0.1-incubating-SNAPSHOT.pom
[INFO] 
[INFO] --- maven-deploy-plugin:2.8.2:deploy (default-deploy) @ tamaya-java7 ---
[INFO] Downloading: https://repository.apache.org/content/repositories/snapshots/org/apache/tamaya/tamaya-java7/0.1-incubating-SNAPSHOT/maven-metadata.xml
[INFO] Downloaded: https://repository.apache.org/content/repositories/snapshots/org/apache/tamaya/tamaya-java7/0.1-incubating-SNAPSHOT/maven-metadata.xml
(626 B at 0.7 KB/sec)
[INFO] Uploading: https://repository.apache.org/content/repositories/snapshots/org/apache/tamaya/tamaya-java7/0.1-incubating-SNAPSHOT/tamaya-java7-0.1-incubating-20150113.081322-21.pom
[INFO] Uploaded: https://repository.apache.org/content/repositories/snapshots/org/apache/tamaya/tamaya-java7/0.1-incubating-SNAPSHOT/tamaya-java7-0.1-incubating-20150113.081322-21.pom
(3 KB at 8.0 KB/sec)
[INFO] Downloading: https://repository.apache.org/content/repositories/snapshots/org/apache/tamaya/tamaya-java7/maven-metadata.xml
[INFO] Downloaded: https://repository.apache.org/content/repositories/snapshots/org/apache/tamaya/tamaya-java7/maven-metadata.xml
(298 B at 1.1 KB/sec)
[INFO] Uploading: https://repository.apache.org/content/repositories/snapshots/org/apache/tamaya/tamaya-java7/0.1-incubating-SNAPSHOT/maven-metadata.xml
[INFO] Uploaded: https://repository.apache.org/content/repositories/snapshots/org/apache/tamaya/tamaya-java7/0.1-incubating-SNAPSHOT/maven-metadata.xml
(626 B at 0.9 KB/sec)
[INFO] Uploading: https://repository.apache.org/content/repositories/snapshots/org/apache/tamaya/tamaya-java7/maven-metadata.xml
[INFO] Uploaded: https://repository.apache.org/content/repositories/snapshots/org/apache/tamaya/tamaya-java7/maven-metadata.xml
(298 B at 0.5 KB/sec)
[INFO]                                                                         
[INFO] ------------------------------------------------------------------------
[INFO] Building Apache Tamaya Java 7 API 0.1-incubating-SNAPSHOT
[INFO] ------------------------------------------------------------------------
[INFO] 
[INFO] --- maven-clean-plugin:2.5:clean (default-clean) @ tamaya-java7-api ---
[INFO] Deleting <https://builds.apache.org/job/Tamaya-Master-branch/ws/java7/api/target>
[INFO] 
[INFO] --- maven-enforcer-plugin:1.3.1:enforce (enforce-versions) @ tamaya-java7-api ---
[INFO] 
[INFO] --- apache-rat-plugin:0.11:check (default) @ tamaya-java7-api ---
[INFO] 51 implicit excludes (use -debug for more details).
[INFO] Exclude: **/*/MANIFEST.MF
[INFO] Exclude: .git
[INFO] Exclude: .gitignore
[INFO] Exclude: derby.log
[INFO] Exclude: **/META-INF/services/*
[INFO] Exclude: **/bootstrap-*
[INFO] Exclude: **/js/jquery-*
[INFO] Exclude: **/*.json
[INFO] 17 resources included (use -debug for more details)
Warning:  org.apache.xerces.jaxp.SAXParserImpl$JAXPSAXParser: Property 'http://www.oracle.com/xml/jaxp/properties/entityExpansionLimit'
is not recognized.
Compiler warnings:
  WARNING:  'org.apache.xerces.jaxp.SAXParserImpl: Property 'http://javax.xml.XMLConstants/property/accessExternalDTD'
is not recognized.'
Warning:  org.apache.xerces.parsers.SAXParser: Feature 'http://javax.xml.XMLConstants/feature/secure-processing'
is not recognized.
Warning:  org.apache.xerces.parsers.SAXParser: Property 'http://javax.xml.XMLConstants/property/accessExternalDTD'
is not recognized.
Warning:  org.apache.xerces.parsers.SAXParser: Property 'http://www.oracle.com/xml/jaxp/properties/entityExpansionLimit'
is not recognized.
[INFO] Rat check: Summary of files. Unapproved: 0 unknown: 0 generated: 0 approved: 17 licence.
[INFO] 
[INFO] --- maven-remote-resources-plugin:1.5:process (default) @ tamaya-java7-api ---
[INFO] 
[INFO] --- maven-resources-plugin:2.6:resources (default-resources) @ tamaya-java7-api ---
[INFO] Using 'UTF-8' encoding to copy filtered resources.
[INFO] skip non existing resourceDirectory <https://builds.apache.org/job/Tamaya-Master-branch/ws/java7/api/src/main/resources>
[INFO] Copying 3 resources
[INFO] 
[INFO] --- maven-compiler-plugin:3.1:compile (default-compile) @ tamaya-java7-api ---
[INFO] Changes detected - recompiling the module!
[INFO] Compiling 12 source files to <https://builds.apache.org/job/Tamaya-Master-branch/ws/java7/api/target/classes>
[WARNING] bootstrap class path not set in conjunction with -source 1.7
[INFO] 
[INFO] >>> findbugs-maven-plugin:3.0.0:check (findbugs-analyze) @ tamaya-java7-api
>>>
[INFO] 
[INFO] --- findbugs-maven-plugin:3.0.0:findbugs (findbugs) @ tamaya-java7-api ---
[INFO] 
[INFO] <<< findbugs-maven-plugin:3.0.0:check (findbugs-analyze) @ tamaya-java7-api
<<<
[INFO] 
[INFO] --- findbugs-maven-plugin:3.0.0:check (findbugs-analyze) @ tamaya-java7-api ---
[INFO] 
[INFO] --- maven-checkstyle-plugin:2.13:check (verify-style) @ tamaya-java7-api ---
[INFO] 
[INFO] 
[INFO] --- maven-resources-plugin:2.6:testResources (default-testResources) @ tamaya-java7-api
---
[INFO] Using 'UTF-8' encoding to copy filtered resources.
[INFO] Copying 2 resources
[INFO] Copying 3 resources
[INFO] 
[INFO] --- maven-compiler-plugin:3.1:testCompile (default-testCompile) @ tamaya-java7-api
---
[INFO] Changes detected - recompiling the module!
[INFO] Compiling 4 source files to <https://builds.apache.org/job/Tamaya-Master-branch/ws/java7/api/target/test-classes>
[INFO] -------------------------------------------------------------
[WARNING] COMPILATION WARNING : 
[INFO] -------------------------------------------------------------
[WARNING] bootstrap class path not set in conjunction with -source 1.7
[WARNING] <https://builds.apache.org/job/Tamaya-Master-branch/ws/java7/api/src/test/java/org/apache/tamaya/spi/TestServiceContext.java>:
Some input files use unchecked or unsafe operations.
[WARNING] <https://builds.apache.org/job/Tamaya-Master-branch/ws/java7/api/src/test/java/org/apache/tamaya/spi/TestServiceContext.java>:
Recompile with -Xlint:unchecked for details.
[INFO] 3 warnings 
[INFO] -------------------------------------------------------------
[INFO] -------------------------------------------------------------
[ERROR] COMPILATION ERROR : 
[INFO] -------------------------------------------------------------
[ERROR] <https://builds.apache.org/job/Tamaya-Master-branch/ws/java7/api/src/test/java/org/apache/tamaya/TestConfiguration.java>:[27,8]
org.apache.tamaya.TestConfiguration is not abstract and does not override abstract method
<T>query(org.apache.tamaya.ConfigQuery<T>) in org.apache.tamaya.Configuration
[INFO] 1 error
[INFO] -------------------------------------------------------------
[INFO] ------------------------------------------------------------------------
[INFO] Reactor Summary:
[INFO] 
[INFO] Apache Tamaya ..................................... SUCCESS [ 19.595 s]
[INFO] Apache Tamaya Java 7 Parent ....................... SUCCESS [  5.314 s]
[INFO] Apache Tamaya Java 7 API .......................... FAILURE [  4.393 s]
[INFO] Apache Tamaya Java 8 Parent ....................... SKIPPED
[INFO] Apache Tamaya Java 8 API .......................... SKIPPED
[INFO] Apache Tamaya Java 8 Core ......................... SKIPPED
[INFO] Apache Tamaya Extension Modules ................... SKIPPED
[INFO] Apache Tamaya Resource Services ................... SKIPPED
[INFO] Apache Tamaya Resolver Services ................... SKIPPED
[INFO] Apache Tamaya Injection Support ................... SKIPPED
[INFO] Apache Tamaya Format Services ..................... SKIPPED
[INFO] Apache Tamaya JSON Support ........................ SKIPPED
[INFO] ------------------------------------------------------------------------
[INFO] BUILD FAILURE
[INFO] ------------------------------------------------------------------------
[INFO] Total time: 35.081 s
[INFO] Finished at: 2015-01-13T08:13:32+00:00
[INFO] Final Memory: 41M/370M
[INFO] ------------------------------------------------------------------------
[ERROR] Failed to execute goal org.apache.maven.plugins:maven-compiler-plugin:3.1:testCompile
(default-testCompile) on project tamaya-java7-api: Compilation failure
[ERROR] <https://builds.apache.org/job/Tamaya-Master-branch/ws/java7/api/src/test/java/org/apache/tamaya/TestConfiguration.java>:[27,8]
org.apache.tamaya.TestConfiguration is not abstract and does not override abstract method
<T>query(org.apache.tamaya.ConfigQuery<T>) in org.apache.tamaya.Configuration
[ERROR] -> [Help 1]
[ERROR] 
[ERROR] To see the full stack trace of the errors, re-run Maven with the -e switch.
[ERROR] Re-run Maven using the -X switch to enable full debug logging.
[ERROR] 
[ERROR] For more information about the errors and possible solutions, please read the following
articles:
[ERROR] [Help 1] http://cwiki.apache.org/confluence/display/MAVEN/MojoFailureException
[ERROR] 
[ERROR] After correcting the problems, you can resume the build with the command
[ERROR]   mvn <goals> -rf :tamaya-java7-api
[JENKINS] Archiving <https://builds.apache.org/job/Tamaya-Master-branch/ws/modules/injection/pom.xml>
to org.apache.tamaya.ext/tamaya-injection/0.1-incubating-SNAPSHOT/tamaya-injection-0.1-incubating-SNAPSHOT.pom
Sending artifact delta relative to Tamaya-Master-branch » Apache Tamaya Injection Support
#146
Archived 1 artifacts
Archive block size is 32768
Received 0 blocks and 2317 bytes
Compression is 0.0%
Took 0.13 sec
[JENKINS] Archiving <https://builds.apache.org/job/Tamaya-Master-branch/ws/modules/json/pom.xml>
to org.apache.tamaya.ext/json/0.1-incubating-SNAPSHOT/json-0.1-incubating-SNAPSHOT.pom
Sending artifact delta relative to Tamaya-Master-branch » Apache Tamaya JSON Support #146
Archived 1 artifacts
Archive block size is 32768
Received 0 blocks and 2661 bytes
Compression is 0.0%
Took 81 ms
[JENKINS] Archiving <https://builds.apache.org/job/Tamaya-Master-branch/ws/modules/resolver/pom.xml>
to org.apache.tamaya.ext/tamaya-resolver/0.1-incubating-SNAPSHOT/tamaya-resolver-0.1-incubating-SNAPSHOT.pom
Sending artifact delta relative to Tamaya-Master-branch » Apache Tamaya Resolver Services
#146
Archived 1 artifacts
Archive block size is 32768
Received 0 blocks and 2311 bytes
Compression is 0.0%
Took 87 ms
[JENKINS] Archiving <https://builds.apache.org/job/Tamaya-Master-branch/ws/java8/pom.xml>
to org.apache.tamaya/tamaya-java8/0.1-incubating-SNAPSHOT/tamaya-java8-0.1-incubating-SNAPSHOT.pom
Sending artifact delta relative to Tamaya-Master-branch » Apache Tamaya Java 8 Parent #146
Archived 1 artifacts
Archive block size is 32768
Received 0 blocks and 2401 bytes
Compression is 0.0%
Took 82 ms
[JENKINS] Archiving <https://builds.apache.org/job/Tamaya-Master-branch/ws/modules/formats/pom.xml>
to org.apache.tamaya.ext/tamaya-formats/0.1-incubating-SNAPSHOT/tamaya-formats-0.1-incubating-SNAPSHOT.pom
Sending artifact delta relative to Tamaya-Master-branch » Apache Tamaya Format Services #146
Archived 1 artifacts
Archive block size is 32768
Received 0 blocks and 2113 bytes
Compression is 0.0%
Took 0.21 sec
[JENKINS] Archiving <https://builds.apache.org/job/Tamaya-Master-branch/ws/java8/core/pom.xml>
to org.apache.tamaya/tamaya-core/0.1-incubating-SNAPSHOT/tamaya-core-0.1-incubating-SNAPSHOT.pom
Sending artifact delta relative to Tamaya-Master-branch » Apache Tamaya Java 8 Core #146
Archived 1 artifacts
Archive block size is 32768
Received 0 blocks and 2078 bytes
Compression is 0.0%
Took 88 ms
[JENKINS] Archiving <https://builds.apache.org/job/Tamaya-Master-branch/ws/java7/pom.xml>
to org.apache.tamaya/tamaya-java7/0.1-incubating-SNAPSHOT/tamaya-java7-0.1-incubating-SNAPSHOT.pom
Sending artifact delta relative to Tamaya-Master-branch » Apache Tamaya Java 7 Parent #146
Archived 1 artifacts
Archive block size is 32768
Received 0 blocks and 2711 bytes
Compression is 0.0%
Took 79 ms
[JENKINS] Archiving <https://builds.apache.org/job/Tamaya-Master-branch/ws/pom.xml>
to org.apache.tamaya/tamaya-all/0.1-incubating-SNAPSHOT/tamaya-all-0.1-incubating-SNAPSHOT.pom
Sending artifact delta relative to Tamaya-Master-branch » Apache Tamaya #146
Archived 1 artifacts
Archive block size is 32768
Received 1 blocks and 1076 bytes
Compression is 96.8%
Took 95 ms
[JENKINS] Archiving <https://builds.apache.org/job/Tamaya-Master-branch/ws/modules/pom.xml>
to org.apache.tamaya.ext/tamaya-extensions/0.1-incubating-SNAPSHOT/tamaya-extensions-0.1-incubating-SNAPSHOT.pom
Sending artifact delta relative to Tamaya-Master-branch » Apache Tamaya Extension Modules
#146
Archived 1 artifacts
Archive block size is 32768
Received 0 blocks and 2770 bytes
Compression is 0.0%
Took 98 ms
[JENKINS] Archiving <https://builds.apache.org/job/Tamaya-Master-branch/ws/java8/api/pom.xml>
to org.apache.tamaya/tamaya-api/0.1-incubating-SNAPSHOT/tamaya-api-0.1-incubating-SNAPSHOT.pom
Sending artifact delta relative to Tamaya-Master-branch » Apache Tamaya Java 8 API #146
Archived 1 artifacts
Archive block size is 32768
Received 0 blocks and 1755 bytes
Compression is 0.0%
Took 0.15 sec
[JENKINS] Archiving <https://builds.apache.org/job/Tamaya-Master-branch/ws/modules/resources/pom.xml>
to org.apache.tamaya.ext/tamaya-resources/0.1-incubating-SNAPSHOT/tamaya-resources-0.1-incubating-SNAPSHOT.pom
Sending artifact delta relative to Tamaya-Master-branch » Apache Tamaya Resource Services
#146
Archived 1 artifacts
Archive block size is 32768
Received 0 blocks and 1853 bytes
Compression is 0.0%
Took 0.16 sec
[JENKINS] Archiving <https://builds.apache.org/job/Tamaya-Master-branch/ws/java7/api/pom.xml>
to org.apache.tamaya/tamaya-java7-api/0.1-incubating-SNAPSHOT/tamaya-java7-api-0.1-incubating-SNAPSHOT.pom
Sending artifact delta relative to Tamaya-Master-branch » Apache Tamaya Java 7 API #146
Archived 1 artifacts
Archive block size is 32768
Received 0 blocks and 1777 bytes
Compression is 0.0%
Took 0.17 sec
channel stopped

Mime
View raw message