tamaya-commits mailing list archives

Site index · List index
Message view « Date » · « Thread »
Top « Date » · « Thread »
From Apache Jenkins Server <jenk...@builds.apache.org>
Subject Build failed in Jenkins: Tamaya-Master-branch #104
Date Sun, 04 Jan 2015 21:16:14 GMT
See <https://builds.apache.org/job/Tamaya-Master-branch/104/changes>

Changes:

[anatole] TAMAYA-47: Added initial revision of a functional value resolver module (implemented
as PropertyFilter).

------------------------------------------
[...truncated 768 lines...]
   java.runtime.version = 1.8.0_20-b26
   JAVA_HOME = /home/jenkins/jenkins-slave/tools/hudson.model.JDK/jdk-1.8.0
   user.name = jenkins
   XDG_SESSION_ID = 52
   POM_ARTIFACTID = tamaya-all
   file.encoding = ISO-8859-1
   HUDSON_URL = https://builds.apache.org/
   WORKSPACE = <https://builds.apache.org/job/Tamaya-Master-branch/ws/>
   localRepository = /home/jenkins/jenkins-slave/maven-repositories/0
   _ = /home/jenkins/tools/java/jdk1.7.0_55/bin/java
   java.io.tmpdir = /tmp
   GIT_COMMIT = 99997f39e7d1f748d73d614e665d684d9a383a9c
   java.version = 1.8.0_20
   SSH_CLIENT = 140.211.11.14 60667 22
   java.vm.specification.name = Java Virtual Machine Specification
   java.awt.printerjob = sun.print.PSPrinterJob
   sun.os.patch.level = unknown
   SSH_CONNECTION = 140.211.11.14 60667 67.195.81.155 22
   BUILD_NUMBER = 104
   java.library.path = /usr/java/packages/lib/amd64:/usr/lib64:/lib64:/lib:/usr/lib
   java.vendor = Oracle Corporation
   BUILD_URL = https://builds.apache.org/job/Tamaya-Master-branch/104/
   GIT_COMMITTER_EMAIL = builds@apache.org
   NLSPATH = /usr/dt/lib/nls/msg/%L/%N.cat
   sun.io.unicode.encoding = UnicodeLittle
   POM_DISPLAYNAME = Apache Tamaya
   maven.repo.local = /home/jenkins/jenkins-slave/maven-repositories/0
   GIT_URL = https://git-wip-us.apache.org/repos/asf/incubator-tamaya.git
   file.encoding.pkg = sun.io
   JOB_URL = https://builds.apache.org/job/Tamaya-Master-branch/
   java.class.path = <https://builds.apache.org/job/Tamaya-Master-branch/ws/core/target/test-classes>:<https://builds.apache.org/job/Tamaya-Master-branch/ws/core/target/classes>:<https://builds.apache.org/job/Tamaya-Master-branch/ws/api/target/tamaya-api-0.2-SNAPSHOT.jar>:/home/jenkins/jenkins-slave/maven-repositories/0/junit/junit/4.12/junit-4.12.jar:/home/jenkins/jenkins-slave/maven-repositories/0/org/hamcrest/hamcrest-core/1.3/hamcrest-core-1.3.jar:/home/jenkins/jenkins-slave/maven-repositories/0/org/apache/geronimo/specs/geronimo-annotation_1.2_spec/1.0-alpha-1/geronimo-annotation_1.2_spec-1.0-alpha-1.jar:
   HUDSON_COOKIE = 7a9c3c96-14d3-4ac8-b741-cc8c9ad8d871
   java.vm.vendor = Oracle Corporation
   MAVEN_HOME = /home/jenkins/jenkins-slave/tools/hudson.tasks.Maven_MavenInstallation/maven-3.2.1
   MAIL = /var/mail/jenkins
   user.timezone = Etc/UTC
   os.name = Linux
   java.vm.specification.version = 1.8
   LOGNAME = jenkins
   sun.java.launcher = SUN_STANDARD
   user.country = US
   POM_VERSION = 0.2-SNAPSHOT
   BUILD_TAG = jenkins-Tamaya-Master-branch-104
   SHELL = /bin/bash
   surefire.test.class.path = <https://builds.apache.org/job/Tamaya-Master-branch/ws/core/target/test-classes>:<https://builds.apache.org/job/Tamaya-Master-branch/ws/core/target/classes>:<https://builds.apache.org/job/Tamaya-Master-branch/ws/api/target/tamaya-api-0.2-SNAPSHOT.jar>:/home/jenkins/jenkins-slave/maven-repositories/0/junit/junit/4.12/junit-4.12.jar:/home/jenkins/jenkins-slave/maven-repositories/0/org/hamcrest/hamcrest-core/1.3/hamcrest-core-1.3.jar:/home/jenkins/jenkins-slave/maven-repositories/0/org/apache/geronimo/specs/geronimo-annotation_1.2_spec/1.0-alpha-1/geronimo-annotation_1.2_spec-1.0-alpha-1.jar:
   sun.cpu.endian = little
   user.home = /home/jenkins
   user.language = en
   OLDPWD = <https://builds.apache.org/job/Tamaya-Master-branch/ws/core>
   TMPDIR = /tmp/user/10021
   TEMPDIR = /tmp/user/10021
   java.awt.graphicsenv = sun.awt.X11GraphicsEnvironment
   M2_HOME = /home/jenkins/jenkins-slave/tools/hudson.tasks.Maven_MavenInstallation/maven-3.2.1
   name = Robin
   GIT_BRANCH = origin/master
   surefire.real.class.path = <https://builds.apache.org/job/Tamaya-Master-branch/ws/core/target/surefire/surefirebooter6608496635640844031.jar>
   POM_PACKAGING = pom
   GIT_PREVIOUS_COMMIT = dbf8af82e1aae9338662837b95bb9fdd935ac2df
   path.separator = :
   BUILD_ID = 2015-01-04_21-13-06
   XFILESEARCHPATH = /usr/dt/app-defaults/%L/Dt
   LANG = en_US
   os.version = 3.13.0-36-lowlatency
   JOB_NAME = Tamaya-Master-branch
   MAVEN_OPTS = -Xmx2g -Xms256m -XX:MaxPermSize=512m
   java.endorsed.dirs = /home/jenkins/jenkins-slave/tools/hudson.model.JDK/jdk-1.8.0/jre/lib/endorsed
   java.runtime.name = Java(TM) SE Runtime Environment
   GIT_PREVIOUS_SUCCESSFUL_COMMIT = 22d2d1ad87cdc38aba43115f946a79b684bd8cf1
   NODE_LABELS = H11 Ubuntu ubuntu
   java.vm.name = Java HotSpot(TM) 64-Bit Server VM
   java.vendor.url.bug = http://bugreport.sun.com/bugreport/
   user.dir = <https://builds.apache.org/job/Tamaya-Master-branch/ws/core>
   os.arch = amd64
   EXECUTOR_NUMBER = 0
   GIT_COMMITTER_NAME = jenkins
   HUDSON_SERVER_COOKIE = f4ebd1e6b0d976e8
   USER = jenkins
   SSH_AUTH_SOCK = /tmp/ssh-jRRfvSBGRYga/agent.5931
   TEMP = /tmp/user/10021
   java.vm.info = mixed mode
   java.vm.version = 25.20-b23
   TMP = /tmp/user/10021
   java.ext.dirs = /home/jenkins/jenkins-slave/tools/hudson.model.JDK/jdk-1.8.0/jre/lib/ext:/usr/java/packages/lib/ext
   java.class.version = 52.0
   XDG_RUNTIME_DIR = /run/user/10021
   HOME = /home/jenkins
Tests run: 2, Failures: 0, Errors: 0, Skipped: 0, Time elapsed: 0.125 sec - in org.apache.tamaya.core.ConfigurationTest

Results :

Tests run: 8, Failures: 0, Errors: 0, Skipped: 0

[JENKINS] Recording test results
[INFO] 
[INFO] --- maven-jar-plugin:2.5:jar (default-jar) @ tamaya-core ---
[INFO] Building jar: <https://builds.apache.org/job/Tamaya-Master-branch/ws/core/target/tamaya-core-0.2-SNAPSHOT.jar>
[INFO] 
[INFO] --- maven-site-plugin:3.3:attach-descriptor (attach-descriptor) @ tamaya-core ---
[INFO] 
[INFO] --- maven-javadoc-plugin:2.9.1:jar (attach-javadocs) @ tamaya-core ---
[INFO] Skipping javadoc generation
[INFO] 
[INFO] --- maven-install-plugin:2.5.2:install (default-install) @ tamaya-core ---
[INFO] Installing <https://builds.apache.org/job/Tamaya-Master-branch/ws/core/target/tamaya-core-0.2-SNAPSHOT.jar>
to /home/jenkins/jenkins-slave/maven-repositories/0/org/apache/tamaya/tamaya-core/0.2-SNAPSHOT/tamaya-core-0.2-SNAPSHOT.jar
[INFO] Installing <https://builds.apache.org/job/Tamaya-Master-branch/ws/core/pom.xml>
to /home/jenkins/jenkins-slave/maven-repositories/0/org/apache/tamaya/tamaya-core/0.2-SNAPSHOT/tamaya-core-0.2-SNAPSHOT.pom
[INFO] 
[INFO] --- apache-rat-plugin:0.11:check (default-cli) @ tamaya-core ---
[INFO] 51 implicit excludes (use -debug for more details).
[INFO] Exclude: **/*/MANIFEST.MF
[INFO] Exclude: .git
[INFO] Exclude: .gitignore
[INFO] Exclude: derby.log
[INFO] Exclude: **/META-INF/services/*
[INFO] Exclude: **/bootstrap-*
[INFO] Exclude: **/js/jquery-*
[INFO] Exclude: **/*.json
[INFO] 16 resources included (use -debug for more details)
Warning:  org.apache.xerces.jaxp.SAXParserImpl$JAXPSAXParser: Property 'http://www.oracle.com/xml/jaxp/properties/entityExpansionLimit'
is not recognized.
Compiler warnings:
  WARNING:  'org.apache.xerces.jaxp.SAXParserImpl: Property 'http://javax.xml.XMLConstants/property/accessExternalDTD'
is not recognized.'
Warning:  org.apache.xerces.parsers.SAXParser: Feature 'http://javax.xml.XMLConstants/feature/secure-processing'
is not recognized.
Warning:  org.apache.xerces.parsers.SAXParser: Property 'http://javax.xml.XMLConstants/property/accessExternalDTD'
is not recognized.
Warning:  org.apache.xerces.parsers.SAXParser: Property 'http://www.oracle.com/xml/jaxp/properties/entityExpansionLimit'
is not recognized.
[INFO] Rat check: Summary of files. Unapproved: 0 unknown: 0 generated: 0 approved: 16 licence.
[CHECKSTYLE] Skipping reporter since build result is FAILURE[INFO] 
[INFO] --- maven-enforcer-plugin:1.3.1:enforce (enforce-versions) @ tamaya-core ---

[INFO] 
[INFO] --- apache-rat-plugin:0.11:check (default) @ tamaya-core ---
[INFO] 51 implicit excludes (use -debug for more details).
[INFO] Exclude: **/*/MANIFEST.MF
[INFO] Exclude: .git
[INFO] Exclude: .gitignore
[INFO] Exclude: derby.log
[INFO] Exclude: **/META-INF/services/*
[INFO] Exclude: **/bootstrap-*
[INFO] Exclude: **/js/jquery-*
[INFO] Exclude: **/*.json
[INFO] 16 resources included (use -debug for more details)
Warning:  org.apache.xerces.jaxp.SAXParserImpl$JAXPSAXParser: Property 'http://www.oracle.com/xml/jaxp/properties/entityExpansionLimit'
is not recognized.
Compiler warnings:
  WARNING:  'org.apache.xerces.jaxp.SAXParserImpl: Property 'http://javax.xml.XMLConstants/property/accessExternalDTD'
is not recognized.'
Warning:  org.apache.xerces.parsers.SAXParser: Feature 'http://javax.xml.XMLConstants/feature/secure-processing'
is not recognized.
Warning:  org.apache.xerces.parsers.SAXParser: Property 'http://javax.xml.XMLConstants/property/accessExternalDTD'
is not recognized.
Warning:  org.apache.xerces.parsers.SAXParser: Property 'http://www.oracle.com/xml/jaxp/properties/entityExpansionLimit'
is not recognized.
[INFO] Rat check: Summary of files. Unapproved: 0 unknown: 0 generated: 0 approved: 16 licence.
[CHECKSTYLE] Skipping reporter since build result is FAILURE[INFO] 
[INFO] --- maven-remote-resources-plugin:1.5:process (default) @ tamaya-core ---

[INFO] 
[INFO] --- maven-resources-plugin:2.6:resources (default-resources) @ tamaya-core ---
[INFO] Using 'UTF-8' encoding to copy filtered resources.
[INFO] Copying 4 resources
[INFO] Copying 3 resources
[INFO] Copying 3 resources
[INFO] 
[INFO] --- maven-compiler-plugin:3.1:compile (default-compile) @ tamaya-core ---
[INFO] Nothing to compile - all classes are up to date
[INFO] 
[INFO] >>> findbugs-maven-plugin:3.0.0:check (findbugs-analyze) @ tamaya-core >>>
[INFO] 
[INFO] --- findbugs-maven-plugin:3.0.0:findbugs (findbugs) @ tamaya-core ---
[FINDBUGS] Skipping reporter since build result is FAILURE
[CHECKSTYLE] Skipping reporter since build result is FAILURE[INFO] 
[INFO] <<< findbugs-maven-plugin:3.0.0:check (findbugs-analyze) @ tamaya-core <<<
[INFO] 
[INFO] --- findbugs-maven-plugin:3.0.0:check (findbugs-analyze) @ tamaya-core ---

[CHECKSTYLE] Skipping reporter since build result is FAILURE[INFO] 
[INFO] --- maven-checkstyle-plugin:2.13:check (verify-style) @ tamaya-core ---

[INFO] 
[CHECKSTYLE] Skipping reporter since build result is FAILURE[INFO] 
[INFO] --- maven-resources-plugin:2.6:testResources (default-testResources) @ tamaya-core
---
[INFO] Using 'UTF-8' encoding to copy filtered resources.
[INFO] Copying 3 resources
[INFO] Copying 3 resources
[INFO] Copying 3 resources

[INFO] 
[INFO] --- maven-compiler-plugin:3.1:testCompile (default-testCompile) @ tamaya-core ---
[INFO] Nothing to compile - all classes are up to date
[INFO] 
[INFO] --- maven-surefire-plugin:2.17:test (default-test) @ tamaya-core ---
[INFO] Skipping execution of surefire because it has already been run for this configuration
[JENKINS] Recording test results
[INFO] 
[INFO] --- maven-jar-plugin:2.5:jar (default-jar) @ tamaya-core ---
[INFO] Building jar: <https://builds.apache.org/job/Tamaya-Master-branch/ws/core/target/tamaya-core-0.2-SNAPSHOT.jar>
[INFO] 
[INFO] --- maven-site-plugin:3.3:attach-descriptor (attach-descriptor) @ tamaya-core ---
[INFO] 
[INFO] --- maven-javadoc-plugin:2.9.1:jar (attach-javadocs) @ tamaya-core ---
[INFO] Skipping javadoc generation
[INFO] 
[INFO] --- maven-install-plugin:2.5.2:install (default-install) @ tamaya-core ---
[INFO] Installing <https://builds.apache.org/job/Tamaya-Master-branch/ws/core/target/tamaya-core-0.2-SNAPSHOT.jar>
to /home/jenkins/jenkins-slave/maven-repositories/0/org/apache/tamaya/tamaya-core/0.2-SNAPSHOT/tamaya-core-0.2-SNAPSHOT.jar
[INFO] Installing <https://builds.apache.org/job/Tamaya-Master-branch/ws/core/pom.xml>
to /home/jenkins/jenkins-slave/maven-repositories/0/org/apache/tamaya/tamaya-core/0.2-SNAPSHOT/tamaya-core-0.2-SNAPSHOT.pom
[INFO] 
[INFO] --- maven-deploy-plugin:2.8.2:deploy (default-deploy) @ tamaya-core ---
[INFO] Downloading: https://repository.apache.org/content/repositories/snapshots/org/apache/tamaya/tamaya-core/0.2-SNAPSHOT/maven-metadata.xml
[INFO] Downloaded: https://repository.apache.org/content/repositories/snapshots/org/apache/tamaya/tamaya-core/0.2-SNAPSHOT/maven-metadata.xml
(775 B at 2.5 KB/sec)
[INFO] Uploading: https://repository.apache.org/content/repositories/snapshots/org/apache/tamaya/tamaya-core/0.2-SNAPSHOT/tamaya-core-0.2-20150104.211600-20.jar
[INFO] Uploaded: https://repository.apache.org/content/repositories/snapshots/org/apache/tamaya/tamaya-core/0.2-SNAPSHOT/tamaya-core-0.2-20150104.211600-20.jar
(26 KB at 54.8 KB/sec)
[INFO] Uploading: https://repository.apache.org/content/repositories/snapshots/org/apache/tamaya/tamaya-core/0.2-SNAPSHOT/tamaya-core-0.2-20150104.211600-20.pom
[INFO] Uploaded: https://repository.apache.org/content/repositories/snapshots/org/apache/tamaya/tamaya-core/0.2-SNAPSHOT/tamaya-core-0.2-20150104.211600-20.pom
(2 KB at 4.8 KB/sec)
[INFO] Downloading: https://repository.apache.org/content/repositories/snapshots/org/apache/tamaya/tamaya-core/maven-metadata.xml
[INFO] Downloaded: https://repository.apache.org/content/repositories/snapshots/org/apache/tamaya/tamaya-core/maven-metadata.xml
(382 B at 1.8 KB/sec)
[INFO] Uploading: https://repository.apache.org/content/repositories/snapshots/org/apache/tamaya/tamaya-core/0.2-SNAPSHOT/maven-metadata.xml
[INFO] Uploaded: https://repository.apache.org/content/repositories/snapshots/org/apache/tamaya/tamaya-core/0.2-SNAPSHOT/maven-metadata.xml
(775 B at 5.9 KB/sec)
[INFO] Uploading: https://repository.apache.org/content/repositories/snapshots/org/apache/tamaya/tamaya-core/maven-metadata.xml
[INFO] Uploaded: https://repository.apache.org/content/repositories/snapshots/org/apache/tamaya/tamaya-core/maven-metadata.xml
(382 B at 2.3 KB/sec)
[INFO] ------------------------------------------------------------------------
[INFO] Reactor Summary:
[INFO] 
[INFO] Apache Tamaya ..................................... SUCCESS [ 16.024 s]
[INFO] tamaya-api ........................................ SUCCESS [ 19.841 s]
[INFO] tamaya-core ....................................... SUCCESS [  9.379 s]
[INFO] ------------------------------------------------------------------------
[INFO] BUILD SUCCESS
[INFO] ------------------------------------------------------------------------
[INFO] Total time: 49.030 s
[INFO] Finished at: 2015-01-04T21:16:02+00:00
[INFO] Final Memory: 46M/570M
[INFO] ------------------------------------------------------------------------
[JENKINS] Archiving <https://builds.apache.org/job/Tamaya-Master-branch/ws/core/pom.xml>
to org.apache.tamaya/tamaya-core/0.2-SNAPSHOT/tamaya-core-0.2-SNAPSHOT.pom
[JENKINS] Archiving <https://builds.apache.org/job/Tamaya-Master-branch/ws/core/target/tamaya-core-0.2-SNAPSHOT.jar>
to org.apache.tamaya/tamaya-core/0.2-20150104.211600-20/tamaya-core-0.2-20150104.211600-20.jar
Sending artifact delta relative to Tamaya-Master-branch » tamaya-core #69
Archived 2 artifacts
Archive block size is 32768
Received 0 blocks and 27879 bytes
Compression is 0.0%
Took 0.1 sec
[JENKINS] Archiving <https://builds.apache.org/job/Tamaya-Master-branch/ws/pom.xml>
to org.apache.tamaya/tamaya-all/0.2-SNAPSHOT/tamaya-all-0.2-SNAPSHOT.pom
Sending artifact delta relative to Tamaya-Master-branch » Apache Tamaya #69
Archived 1 artifacts
Archive block size is 32768
Received 0 blocks and 33103 bytes
Compression is 0.0%
Took 75 ms
[JENKINS] Archiving <https://builds.apache.org/job/Tamaya-Master-branch/ws/api/pom.xml>
to org.apache.tamaya/tamaya-api/0.2-SNAPSHOT/tamaya-api-0.2-SNAPSHOT.pom
[JENKINS] Archiving <https://builds.apache.org/job/Tamaya-Master-branch/ws/api/target/tamaya-api-0.2-SNAPSHOT.jar>
to org.apache.tamaya/tamaya-api/0.2-20150104.211550-20/tamaya-api-0.2-20150104.211550-20.jar
Sending artifact delta relative to Tamaya-Master-branch » tamaya-api #69
Archived 2 artifacts
Archive block size is 32768
Received 0 blocks and 13884 bytes
Compression is 0.0%
Took 75 ms
channel stopped

Mime
View raw message