tamaya-commits mailing list archives

Site index · List index
Message view « Date » · « Thread »
Top « Date » · « Thread »
From Apache Jenkins Server <jenk...@builds.apache.org>
Subject Build failed in Jenkins: Tamaya-Master-branch #162
Date Sun, 18 Jan 2015 00:15:19 GMT
See <https://builds.apache.org/job/Tamaya-Master-branch/162/changes>

Changes:

[anatole] TAMAYA-58: Added getTargetType to PropertyConverter. Added implementations of converters
for base types.

[anatole] TAMAYA-58: Added getTargetType to PropertyConverter. Added implementations of converters
for base types.

[anatole] TAMAYA-45: Moved event annotations out of package (functionality must be discussed
with question of update handling in general).

[anatole] Removed unused imports.

[anatole] TAMAYA-59: Fixed existing simple model to work with current API and other deps.

------------------------------------------
[...truncated 791 lines...]
    method org.apache.tamaya.Configuration.<T>get(java.lang.String,java.lang.Class<T>)
is not applicable
      (cannot infer type-variable(s) T
        (argument mismatch; java.lang.Class is not a functional interface))
    method org.apache.tamaya.Configuration.<T>get(java.lang.String,org.apache.tamaya.spi.PropertyConverter<T>)
is not applicable
      (cannot infer type-variable(s) T
        (argument mismatch; org.apache.tamaya.spi.PropertyConverter is not a functional interface
          multiple non-overriding abstract methods found in interface org.apache.tamaya.spi.PropertyConverter))
[ERROR] <https://builds.apache.org/job/Tamaya-Master-branch/ws/java8/api/src/test/java/org/apache/tamaya/ConfigurationTest.java>:[35,73]
no suitable method found for get(java.lang.String,(s)->Long.[...]Of(s))
    method org.apache.tamaya.Configuration.<T>get(java.lang.String,java.lang.Class<T>)
is not applicable
      (cannot infer type-variable(s) T
        (argument mismatch; java.lang.Class is not a functional interface))
    method org.apache.tamaya.Configuration.<T>get(java.lang.String,org.apache.tamaya.spi.PropertyConverter<T>)
is not applicable
      (cannot infer type-variable(s) T
        (argument mismatch; org.apache.tamaya.spi.PropertyConverter is not a functional interface
          multiple non-overriding abstract methods found in interface org.apache.tamaya.spi.PropertyConverter))
[ERROR] <https://builds.apache.org/job/Tamaya-Master-branch/ws/java8/api/src/test/java/org/apache/tamaya/ConfigurationTest.java>:[36,78]
no suitable method found for get(java.lang.String,(s)->Float[...]Of(s))
    method org.apache.tamaya.Configuration.<T>get(java.lang.String,java.lang.Class<T>)
is not applicable
      (cannot infer type-variable(s) T
        (argument mismatch; java.lang.Class is not a functional interface))
    method org.apache.tamaya.Configuration.<T>get(java.lang.String,org.apache.tamaya.spi.PropertyConverter<T>)
is not applicable
      (cannot infer type-variable(s) T
        (argument mismatch; org.apache.tamaya.spi.PropertyConverter is not a functional interface
          multiple non-overriding abstract methods found in interface org.apache.tamaya.spi.PropertyConverter))
[ERROR] <https://builds.apache.org/job/Tamaya-Master-branch/ws/java8/api/src/test/java/org/apache/tamaya/ConfigurationTest.java>:[37,79]
no suitable method found for get(java.lang.String,(s)->Doubl[...]Of(s))
    method org.apache.tamaya.Configuration.<T>get(java.lang.String,java.lang.Class<T>)
is not applicable
      (cannot infer type-variable(s) T
        (argument mismatch; java.lang.Class is not a functional interface))
    method org.apache.tamaya.Configuration.<T>get(java.lang.String,org.apache.tamaya.spi.PropertyConverter<T>)
is not applicable
      (cannot infer type-variable(s) T
        (argument mismatch; org.apache.tamaya.spi.PropertyConverter is not a functional interface
          multiple non-overriding abstract methods found in interface org.apache.tamaya.spi.PropertyConverter))
[ERROR] <https://builds.apache.org/job/Tamaya-Master-branch/ws/java8/api/src/test/java/org/apache/tamaya/ConfigurationTest.java>:[74,52]
no suitable method found for get(java.lang.String,(v)->Boole[...] "no")
    method org.apache.tamaya.Configuration.<T>get(java.lang.String,java.lang.Class<T>)
is not applicable
      (cannot infer type-variable(s) T
        (argument mismatch; java.lang.Class is not a functional interface))
    method org.apache.tamaya.Configuration.<T>get(java.lang.String,org.apache.tamaya.spi.PropertyConverter<T>)
is not applicable
      (cannot infer type-variable(s) T
        (argument mismatch; org.apache.tamaya.spi.PropertyConverter is not a functional interface
          multiple non-overriding abstract methods found in interface org.apache.tamaya.spi.PropertyConverter))
[ERROR] <https://builds.apache.org/job/Tamaya-Master-branch/ws/java8/api/src/test/java/org/apache/tamaya/ConfigurationTest.java>:[75,51]
no suitable method found for get(java.lang.String,(v)->Boole[...] "no")
    method org.apache.tamaya.Configuration.<T>get(java.lang.String,java.lang.Class<T>)
is not applicable
      (cannot infer type-variable(s) T
        (argument mismatch; java.lang.Class is not a functional interface))
    method org.apache.tamaya.Configuration.<T>get(java.lang.String,org.apache.tamaya.spi.PropertyConverter<T>)
is not applicable
      (cannot infer type-variable(s) T
        (argument mismatch; org.apache.tamaya.spi.PropertyConverter is not a functional interface
          multiple non-overriding abstract methods found in interface org.apache.tamaya.spi.PropertyConverter))
[INFO] 9 errors 
[INFO] -------------------------------------------------------------
[INFO] ------------------------------------------------------------------------
[INFO] Reactor Summary:
[INFO] 
[INFO] Apache Tamaya ..................................... SUCCESS [ 42.361 s]
[INFO] Apache Tamaya Build Configuration ................. SUCCESS [ 17.971 s]
[INFO] Apache Tamaya Java 7 Parent ....................... SUCCESS [  6.026 s]
[INFO] Apache Tamaya Java 7 API .......................... SUCCESS [ 54.125 s]
[INFO] Apache Tamaya Java 8 Parent ....................... SUCCESS [ 15.683 s]
[INFO] Apache Tamaya Java 8 API .......................... FAILURE [  6.298 s]
[INFO] Apache Tamaya Java 8 Core ......................... SKIPPED
[INFO] Apache Tamaya Extension Modules ................... SKIPPED
[INFO] Apache Tamaya Resource Services ................... SKIPPED
[INFO] Apache Tamaya Resolver Services ................... SKIPPED
[INFO] Apache Tamaya Injection Support ................... SKIPPED
[INFO] Apache Tamaya Format Services ..................... SKIPPED
[INFO] Apache Tamaya JSON Support ........................ SKIPPED
[INFO] ------------------------------------------------------------------------
[INFO] BUILD FAILURE
[INFO] ------------------------------------------------------------------------
[INFO] Total time: 02:30 min
[INFO] Finished at: 2015-01-18T00:15:15+00:00
[INFO] Final Memory: 53M/630M
[INFO] ------------------------------------------------------------------------
[ERROR] Failed to execute goal org.apache.maven.plugins:maven-compiler-plugin:3.1:testCompile
(default-testCompile) on project tamaya-api: Compilation failure: Compilation failure:
[ERROR] <https://builds.apache.org/job/Tamaya-Master-branch/ws/java8/api/src/test/java/org/apache/tamaya/ConfigurationTest.java>:[31,59]
no suitable method found for get(java.lang.String,(s)->Boole[...]Of(s))
[ERROR] method org.apache.tamaya.Configuration.<T>get(java.lang.String,java.lang.Class<T>)
is not applicable
[ERROR] (cannot infer type-variable(s) T
[ERROR] (argument mismatch; java.lang.Class is not a functional interface))
[ERROR] method org.apache.tamaya.Configuration.<T>get(java.lang.String,org.apache.tamaya.spi.PropertyConverter<T>)
is not applicable
[ERROR] (cannot infer type-variable(s) T
[ERROR] (argument mismatch; org.apache.tamaya.spi.PropertyConverter is not a functional interface
[ERROR] multiple non-overriding abstract methods found in interface org.apache.tamaya.spi.PropertyConverter))
[ERROR] <https://builds.apache.org/job/Tamaya-Master-branch/ws/java8/api/src/test/java/org/apache/tamaya/ConfigurationTest.java>:[32,60]
no suitable method found for get(java.lang.String,(s)->Boole[...]Of(s))
[ERROR] method org.apache.tamaya.Configuration.<T>get(java.lang.String,java.lang.Class<T>)
is not applicable
[ERROR] (cannot infer type-variable(s) T
[ERROR] (argument mismatch; java.lang.Class is not a functional interface))
[ERROR] method org.apache.tamaya.Configuration.<T>get(java.lang.String,org.apache.tamaya.spi.PropertyConverter<T>)
is not applicable
[ERROR] (cannot infer type-variable(s) T
[ERROR] (argument mismatch; org.apache.tamaya.spi.PropertyConverter is not a functional interface
[ERROR] multiple non-overriding abstract methods found in interface org.apache.tamaya.spi.PropertyConverter))
[ERROR] <https://builds.apache.org/job/Tamaya-Master-branch/ws/java8/api/src/test/java/org/apache/tamaya/ConfigurationTest.java>:[33,71]
no suitable method found for get(java.lang.String,(s)->Byte.[...]Of(s))
[ERROR] method org.apache.tamaya.Configuration.<T>get(java.lang.String,java.lang.Class<T>)
is not applicable
[ERROR] (cannot infer type-variable(s) T
[ERROR] (argument mismatch; java.lang.Class is not a functional interface))
[ERROR] method org.apache.tamaya.Configuration.<T>get(java.lang.String,org.apache.tamaya.spi.PropertyConverter<T>)
is not applicable
[ERROR] (cannot infer type-variable(s) T
[ERROR] (argument mismatch; org.apache.tamaya.spi.PropertyConverter is not a functional interface
[ERROR] multiple non-overriding abstract methods found in interface org.apache.tamaya.spi.PropertyConverter))
[ERROR] <https://builds.apache.org/job/Tamaya-Master-branch/ws/java8/api/src/test/java/org/apache/tamaya/ConfigurationTest.java>:[34,74]
no suitable method found for get(java.lang.String,(s)->Integ[...]Of(s))
[ERROR] method org.apache.tamaya.Configuration.<T>get(java.lang.String,java.lang.Class<T>)
is not applicable
[ERROR] (cannot infer type-variable(s) T
[ERROR] (argument mismatch; java.lang.Class is not a functional interface))
[ERROR] method org.apache.tamaya.Configuration.<T>get(java.lang.String,org.apache.tamaya.spi.PropertyConverter<T>)
is not applicable
[ERROR] (cannot infer type-variable(s) T
[ERROR] (argument mismatch; org.apache.tamaya.spi.PropertyConverter is not a functional interface
[ERROR] multiple non-overriding abstract methods found in interface org.apache.tamaya.spi.PropertyConverter))
[ERROR] <https://builds.apache.org/job/Tamaya-Master-branch/ws/java8/api/src/test/java/org/apache/tamaya/ConfigurationTest.java>:[35,73]
no suitable method found for get(java.lang.String,(s)->Long.[...]Of(s))
[ERROR] method org.apache.tamaya.Configuration.<T>get(java.lang.String,java.lang.Class<T>)
is not applicable
[ERROR] (cannot infer type-variable(s) T
[ERROR] (argument mismatch; java.lang.Class is not a functional interface))
[ERROR] method org.apache.tamaya.Configuration.<T>get(java.lang.String,org.apache.tamaya.spi.PropertyConverter<T>)
is not applicable
[ERROR] (cannot infer type-variable(s) T
[ERROR] (argument mismatch; org.apache.tamaya.spi.PropertyConverter is not a functional interface
[ERROR] multiple non-overriding abstract methods found in interface org.apache.tamaya.spi.PropertyConverter))
[ERROR] <https://builds.apache.org/job/Tamaya-Master-branch/ws/java8/api/src/test/java/org/apache/tamaya/ConfigurationTest.java>:[36,78]
no suitable method found for get(java.lang.String,(s)->Float[...]Of(s))
[ERROR] method org.apache.tamaya.Configuration.<T>get(java.lang.String,java.lang.Class<T>)
is not applicable
[ERROR] (cannot infer type-variable(s) T
[ERROR] (argument mismatch; java.lang.Class is not a functional interface))
[ERROR] method org.apache.tamaya.Configuration.<T>get(java.lang.String,org.apache.tamaya.spi.PropertyConverter<T>)
is not applicable
[ERROR] (cannot infer type-variable(s) T
[ERROR] (argument mismatch; org.apache.tamaya.spi.PropertyConverter is not a functional interface
[ERROR] multiple non-overriding abstract methods found in interface org.apache.tamaya.spi.PropertyConverter))
[ERROR] <https://builds.apache.org/job/Tamaya-Master-branch/ws/java8/api/src/test/java/org/apache/tamaya/ConfigurationTest.java>:[37,79]
no suitable method found for get(java.lang.String,(s)->Doubl[...]Of(s))
[ERROR] method org.apache.tamaya.Configuration.<T>get(java.lang.String,java.lang.Class<T>)
is not applicable
[ERROR] (cannot infer type-variable(s) T
[ERROR] (argument mismatch; java.lang.Class is not a functional interface))
[ERROR] method org.apache.tamaya.Configuration.<T>get(java.lang.String,org.apache.tamaya.spi.PropertyConverter<T>)
is not applicable
[ERROR] (cannot infer type-variable(s) T
[ERROR] (argument mismatch; org.apache.tamaya.spi.PropertyConverter is not a functional interface
[ERROR] multiple non-overriding abstract methods found in interface org.apache.tamaya.spi.PropertyConverter))
[ERROR] <https://builds.apache.org/job/Tamaya-Master-branch/ws/java8/api/src/test/java/org/apache/tamaya/ConfigurationTest.java>:[74,52]
no suitable method found for get(java.lang.String,(v)->Boole[...] "no")
[ERROR] method org.apache.tamaya.Configuration.<T>get(java.lang.String,java.lang.Class<T>)
is not applicable
[ERROR] (cannot infer type-variable(s) T
[ERROR] (argument mismatch; java.lang.Class is not a functional interface))
[ERROR] method org.apache.tamaya.Configuration.<T>get(java.lang.String,org.apache.tamaya.spi.PropertyConverter<T>)
is not applicable
[ERROR] (cannot infer type-variable(s) T
[ERROR] (argument mismatch; org.apache.tamaya.spi.PropertyConverter is not a functional interface
[ERROR] multiple non-overriding abstract methods found in interface org.apache.tamaya.spi.PropertyConverter))
[ERROR] <https://builds.apache.org/job/Tamaya-Master-branch/ws/java8/api/src/test/java/org/apache/tamaya/ConfigurationTest.java>:[75,51]
no suitable method found for get(java.lang.String,(v)->Boole[...] "no")
[ERROR] method org.apache.tamaya.Configuration.<T>get(java.lang.String,java.lang.Class<T>)
is not applicable
[ERROR] (cannot infer type-variable(s) T
[ERROR] (argument mismatch; java.lang.Class is not a functional interface))
[ERROR] method org.apache.tamaya.Configuration.<T>get(java.lang.String,org.apache.tamaya.spi.PropertyConverter<T>)
is not applicable
[ERROR] (cannot infer type-variable(s) T
[ERROR] (argument mismatch; org.apache.tamaya.spi.PropertyConverter is not a functional interface
[ERROR] multiple non-overriding abstract methods found in interface org.apache.tamaya.spi.PropertyConverter))
[ERROR] -> [Help 1]
[ERROR] 
[ERROR] To see the full stack trace of the errors, re-run Maven with the -e switch.
[ERROR] Re-run Maven using the -X switch to enable full debug logging.
[ERROR] 
[ERROR] For more information about the errors and possible solutions, please read the following
articles:
[ERROR] [Help 1] http://cwiki.apache.org/confluence/display/MAVEN/MojoFailureException
[ERROR] 
[ERROR] After correcting the problems, you can resume the build with the command
[ERROR]   mvn <goals> -rf :tamaya-api
[JENKINS] Archiving <https://builds.apache.org/job/Tamaya-Master-branch/ws/modules/injection/pom.xml>
to org.apache.tamaya.ext/tamaya-injection/0.1-incubating-SNAPSHOT/tamaya-injection-0.1-incubating-SNAPSHOT.pom
Sending artifact delta relative to Tamaya-Master-branch » Apache Tamaya Injection Support
#161
Archived 1 artifacts
Archive block size is 32768
Received 0 blocks and 2317 bytes
Compression is 0.0%
Took 72 ms
[JENKINS] Archiving <https://builds.apache.org/job/Tamaya-Master-branch/ws/modules/json/pom.xml>
to org.apache.tamaya.ext/json/0.1-incubating-SNAPSHOT/json-0.1-incubating-SNAPSHOT.pom
Sending artifact delta relative to Tamaya-Master-branch » Apache Tamaya JSON Support #161
Archived 1 artifacts
Archive block size is 32768
Received 0 blocks and 2661 bytes
Compression is 0.0%
Took 72 ms
[JENKINS] Archiving <https://builds.apache.org/job/Tamaya-Master-branch/ws/modules/resolver/pom.xml>
to org.apache.tamaya.ext/tamaya-resolver/0.1-incubating-SNAPSHOT/tamaya-resolver-0.1-incubating-SNAPSHOT.pom
Sending artifact delta relative to Tamaya-Master-branch » Apache Tamaya Resolver Services
#161
Archived 1 artifacts
Archive block size is 32768
Received 0 blocks and 2311 bytes
Compression is 0.0%
Took 71 ms
[JENKINS] Archiving <https://builds.apache.org/job/Tamaya-Master-branch/ws/java8/pom.xml>
to org.apache.tamaya/tamaya-java8/0.1-incubating-SNAPSHOT/tamaya-java8-0.1-incubating-SNAPSHOT.pom
Sending artifact delta relative to Tamaya-Master-branch » Apache Tamaya Java 8 Parent #161
Archived 1 artifacts
Archive block size is 32768
Received 0 blocks and 3037 bytes
Compression is 0.0%
Took 71 ms
[JENKINS] Archiving <https://builds.apache.org/job/Tamaya-Master-branch/ws/modules/formats/pom.xml>
to org.apache.tamaya.ext/tamaya-formats/0.1-incubating-SNAPSHOT/tamaya-formats-0.1-incubating-SNAPSHOT.pom
Sending artifact delta relative to Tamaya-Master-branch » Apache Tamaya Format Services #161
Archived 1 artifacts
Archive block size is 32768
Received 0 blocks and 2113 bytes
Compression is 0.0%
Took 71 ms
[JENKINS] Archiving <https://builds.apache.org/job/Tamaya-Master-branch/ws/java8/core/pom.xml>
to org.apache.tamaya/tamaya-core/0.1-incubating-SNAPSHOT/tamaya-core-0.1-incubating-SNAPSHOT.pom
Sending artifact delta relative to Tamaya-Master-branch » Apache Tamaya Java 8 Core #161
Archived 1 artifacts
Archive block size is 32768
Received 0 blocks and 2078 bytes
Compression is 0.0%
Took 72 ms
[JENKINS] Archiving <https://builds.apache.org/job/Tamaya-Master-branch/ws/java7/pom.xml>
to org.apache.tamaya/tamaya-java7/0.1-incubating-SNAPSHOT/tamaya-java7-0.1-incubating-SNAPSHOT.pom
Sending artifact delta relative to Tamaya-Master-branch » Apache Tamaya Java 7 Parent #161
Archived 1 artifacts
Archive block size is 32768
Received 0 blocks and 3528 bytes
Compression is 0.0%
Took 72 ms
[JENKINS] Archiving <https://builds.apache.org/job/Tamaya-Master-branch/ws/pom.xml>
to org.apache.tamaya/tamaya-all/0.1-incubating-SNAPSHOT/tamaya-all-0.1-incubating-SNAPSHOT.pom
Sending artifact delta relative to Tamaya-Master-branch » Apache Tamaya #161
Archived 1 artifacts
Archive block size is 32768
Received 1 blocks and 1169 bytes
Compression is 96.6%
Took 72 ms
[JENKINS] Archiving <https://builds.apache.org/job/Tamaya-Master-branch/ws/modules/pom.xml>
to org.apache.tamaya.ext/tamaya-extensions/0.1-incubating-SNAPSHOT/tamaya-extensions-0.1-incubating-SNAPSHOT.pom
Sending artifact delta relative to Tamaya-Master-branch » Apache Tamaya Extension Modules
#161
Archived 1 artifacts
Archive block size is 32768
Received 0 blocks and 3406 bytes
Compression is 0.0%
Took 71 ms
[JENKINS] Archiving <https://builds.apache.org/job/Tamaya-Master-branch/ws/java8/api/pom.xml>
to org.apache.tamaya/tamaya-api/0.1-incubating-SNAPSHOT/tamaya-api-0.1-incubating-SNAPSHOT.pom
Sending artifact delta relative to Tamaya-Master-branch » Apache Tamaya Java 8 API #161
Archived 1 artifacts
Archive block size is 32768
Received 0 blocks and 1755 bytes
Compression is 0.0%
Took 71 ms
[JENKINS] Archiving <https://builds.apache.org/job/Tamaya-Master-branch/ws/modules/resources/pom.xml>
to org.apache.tamaya.ext/tamaya-resources/0.1-incubating-SNAPSHOT/tamaya-resources-0.1-incubating-SNAPSHOT.pom
Sending artifact delta relative to Tamaya-Master-branch » Apache Tamaya Resource Services
#161
Archived 1 artifacts
Archive block size is 32768
Received 0 blocks and 1853 bytes
Compression is 0.0%
Took 72 ms
[JENKINS] Archiving <https://builds.apache.org/job/Tamaya-Master-branch/ws/java7/api/pom.xml>
to org.apache.tamaya/tamaya-java7-api/0.1-incubating-SNAPSHOT/tamaya-java7-api-0.1-incubating-SNAPSHOT.pom
[JENKINS] Archiving <https://builds.apache.org/job/Tamaya-Master-branch/ws/java7/api/target/tamaya-java7-api-0.1-incubating-SNAPSHOT.jar>
to org.apache.tamaya/tamaya-java7-api/0.1-incubating-20150118.001423-34/tamaya-java7-api-0.1-incubating-20150118.001423-34.jar
Sending artifact delta relative to Tamaya-Master-branch » Apache Tamaya Java 7 API #161
Archived 2 artifacts
Archive block size is 32768
Received 0 blocks and 13825 bytes
Compression is 0.0%
Took 74 ms
[JENKINS] Archiving <https://builds.apache.org/job/Tamaya-Master-branch/ws/buildconfigurations/pom.xml>
to org.apache.tamaya/buildconfigurations/0.1-incubating-SNAPSHOT/buildconfigurations-0.1-incubating-SNAPSHOT.pom
[JENKINS] Archiving <https://builds.apache.org/job/Tamaya-Master-branch/ws/buildconfigurations/target/buildconfigurations-0.1-incubating-SNAPSHOT.jar>
to org.apache.tamaya/buildconfigurations/0.1-incubating-20150118.001334-14/buildconfigurations-0.1-incubating-20150118.001334-14.jar
Sending artifact delta relative to Tamaya-Master-branch » Apache Tamaya Build Configuration
#161
Archived 2 artifacts
Archive block size is 32768
Received 0 blocks and 8426 bytes
Compression is 0.0%
Took 73 ms
channel stopped

Mime
View raw message