tamaya-commits mailing list archives

Site index · List index
Message view « Date » · « Thread »
Top « Date » · « Thread »
From Apache Jenkins Server <jenk...@builds.apache.org>
Subject Build failed in Jenkins: Tamaya-Master-branch #111
Date Tue, 06 Jan 2015 02:20:23 GMT
See <https://builds.apache.org/job/Tamaya-Master-branch/111/changes>

Changes:

[johndament] TAMAYA-42 Minor javadoc clarification.  Removed unused field.  Removed code duplication
from char converter.

------------------------------------------
[...truncated 551 lines...]
[INFO] 
[CHECKSTYLE] Skipping reporter since build result is FAILURE[INFO] 
[INFO] --- maven-resources-plugin:2.6:testResources (default-testResources) @ tamaya-api ---
[INFO] Using 'UTF-8' encoding to copy filtered resources.
[INFO] Copying 2 resources
[INFO] Copying 3 resources
[INFO] Copying 3 resources

[INFO] 
[INFO] --- maven-compiler-plugin:3.1:testCompile (default-testCompile) @ tamaya-api ---
[INFO] Nothing to compile - all classes are up to date
[INFO] 
[INFO] --- maven-surefire-plugin:2.17:test (default-test) @ tamaya-api ---
[INFO] Skipping execution of surefire because it has already been run for this configuration
[JENKINS] Recording test results
[INFO] 
[INFO] --- maven-jar-plugin:2.5:jar (default-jar) @ tamaya-api ---
[INFO] Building jar: <https://builds.apache.org/job/Tamaya-Master-branch/ws/api/target/tamaya-api-0.2-SNAPSHOT.jar>
[INFO] 
[INFO] --- maven-site-plugin:3.3:attach-descriptor (attach-descriptor) @ tamaya-api ---
[INFO] 
[INFO] --- maven-javadoc-plugin:2.9.1:jar (attach-javadocs) @ tamaya-api ---
[INFO] Skipping javadoc generation
[INFO] 
[INFO] --- maven-install-plugin:2.5.2:install (default-install) @ tamaya-api ---
[INFO] Installing <https://builds.apache.org/job/Tamaya-Master-branch/ws/api/target/tamaya-api-0.2-SNAPSHOT.jar>
to /home/jenkins/jenkins-slave/maven-repositories/1/org/apache/tamaya/tamaya-api/0.2-SNAPSHOT/tamaya-api-0.2-SNAPSHOT.jar
[INFO] Installing <https://builds.apache.org/job/Tamaya-Master-branch/ws/api/pom.xml>
to /home/jenkins/jenkins-slave/maven-repositories/1/org/apache/tamaya/tamaya-api/0.2-SNAPSHOT/tamaya-api-0.2-SNAPSHOT.pom
[INFO] 
[INFO] --- maven-deploy-plugin:2.8.2:deploy (default-deploy) @ tamaya-api ---
[INFO] Downloading: https://repository.apache.org/content/repositories/snapshots/org/apache/tamaya/tamaya-api/0.2-SNAPSHOT/maven-metadata.xml
[INFO] Downloaded: https://repository.apache.org/content/repositories/snapshots/org/apache/tamaya/tamaya-api/0.2-SNAPSHOT/maven-metadata.xml
(774 B at 1.9 KB/sec)
[INFO] Uploading: https://repository.apache.org/content/repositories/snapshots/org/apache/tamaya/tamaya-api/0.2-SNAPSHOT/tamaya-api-0.2-20150106.022011-22.jar
[INFO] Uploaded: https://repository.apache.org/content/repositories/snapshots/org/apache/tamaya/tamaya-api/0.2-SNAPSHOT/tamaya-api-0.2-20150106.022011-22.jar
(12 KB at 43.9 KB/sec)
[INFO] Uploading: https://repository.apache.org/content/repositories/snapshots/org/apache/tamaya/tamaya-api/0.2-SNAPSHOT/tamaya-api-0.2-20150106.022011-22.pom
[INFO] Uploaded: https://repository.apache.org/content/repositories/snapshots/org/apache/tamaya/tamaya-api/0.2-SNAPSHOT/tamaya-api-0.2-20150106.022011-22.pom
(2 KB at 6.7 KB/sec)
[INFO] Downloading: https://repository.apache.org/content/repositories/snapshots/org/apache/tamaya/tamaya-api/maven-metadata.xml
[INFO] Downloaded: https://repository.apache.org/content/repositories/snapshots/org/apache/tamaya/tamaya-api/maven-metadata.xml
(381 B at 1.7 KB/sec)
[INFO] Uploading: https://repository.apache.org/content/repositories/snapshots/org/apache/tamaya/tamaya-api/0.2-SNAPSHOT/maven-metadata.xml
[INFO] Uploaded: https://repository.apache.org/content/repositories/snapshots/org/apache/tamaya/tamaya-api/0.2-SNAPSHOT/maven-metadata.xml
(774 B at 2.1 KB/sec)
[INFO] Uploading: https://repository.apache.org/content/repositories/snapshots/org/apache/tamaya/tamaya-api/maven-metadata.xml
[INFO] Uploaded: https://repository.apache.org/content/repositories/snapshots/org/apache/tamaya/tamaya-api/maven-metadata.xml
(381 B at 1.0 KB/sec)
[INFO]                                                                         
[INFO] ------------------------------------------------------------------------
[INFO] Building tamaya-core 0.2-SNAPSHOT
[INFO] ------------------------------------------------------------------------
[INFO] 
[INFO] --- maven-clean-plugin:2.5:clean (default-clean) @ tamaya-core ---
[INFO] 
[INFO] --- maven-enforcer-plugin:1.3.1:enforce (enforce-versions) @ tamaya-core ---
[INFO] 
[INFO] --- apache-rat-plugin:0.11:check (default) @ tamaya-core ---
[INFO] 51 implicit excludes (use -debug for more details).
[INFO] Exclude: **/*/MANIFEST.MF
[INFO] Exclude: .git
[INFO] Exclude: .gitignore
[INFO] Exclude: derby.log
[INFO] Exclude: **/META-INF/services/*
[INFO] Exclude: **/bootstrap-*
[INFO] Exclude: **/js/jquery-*
[INFO] Exclude: **/*.json
[INFO] 16 resources included (use -debug for more details)
Warning:  org.apache.xerces.jaxp.SAXParserImpl$JAXPSAXParser: Property 'http://www.oracle.com/xml/jaxp/properties/entityExpansionLimit'
is not recognized.
Compiler warnings:
  WARNING:  'org.apache.xerces.jaxp.SAXParserImpl: Property 'http://javax.xml.XMLConstants/property/accessExternalDTD'
is not recognized.'
Warning:  org.apache.xerces.parsers.SAXParser: Feature 'http://javax.xml.XMLConstants/feature/secure-processing'
is not recognized.
Warning:  org.apache.xerces.parsers.SAXParser: Property 'http://javax.xml.XMLConstants/property/accessExternalDTD'
is not recognized.
Warning:  org.apache.xerces.parsers.SAXParser: Property 'http://www.oracle.com/xml/jaxp/properties/entityExpansionLimit'
is not recognized.
[INFO] Rat check: Summary of files. Unapproved: 0 unknown: 0 generated: 0 approved: 16 licence.
[CHECKSTYLE] No report found for mojo check[INFO] 
[INFO] --- maven-remote-resources-plugin:1.5:process (default) @ tamaya-core ---

[INFO] 
[INFO] --- maven-resources-plugin:2.6:resources (default-resources) @ tamaya-core ---
[INFO] Using 'UTF-8' encoding to copy filtered resources.
[INFO] Copying 4 resources
[INFO] Copying 3 resources
[INFO] 
[INFO] --- maven-compiler-plugin:3.1:compile (default-compile) @ tamaya-core ---
[INFO] Changes detected - recompiling the module!
[INFO] Compiling 8 source files to <https://builds.apache.org/job/Tamaya-Master-branch/ws/core/target/classes>
[WARNING] <https://builds.apache.org/job/Tamaya-Master-branch/ws/core/src/main/java/org/apache/tamaya/core/internal/PropertyConverterManager.java>:
Some input files use unchecked or unsafe operations.
[WARNING] <https://builds.apache.org/job/Tamaya-Master-branch/ws/core/src/main/java/org/apache/tamaya/core/internal/PropertyConverterManager.java>:
Recompile with -Xlint:unchecked for details.
[INFO] 
[INFO] >>> findbugs-maven-plugin:3.0.0:check (findbugs-analyze) @ tamaya-core >>>
[INFO] 
[INFO] --- findbugs-maven-plugin:3.0.0:findbugs (findbugs) @ tamaya-core ---
[FINDBUGS] No report found for mojo findbugs
[CHECKSTYLE] No report found for mojo check[INFO] 
[INFO] <<< findbugs-maven-plugin:3.0.0:check (findbugs-analyze) @ tamaya-core <<<
[INFO] 
[INFO] --- findbugs-maven-plugin:3.0.0:check (findbugs-analyze) @ tamaya-core ---

[CHECKSTYLE] No report found for mojo check[INFO] 
[INFO] --- maven-checkstyle-plugin:2.13:check (verify-style) @ tamaya-core ---

[INFO] 
[INFO] There are 1 checkstyle errors.
[ERROR] DefaultConfigurationContext.java[37:8] (imports) UnusedImports: Unused import - java.util.logging.Logger.
[CHECKSTYLE] Parsing file <https://builds.apache.org/job/Tamaya-Master-branch/ws/core/target/checkstyle-result.xml>
[CHECKSTYLE] Successfully parsed file <https://builds.apache.org/job/Tamaya-Master-branch/ws/core/target/checkstyle-result.xml>
of module tamaya-core with 1 warnings.
java.io.IOException: Remote call on channel failed
	at hudson.remoting.Channel.call(Channel.java:751)
	at hudson.remoting.RemoteInvocationHandler.invoke(RemoteInvocationHandler.java:168)
	at com.sun.proxy.$Proxy5.execute(Unknown Source)
	at hudson.maven.MavenBuildProxy$Filter.execute(MavenBuildProxy.java:207)
	at hudson.plugins.analysis.core.HealthAwareReporter.registerResultsOnMaster(HealthAwareReporter.java:339)
	at hudson.plugins.analysis.core.HealthAwareReporter.postExecute(HealthAwareReporter.java:330)
	at hudson.maven.Maven3Builder$MavenExecutionListener.recordMojoEnded(Maven3Builder.java:634)
	at hudson.maven.Maven3Builder$MavenExecutionListener.mojoFailed(Maven3Builder.java:667)
	at hudson.maven.Maven3Builder$JenkinsEventSpy.onEvent(Maven3Builder.java:311)
	at org.apache.maven.eventspy.internal.EventSpyDispatcher.onEvent(EventSpyDispatcher.java:108)
	at org.apache.maven.eventspy.internal.EventSpyExecutionListener.mojoFailed(EventSpyExecutionListener.java:138)
	at org.apache.maven.lifecycle.internal.DefaultExecutionEventCatapult.fire(DefaultExecutionEventCatapult.java:90)
	at org.apache.maven.lifecycle.internal.MojoExecutor.execute(MojoExecutor.java:231)
	at org.apache.maven.lifecycle.internal.MojoExecutor.execute(MojoExecutor.java:153)
	at org.apache.maven.lifecycle.internal.MojoExecutor.execute(MojoExecutor.java:145)
	at org.apache.maven.lifecycle.internal.LifecycleModuleBuilder.buildProject(LifecycleModuleBuilder.java:108)
	at org.apache.maven.lifecycle.internal.LifecycleModuleBuilder.buildProject(LifecycleModuleBuilder.java:76)
	at org.apache.maven.lifecycle.internal.builder.singlethreaded.SingleThreadedBuilder.build(SingleThreadedBuilder.java:51)
	at org.apache.maven.lifecycle.internal.LifecycleStarter.execute(LifecycleStarter.java:116)
	at org.apache.maven.DefaultMaven.doExecute(DefaultMaven.java:361)
	at org.apache.maven.DefaultMaven.execute(DefaultMaven.java:155)
	at org.jvnet.hudson.maven3.launcher.Maven31Launcher.main(Maven31Launcher.java:132)
	at sun.reflect.NativeMethodAccessorImpl.invoke0(Native Method)
	at sun.reflect.NativeMethodAccessorImpl.invoke(NativeMethodAccessorImpl.java:62)
	at sun.reflect.DelegatingMethodAccessorImpl.invoke(DelegatingMethodAccessorImpl.java:43)
	at java.lang.reflect.Method.invoke(Method.java:483)
	at org.codehaus.plexus.classworlds.launcher.Launcher.launchStandard(Launcher.java:330)
	at org.codehaus.plexus.classworlds.launcher.Launcher.launch(Launcher.java:238)
	at jenkins.maven3.agent.Maven31Main.launch(Maven31Main.java:181)
	at sun.reflect.NativeMethodAccessorImpl.invoke0(Native Method)
	at sun.reflect.NativeMethodAccessorImpl.invoke(NativeMethodAccessorImpl.java:62)
	at sun.reflect.DelegatingMethodAccessorImpl.invoke(DelegatingMethodAccessorImpl.java:43)
	at java.lang.reflect.Method.invoke(Method.java:483)
	at hudson.maven.Maven3Builder.call(Maven3Builder.java:136)
	at hudson.maven.Maven3Builder.call(Maven3Builder.java:71)
	at hudson.remoting.UserRequest.perform(UserRequest.java:118)
	at hudson.remoting.UserRequest.perform(UserRequest.java:48)
	at hudson.remoting.Request$2.run(Request.java:328)
	at hudson.remoting.InterceptingExecutorService$1.call(InterceptingExecutorService.java:72)
	at java.util.concurrent.FutureTask.run(FutureTask.java:266)
	at java.util.concurrent.ThreadPoolExecutor.runWorker(ThreadPoolExecutor.java:1142)
	at java.util.concurrent.ThreadPoolExecutor$Worker.run(ThreadPoolExecutor.java:617)
	at java.lang.Thread.run(Thread.java:745)
Caused by: java.lang.LinkageError: Failed to load com.google.common.collect.AbstractMapBasedMultimap
	at hudson.remoting.RemoteClassLoader.loadClassFile(RemoteClassLoader.java:326)
	at hudson.remoting.RemoteClassLoader.findClass(RemoteClassLoader.java:236)
	at java.lang.ClassLoader.loadClass(ClassLoader.java:425)
	at java.lang.ClassLoader.loadClass(ClassLoader.java:358)
	at java.lang.Class.forName0(Native Method)
	at java.lang.Class.forName(Class.java:270)
	at hudson.remoting.MultiClassLoaderSerializer$Input.resolveClass(MultiClassLoaderSerializer.java:113)
	at java.io.ObjectInputStream.readNonProxyDesc(ObjectInputStream.java:1612)
	at java.io.ObjectInputStream.readClassDesc(ObjectInputStream.java:1517)
	at java.io.ObjectInputStream.readNonProxyDesc(ObjectInputStream.java:1622)
	at java.io.ObjectInputStream.readClassDesc(ObjectInputStream.java:1517)
	at java.io.ObjectInputStream.readNonProxyDesc(ObjectInputStream.java:1622)
	at java.io.ObjectInputStream.readClassDesc(ObjectInputStream.java:1517)
	at java.io.ObjectInputStream.readOrdinaryObject(ObjectInputStream.java:1771)
	at java.io.ObjectInputStream.readObject0(ObjectInputStream.java:1350)
	at java.io.ObjectInputStream.defaultReadFields(ObjectInputStream.java:1990)
	at java.io.ObjectInputStream.readSerialData(ObjectInputStream.java:1915)
	at java.io.ObjectInputStream.readOrdinaryObject(ObjectInputStream.java:1798)
	at java.io.ObjectInputStream.readObject0(ObjectInputStream.java:1350)
	at java.io.ObjectInputStream.defaultReadFields(ObjectInputStream.java:1990)
	at java.io.ObjectInputStream.readSerialData(ObjectInputStream.java:1915)
	at java.io.ObjectInputStream.readOrdinaryObject(ObjectInputStream.java:1798)
	at java.io.ObjectInputStream.readObject0(ObjectInputStream.java:1350)
	at java.io.ObjectInputStream.readArray(ObjectInputStream.java:1706)
	at java.io.ObjectInputStream.readObject0(ObjectInputStream.java:1344)
	at java.io.ObjectInputStream.defaultReadFields(ObjectInputStream.java:1990)
	at java.io.ObjectInputStream.readSerialData(ObjectInputStream.java:1915)
	at java.io.ObjectInputStream.readOrdinaryObject(ObjectInputStream.java:1798)
	at java.io.ObjectInputStream.readObject0(ObjectInputStream.java:1350)
	at java.io.ObjectInputStream.readObject(ObjectInputStream.java:370)
	at hudson.remoting.UserRequest.deserialize(UserRequest.java:182)
	at hudson.remoting.UserRequest.perform(UserRequest.java:98)
	at hudson.remoting.UserRequest.perform(UserRequest.java:48)
	at hudson.remoting.Request$2.run(Request.java:328)
	at hudson.remoting.InterceptingExecutorService$1.call(InterceptingExecutorService.java:72)
	at jenkins.util.ContextResettingExecutorService$2.call(ContextResettingExecutorService.java:46)
	at java.util.concurrent.FutureTask.run(FutureTask.java:262)
	at java.util.concurrent.ThreadPoolExecutor.runWorker(ThreadPoolExecutor.java:1145)
	at java.util.concurrent.ThreadPoolExecutor$Worker.run(ThreadPoolExecutor.java:615)
	... 1 more
Caused by: java.lang.IllegalAccessError: class com.google.common.collect.AbstractMapBasedMultimap
cannot access its superclass com.google.common.collect.AbstractMultimap
	at java.lang.ClassLoader.defineClass1(Native Method)
	at java.lang.ClassLoader.defineClass(ClassLoader.java:800)
	at java.lang.ClassLoader.defineClass(ClassLoader.java:643)
	at hudson.remoting.RemoteClassLoader.loadClassFile(RemoteClassLoader.java:322)
	... 39 more
[INFO] ------------------------------------------------------------------------
[INFO] Reactor Summary:
[INFO] 
[INFO] Apache Tamaya ..................................... SUCCESS [ 21.581 s]
[INFO] tamaya-api ........................................ SUCCESS [ 21.859 s]
[INFO] tamaya-core ....................................... FAILURE [  3.660 s]
[INFO] Apache Tamaya Extension Modules ................... SKIPPED
[INFO] Apache Tamaya Format Services ..................... SKIPPED
[INFO] Apache Tamaya Resolver Services ................... SKIPPED
[INFO] Apache Tamaya Resource Services ................... SKIPPED
[INFO] ------------------------------------------------------------------------
[INFO] BUILD FAILURE
[INFO] ------------------------------------------------------------------------
[INFO] Total time: 52.060 s
[INFO] Finished at: 2015-01-06T02:20:20+00:00
[INFO] Final Memory: 50M/609M
[INFO] ------------------------------------------------------------------------
[ERROR] Failed to execute goal org.apache.maven.plugins:maven-checkstyle-plugin:2.13:check
(verify-style) on project tamaya-core: You have 1 Checkstyle violation. -> [Help 1]
[ERROR] 
[ERROR] To see the full stack trace of the errors, re-run Maven with the -e switch.
[ERROR] Re-run Maven using the -X switch to enable full debug logging.
[ERROR] 
[ERROR] For more information about the errors and possible solutions, please read the following
articles:
[ERROR] [Help 1] http://cwiki.apache.org/confluence/display/MAVEN/MojoFailureException
[ERROR] 
[ERROR] After correcting the problems, you can resume the build with the command
[ERROR]   mvn <goals> -rf :tamaya-core
[JENKINS] Archiving <https://builds.apache.org/job/Tamaya-Master-branch/ws/modules/resolver/pom.xml>
to org.apache.tamaya.ext/tamaya-resolver/0.2-SNAPSHOT/tamaya-resolver-0.2-SNAPSHOT.pom
No prior successful build to compare, so performing full copy of artifacts
[JENKINS] Archiving <https://builds.apache.org/job/Tamaya-Master-branch/ws/modules/formats/pom.xml>
to org.apache.tamaya.ext/tamaya-formats/0.2-SNAPSHOT/tamaya-formats-0.2-SNAPSHOT.pom
No prior successful build to compare, so performing full copy of artifacts
[JENKINS] Archiving <https://builds.apache.org/job/Tamaya-Master-branch/ws/core/pom.xml>
to org.apache.tamaya/tamaya-core/0.2-SNAPSHOT/tamaya-core-0.2-SNAPSHOT.pom
Sending artifact delta relative to Tamaya-Master-branch » tamaya-core #69
Archived 1 artifacts
Archive block size is 32768
Received 0 blocks and 1722 bytes
Compression is 0.0%
Took 0.2 sec
[JENKINS] Archiving <https://builds.apache.org/job/Tamaya-Master-branch/ws/pom.xml>
to org.apache.tamaya/tamaya-all/0.2-SNAPSHOT/tamaya-all-0.2-SNAPSHOT.pom
Sending artifact delta relative to Tamaya-Master-branch » Apache Tamaya #69
Archived 1 artifacts
Archive block size is 32768
Received 0 blocks and 33136 bytes
Compression is 0.0%
Took 85 ms
[JENKINS] Archiving <https://builds.apache.org/job/Tamaya-Master-branch/ws/modules/pom.xml>
to org.apache.tamaya.ext/tamaya-extensions/0.2-SNAPSHOT/tamaya-extensions-0.2-SNAPSHOT.pom
No prior successful build to compare, so performing full copy of artifacts
[JENKINS] Archiving <https://builds.apache.org/job/Tamaya-Master-branch/ws/api/pom.xml>
to org.apache.tamaya/tamaya-api/0.2-SNAPSHOT/tamaya-api-0.2-SNAPSHOT.pom
[JENKINS] Archiving <https://builds.apache.org/job/Tamaya-Master-branch/ws/api/target/tamaya-api-0.2-SNAPSHOT.jar>
to org.apache.tamaya/tamaya-api/0.2-20150106.022011-22/tamaya-api-0.2-20150106.022011-22.jar
Sending artifact delta relative to Tamaya-Master-branch » tamaya-api #69
Archived 2 artifacts
Archive block size is 32768
Received 0 blocks and 13884 bytes
Compression is 0.0%
Took 0.1 sec
[JENKINS] Archiving <https://builds.apache.org/job/Tamaya-Master-branch/ws/modules/resources/pom.xml>
to org.apache.tamaya.ext/tamaya-resources/0.2-SNAPSHOT/tamaya-resources-0.2-SNAPSHOT.pom
No prior successful build to compare, so performing full copy of artifacts
channel stopped

Mime
View raw message