tamaya-commits mailing list archives

Site index · List index
Message view « Date » · « Thread »
Top « Date » · « Thread »
From Apache Jenkins Server <jenk...@builds.apache.org>
Subject Build failed in Jenkins: Tamaya-Master-branch #39
Date Sun, 07 Dec 2014 23:58:43 GMT
See <https://builds.apache.org/job/Tamaya-Master-branch/39/changes>

Changes:

[anatole] TAMAYA-3:

[anatole] TAMAYA-3: Readded fixed test

------------------------------------------
[...truncated 277 lines...]
-------------------------------------------------------
 T E S T S
-------------------------------------------------------

Results :

Tests run: 0, Failures: 0, Errors: 0, Skipped: 0

[JENKINS] Recording test results
[INFO] 
[INFO] --- maven-jar-plugin:2.5:jar (default-jar) @ tamaya-api ---
[INFO] Building jar: <https://builds.apache.org/job/Tamaya-Master-branch/ws/api/target/tamaya-api-0.1-SNAPSHOT.jar>
[INFO] 
[INFO] --- maven-site-plugin:3.3:attach-descriptor (attach-descriptor) @ tamaya-api ---
[INFO] 
[INFO] --- maven-javadoc-plugin:2.9.1:jar (attach-javadocs) @ tamaya-api ---
[INFO] Skipping javadoc generation
[INFO] 
[INFO] --- apache-rat-plugin:0.11:check (default) @ tamaya-api ---
[INFO] RAT will not execute since it is configured to be skipped via system property 'rat.skip'.
[CHECKSTYLE] No report found for mojo check[INFO] 
[INFO] --- maven-install-plugin:2.5.2:install (default-install) @ tamaya-api ---
[INFO] Installing <https://builds.apache.org/job/Tamaya-Master-branch/ws/api/target/tamaya-api-0.1-SNAPSHOT.jar>
to /home/jenkins/jenkins-slave/maven-repositories/0/org/apache/tamaya/tamaya-api/0.1-SNAPSHOT/tamaya-api-0.1-SNAPSHOT.jar
[INFO] Installing <https://builds.apache.org/job/Tamaya-Master-branch/ws/api/pom.xml>
to /home/jenkins/jenkins-slave/maven-repositories/0/org/apache/tamaya/tamaya-api/0.1-SNAPSHOT/tamaya-api-0.1-SNAPSHOT.pom

[INFO] 
[INFO] --- maven-enforcer-plugin:1.3.1:enforce (enforce-versions) @ tamaya-api ---
[INFO] 
[INFO] --- jacoco-maven-plugin:0.7.2.201409121644:prepare-agent (prepare-agent) @ tamaya-api
---
[INFO] argLine set to -javaagent:/home/jenkins/jenkins-slave/maven-repositories/0/org/jacoco/org.jacoco.agent/0.7.2.201409121644/org.jacoco.agent-0.7.2.201409121644-runtime.jar=destfile=<https://builds.apache.org/job/Tamaya-Master-branch/ws/api/target/jacoco.exec>
[INFO] 
[INFO] --- maven-remote-resources-plugin:1.5:process (default) @ tamaya-api ---
[INFO] 
[INFO] --- maven-resources-plugin:2.6:resources (default-resources) @ tamaya-api ---
[INFO] Using 'UTF-8' encoding to copy filtered resources.
[INFO] skip non existing resourceDirectory <https://builds.apache.org/job/Tamaya-Master-branch/ws/api/src/main/resources>
[INFO] Copying 3 resources
[INFO] Copying 3 resources
[INFO] 
[INFO] --- maven-compiler-plugin:2.1:compile (default-compile) @ tamaya-api ---
[INFO] Nothing to compile - all classes are up to date
[INFO] 
[INFO] >>> findbugs-maven-plugin:3.0.0:check (findbugs-analyze) @ tamaya-api >>>
[INFO] 
[INFO] --- findbugs-maven-plugin:3.0.0:findbugs (findbugs) @ tamaya-api ---
[FINDBUGS] No report found for mojo findbugs
[CHECKSTYLE] No report found for mojo check[INFO] 
[INFO] <<< findbugs-maven-plugin:3.0.0:check (findbugs-analyze) @ tamaya-api <<<
[INFO] 
[INFO] --- findbugs-maven-plugin:3.0.0:check (findbugs-analyze) @ tamaya-api ---

[CHECKSTYLE] No report found for mojo check[INFO] 
[INFO] --- maven-resources-plugin:2.6:testResources (default-testResources) @ tamaya-api ---
[INFO] Using 'UTF-8' encoding to copy filtered resources.
[INFO] Copying 4 resources
[INFO] Copying 3 resources
[INFO] Copying 3 resources

[INFO] 
[INFO] --- maven-compiler-plugin:2.1:testCompile (default-testCompile) @ tamaya-api ---
[INFO] Compiling 3 source files to <https://builds.apache.org/job/Tamaya-Master-branch/ws/api/target/test-classes>
[INFO] 
[INFO] --- maven-surefire-plugin:2.17:test (default-test) @ tamaya-api ---
[INFO] Skipping execution of surefire because it has already been run for this configuration
[JENKINS] Recording test results
[INFO] 
[INFO] --- maven-jar-plugin:2.5:jar (default-jar) @ tamaya-api ---
[INFO] Building jar: <https://builds.apache.org/job/Tamaya-Master-branch/ws/api/target/tamaya-api-0.1-SNAPSHOT.jar>
[INFO] 
[INFO] --- maven-site-plugin:3.3:attach-descriptor (attach-descriptor) @ tamaya-api ---
[INFO] 
[INFO] --- maven-javadoc-plugin:2.9.1:jar (attach-javadocs) @ tamaya-api ---
[INFO] Skipping javadoc generation
[INFO] 
[INFO] --- apache-rat-plugin:0.11:check (default) @ tamaya-api ---
[INFO] RAT will not execute since it is configured to be skipped via system property 'rat.skip'.
[CHECKSTYLE] No report found for mojo check[INFO] 
[INFO] --- maven-install-plugin:2.5.2:install (default-install) @ tamaya-api ---
[INFO] Installing <https://builds.apache.org/job/Tamaya-Master-branch/ws/api/target/tamaya-api-0.1-SNAPSHOT.jar>
to /home/jenkins/jenkins-slave/maven-repositories/0/org/apache/tamaya/tamaya-api/0.1-SNAPSHOT/tamaya-api-0.1-SNAPSHOT.jar
[INFO] Installing <https://builds.apache.org/job/Tamaya-Master-branch/ws/api/pom.xml>
to /home/jenkins/jenkins-slave/maven-repositories/0/org/apache/tamaya/tamaya-api/0.1-SNAPSHOT/tamaya-api-0.1-SNAPSHOT.pom

[INFO] 
[INFO] --- maven-deploy-plugin:2.8.2:deploy (default-deploy) @ tamaya-api ---
[INFO] Downloading: https://repository.apache.org/content/repositories/snapshots/org/apache/tamaya/tamaya-api/0.1-SNAPSHOT/maven-metadata.xml
[INFO] Downloaded: https://repository.apache.org/content/repositories/snapshots/org/apache/tamaya/tamaya-api/0.1-SNAPSHOT/maven-metadata.xml
(987 B at 2.8 KB/sec)
[INFO] Uploading: https://repository.apache.org/content/repositories/snapshots/org/apache/tamaya/tamaya-api/0.1-SNAPSHOT/tamaya-api-0.1-20141207.235820-39.jar
[INFO] Uploaded: https://repository.apache.org/content/repositories/snapshots/org/apache/tamaya/tamaya-api/0.1-SNAPSHOT/tamaya-api-0.1-20141207.235820-39.jar
(48 KB at 227.7 KB/sec)
[INFO] Uploading: https://repository.apache.org/content/repositories/snapshots/org/apache/tamaya/tamaya-api/0.1-SNAPSHOT/tamaya-api-0.1-20141207.235820-39.pom
[INFO] Uploaded: https://repository.apache.org/content/repositories/snapshots/org/apache/tamaya/tamaya-api/0.1-SNAPSHOT/tamaya-api-0.1-20141207.235820-39.pom
(3 KB at 18.7 KB/sec)
[INFO] Downloading: https://repository.apache.org/content/repositories/snapshots/org/apache/tamaya/tamaya-api/maven-metadata.xml
[INFO] Downloaded: https://repository.apache.org/content/repositories/snapshots/org/apache/tamaya/tamaya-api/maven-metadata.xml
(285 B at 3.1 KB/sec)
[INFO] Uploading: https://repository.apache.org/content/repositories/snapshots/org/apache/tamaya/tamaya-api/0.1-SNAPSHOT/maven-metadata.xml
[INFO] Uploaded: https://repository.apache.org/content/repositories/snapshots/org/apache/tamaya/tamaya-api/0.1-SNAPSHOT/maven-metadata.xml
(987 B at 6.8 KB/sec)
[INFO] Uploading: https://repository.apache.org/content/repositories/snapshots/org/apache/tamaya/tamaya-api/maven-metadata.xml
[INFO] Uploaded: https://repository.apache.org/content/repositories/snapshots/org/apache/tamaya/tamaya-api/maven-metadata.xml
(285 B at 2.0 KB/sec)
[INFO]                                                                         
[INFO] ------------------------------------------------------------------------
[INFO] Building Apache Tamaya - Core Implementation Library 0.1-SNAPSHOT
[INFO] ------------------------------------------------------------------------
[INFO] 
[INFO] --- maven-clean-plugin:2.5:clean (default-clean) @ tamaya-core ---
[INFO] Deleting <https://builds.apache.org/job/Tamaya-Master-branch/ws/core/target>
[INFO] 
[INFO] --- maven-enforcer-plugin:1.3.1:enforce (enforce-versions) @ tamaya-core ---
[INFO] 
[INFO] --- jacoco-maven-plugin:0.7.2.201409121644:prepare-agent (prepare-agent) @ tamaya-core
---
[INFO] argLine set to -javaagent:/home/jenkins/jenkins-slave/maven-repositories/0/org/jacoco/org.jacoco.agent/0.7.2.201409121644/org.jacoco.agent-0.7.2.201409121644-runtime.jar=destfile=<https://builds.apache.org/job/Tamaya-Master-branch/ws/core/target/jacoco.exec>
[INFO] 
[INFO] --- maven-remote-resources-plugin:1.5:process (default) @ tamaya-core ---
[INFO] 
[INFO] --- asciidoctor-maven-plugin:1.5.0:process-asciidoc (output-html) @ tamaya-core ---
[INFO] Rendered <https://builds.apache.org/job/Tamaya-Master-branch/ws/core/src/main/asciidoc/design.adoc>
[INFO] 
[INFO] --- maven-resources-plugin:2.6:resources (default-resources) @ tamaya-core ---
[INFO] Using 'UTF-8' encoding to copy filtered resources.
[INFO] Copying 16 resources
[INFO] Copying 3 resources
[INFO] 
[INFO] --- maven-compiler-plugin:2.1:compile (default-compile) @ tamaya-core ---
[INFO] Compiling 97 source files to <https://builds.apache.org/job/Tamaya-Master-branch/ws/core/target/classes>
[WARNING] <https://builds.apache.org/job/Tamaya-Master-branch/ws/core/src/main/java/org/apache/tamaya/core/internal/logging/AbstractDelegatingLogger.java>:[121,16]
[deprecation] logrb(Level,String,String,String,String) in Logger has been deprecated

[WARNING] <https://builds.apache.org/job/Tamaya-Master-branch/ws/core/src/main/java/org/apache/tamaya/core/internal/logging/AbstractDelegatingLogger.java>:[130,16]
[deprecation] logrb(Level,String,String,String,String,Object) in Logger has been deprecated

[WARNING] <https://builds.apache.org/job/Tamaya-Master-branch/ws/core/src/main/java/org/apache/tamaya/core/internal/logging/AbstractDelegatingLogger.java>:[142,16]
[deprecation] logrb(Level,String,String,String,String,Object[]) in Logger has been deprecated

[WARNING] <https://builds.apache.org/job/Tamaya-Master-branch/ws/core/src/main/java/org/apache/tamaya/core/internal/logging/AbstractDelegatingLogger.java>:[153,16]
[deprecation] logrb(Level,String,String,String,String,Throwable) in Logger has been deprecated

[WARNING] <https://builds.apache.org/job/Tamaya-Master-branch/ws/core/src/main/java/org/apache/tamaya/core/env/ConfiguredSystemProperties.java>:[201,16]
[deprecation] save(OutputStream,String) in Properties has been deprecated

[WARNING] <https://builds.apache.org/job/Tamaya-Master-branch/ws/core/src/main/java/org/apache/tamaya/core/env/ConfiguredSystemProperties.java>:[202,13]
[deprecation] save(OutputStream,String) in Properties has been deprecated

[INFO] 
[INFO] >>> findbugs-maven-plugin:3.0.0:check (findbugs-analyze) @ tamaya-core >>>
[INFO] 
[INFO] --- findbugs-maven-plugin:3.0.0:findbugs (findbugs) @ tamaya-core ---
[FINDBUGS] No report found for mojo findbugs
[INFO] 
[CHECKSTYLE] No report found for mojo check[INFO] <<< findbugs-maven-plugin:3.0.0:check
(findbugs-analyze) @ tamaya-core <<<
[INFO] 
[INFO] --- findbugs-maven-plugin:3.0.0:check (findbugs-analyze) @ tamaya-core ---

[CHECKSTYLE] No report found for mojo check[INFO] 
[INFO] --- maven-resources-plugin:2.6:testResources (default-testResources) @ tamaya-core
---
[INFO] Using 'UTF-8' encoding to copy filtered resources.
[INFO] Copying 17 resources
[INFO] Copying 3 resources

[INFO] 
[INFO] --- maven-compiler-plugin:2.1:testCompile (default-testCompile) @ tamaya-core ---
[INFO] Compiling 17 source files to <https://builds.apache.org/job/Tamaya-Master-branch/ws/core/target/test-classes>
[INFO] -------------------------------------------------------------
[ERROR] COMPILATION ERROR : 
[INFO] -------------------------------------------------------------
[ERROR] <https://builds.apache.org/job/Tamaya-Master-branch/ws/core/src/test/java/org/apache/tamaya/ucs/UC1ReadProperties.java>:[22,36]
error: cannot find symbol

[ERROR]  package org.apache.tamaya.core.config
<https://builds.apache.org/job/Tamaya-Master-branch/ws/core/src/test/java/org/apache/tamaya/samples/annotations/ConfiguredTest.java>:[25,29]
[deprecation] Assert in junit.framework has been deprecated

[ERROR] <https://builds.apache.org/job/Tamaya-Master-branch/ws/core/src/test/java/org/apache/tamaya/ucs/UC1ReadProperties.java>:[70,48]
error: cannot find symbol

[INFO] 3 errors 
[INFO] -------------------------------------------------------------
[INFO] ------------------------------------------------------------------------
[INFO] Reactor Summary:
[INFO] 
[INFO] Apache Tamaya ..................................... SUCCESS [ 17.833 s]
[INFO] Apache Tamaya - Build Tools ....................... SUCCESS [ 13.391 s]
[INFO] Apache Tamaya - API ............................... SUCCESS [ 14.992 s]
[INFO] Apache Tamaya - Core Implementation Library ....... FAILURE [ 11.826 s]
[INFO] Apache Tamaya - Modules ........................... SKIPPED
[INFO] Apache Tamaya Module - CDI Integration ............ SKIPPED
[INFO] Apache Tamaya Module - Management Beans ........... SKIPPED
[INFO] ------------------------------------------------------------------------
[INFO] BUILD FAILURE
[INFO] ------------------------------------------------------------------------
[INFO] Total time: 01:09 min
[INFO] Finished at: 2014-12-07T23:58:39+00:00
[INFO] Final Memory: 69M/474M
[INFO] ------------------------------------------------------------------------
[ERROR] Failed to execute goal org.apache.maven.plugins:maven-compiler-plugin:2.1:testCompile
(default-testCompile) on project tamaya-core: Compilation failure: Compilation failure:
[ERROR] <https://builds.apache.org/job/Tamaya-Master-branch/ws/core/src/test/java/org/apache/tamaya/ucs/UC1ReadProperties.java>:[22,36]
error: cannot find symbol
[ERROR] 
[ERROR] package org.apache.tamaya.core.config
[ERROR] <https://builds.apache.org/job/Tamaya-Master-branch/ws/core/src/test/java/org/apache/tamaya/samples/annotations/ConfiguredTest.java>:[25,29]
[deprecation] Assert in junit.framework has been deprecated
[ERROR] 
[ERROR] <https://builds.apache.org/job/Tamaya-Master-branch/ws/core/src/test/java/org/apache/tamaya/ucs/UC1ReadProperties.java>:[70,48]
error: cannot find symbol
[ERROR] -> [Help 1]
[ERROR] 
[ERROR] To see the full stack trace of the errors, re-run Maven with the -e switch.
[ERROR] Re-run Maven using the -X switch to enable full debug logging.
[ERROR] 
[ERROR] For more information about the errors and possible solutions, please read the following
articles:
[ERROR] [Help 1] http://cwiki.apache.org/confluence/display/MAVEN/MojoFailureException
[ERROR] 
[ERROR] After correcting the problems, you can resume the build with the command
[ERROR]   mvn <goals> -rf :tamaya-core
[JENKINS] Archiving <https://builds.apache.org/job/Tamaya-Master-branch/ws/modules/managed/pom.xml>
to org.apache.tamaya/tamaya-ext-managed/0.1-SNAPSHOT/tamaya-ext-managed-0.1-SNAPSHOT.pom
Sending artifact delta relative to Tamaya-Master-branch » Apache Tamaya Module - Management
Beans #38
Archived 1 artifacts
Archive block size is 32768
Received 0 blocks and 2589 bytes
Compression is 0.0%
Took 1.6 sec
[JENKINS] Archiving <https://builds.apache.org/job/Tamaya-Master-branch/ws/modules/cdi/pom.xml>
to org.apache.tamaya/tamaya-ext-cdi/0.1-SNAPSHOT/tamaya-ext-cdi-0.1-SNAPSHOT.pom
Sending artifact delta relative to Tamaya-Master-branch » Apache Tamaya Module - CDI Integration
#38
Archived 1 artifacts
Archive block size is 32768
Received 0 blocks and 7288 bytes
Compression is 0.0%
Took 72 ms
[JENKINS] Archiving <https://builds.apache.org/job/Tamaya-Master-branch/ws/core/pom.xml>
to org.apache.tamaya/tamaya-core/0.1-SNAPSHOT/tamaya-core-0.1-SNAPSHOT.pom
Sending artifact delta relative to Tamaya-Master-branch » Apache Tamaya - Core Implementation
Library #38
Archived 1 artifacts
Archive block size is 32768
Received 0 blocks and 5479 bytes
Compression is 0.0%
Took 72 ms
[JENKINS] Archiving <https://builds.apache.org/job/Tamaya-Master-branch/ws/pom.xml>
to org.apache.tamaya/tamaya-all/0.1-SNAPSHOT/tamaya-all-0.1-SNAPSHOT.pom
Sending artifact delta relative to Tamaya-Master-branch » Apache Tamaya #38
Archived 1 artifacts
Archive block size is 32768
Received 0 blocks and 22518 bytes
Compression is 0.0%
Took 73 ms
[JENKINS] Archiving <https://builds.apache.org/job/Tamaya-Master-branch/ws/modules/pom.xml>
to org.apache.tamaya/tamaya-modules/0.1-SNAPSHOT/tamaya-modules-0.1-SNAPSHOT.pom
Sending artifact delta relative to Tamaya-Master-branch » Apache Tamaya - Modules #38
Archived 1 artifacts
Archive block size is 32768
Received 0 blocks and 2237 bytes
Compression is 0.0%
Took 71 ms
[JENKINS] Archiving <https://builds.apache.org/job/Tamaya-Master-branch/ws/api/pom.xml>
to org.apache.tamaya/tamaya-api/0.1-SNAPSHOT/tamaya-api-0.1-SNAPSHOT.pom
[JENKINS] Archiving <https://builds.apache.org/job/Tamaya-Master-branch/ws/api/target/tamaya-api-0.1-SNAPSHOT.jar>
to org.apache.tamaya/tamaya-api/0.1-20141207.235820-39/tamaya-api-0.1-20141207.235820-39.jar
Sending artifact delta relative to Tamaya-Master-branch » Apache Tamaya - API #38
Archived 2 artifacts
Archive block size is 32768
Received 0 blocks and 51747 bytes
Compression is 0.0%
Took 0.25 sec
[JENKINS] Archiving <https://builds.apache.org/job/Tamaya-Master-branch/ws/buildtools/pom.xml>
to org.apache.tamaya/buildtools/0.1-SNAPSHOT/buildtools-0.1-SNAPSHOT.pom
[JENKINS] Archiving <https://builds.apache.org/job/Tamaya-Master-branch/ws/buildtools/target/buildtools-0.1-SNAPSHOT.jar>
to org.apache.tamaya/buildtools/0.1-20141207.235804-22/buildtools-0.1-20141207.235804-22.jar
Sending artifact delta relative to Tamaya-Master-branch » Apache Tamaya - Build Tools #38
Archived 2 artifacts
Archive block size is 32768
Received 0 blocks and 7258 bytes
Compression is 0.0%
Took 70 ms
channel stopped

Mime
View raw message