tamaya-commits mailing list archives

Site index · List index
Message view « Date » · « Thread »
Top « Date » · « Thread »
From Apache Jenkins Server <jenk...@builds.apache.org>
Subject Build failed in Jenkins: Tamaya-0.1-branch #1
Date Sun, 28 Dec 2014 15:20:20 GMT
See <https://builds.apache.org/job/Tamaya-0.1-branch/1/>

------------------------------------------
[...truncated 2058 lines...]
[INFO] Copying 3 resources

[INFO] Copying 3 resources
[INFO] 
[INFO] --- maven-compiler-plugin:2.1:testCompile (default-testCompile) @ tamaya-api ---
[INFO] Compiling 4 source files to <https://builds.apache.org/job/Tamaya-0.1-branch/ws/api/target/test-classes>
[INFO] 
[INFO] --- maven-surefire-plugin:2.17:test (default-test) @ tamaya-api ---
[INFO] Surefire report directory: <https://builds.apache.org/job/Tamaya-0.1-branch/ws/api/target/surefire-reports>

-------------------------------------------------------
 T E S T S
-------------------------------------------------------

Results :

Tests run: 0, Failures: 0, Errors: 0, Skipped: 0

[JENKINS] Recording test results
[INFO] 
[INFO] --- maven-jar-plugin:2.5:jar (default-jar) @ tamaya-api ---
[INFO] Building jar: <https://builds.apache.org/job/Tamaya-0.1-branch/ws/api/target/tamaya-api-0.1-SNAPSHOT.jar>
[INFO] 
[INFO] --- maven-site-plugin:3.3:attach-descriptor (attach-descriptor) @ tamaya-api ---
[INFO] 
[INFO] --- maven-javadoc-plugin:2.9.1:jar (attach-javadocs) @ tamaya-api ---
[INFO] Skipping javadoc generation
[INFO] 
[INFO] --- apache-rat-plugin:0.11:check (default) @ tamaya-api ---
[INFO] 51 implicit excludes (use -debug for more details).
[INFO] Exclude: **/target/*
[INFO] Exclude: **/*.iml
[INFO] Exclude: **/.idea/**
[INFO] Exclude: **/*.adoc
[INFO] 33 resources included (use -debug for more details)
Warning:  org.apache.xerces.jaxp.SAXParserImpl$JAXPSAXParser: Property 'http://www.oracle.com/xml/jaxp/properties/entityExpansionLimit'
is not recognized.
Compiler warnings:
  WARNING:  'org.apache.xerces.jaxp.SAXParserImpl: Property 'http://javax.xml.XMLConstants/property/accessExternalDTD'
is not recognized.'
Warning:  org.apache.xerces.parsers.SAXParser: Feature 'http://javax.xml.XMLConstants/feature/secure-processing'
is not recognized.
Warning:  org.apache.xerces.parsers.SAXParser: Property 'http://javax.xml.XMLConstants/property/accessExternalDTD'
is not recognized.
Warning:  org.apache.xerces.parsers.SAXParser: Property 'http://www.oracle.com/xml/jaxp/properties/entityExpansionLimit'
is not recognized.
[INFO] Rat check: Summary of files. Unapproved: 0 unknown: 0 generated: 0 approved: 33 licence.
[CHECKSTYLE] No report found for mojo check[INFO] 
[INFO] --- maven-install-plugin:2.5.2:install (default-install) @ tamaya-api ---

[INFO] Installing <https://builds.apache.org/job/Tamaya-0.1-branch/ws/api/target/tamaya-api-0.1-SNAPSHOT.jar>
to /home/jenkins/jenkins-slave/maven-repositories/1/org/apache/tamaya/tamaya-api/0.1-SNAPSHOT/tamaya-api-0.1-SNAPSHOT.jar
[INFO] Installing <https://builds.apache.org/job/Tamaya-0.1-branch/ws/api/pom.xml> to
/home/jenkins/jenkins-slave/maven-repositories/1/org/apache/tamaya/tamaya-api/0.1-SNAPSHOT/tamaya-api-0.1-SNAPSHOT.pom
[INFO] 
[INFO] --- apache-rat-plugin:0.11:check (default-cli) @ tamaya-api ---
[INFO] 51 implicit excludes (use -debug for more details).
[INFO] Exclude: **/target/*
[INFO] Exclude: **/*.iml
[INFO] Exclude: **/.idea/**
[INFO] Exclude: **/*.adoc
[INFO] 33 resources included (use -debug for more details)
Warning:  org.apache.xerces.jaxp.SAXParserImpl$JAXPSAXParser: Property 'http://www.oracle.com/xml/jaxp/properties/entityExpansionLimit'
is not recognized.
Compiler warnings:
  WARNING:  'org.apache.xerces.jaxp.SAXParserImpl: Property 'http://javax.xml.XMLConstants/property/accessExternalDTD'
is not recognized.'
Warning:  org.apache.xerces.parsers.SAXParser: Feature 'http://javax.xml.XMLConstants/feature/secure-processing'
is not recognized.
Warning:  org.apache.xerces.parsers.SAXParser: Property 'http://javax.xml.XMLConstants/property/accessExternalDTD'
is not recognized.
Warning:  org.apache.xerces.parsers.SAXParser: Property 'http://www.oracle.com/xml/jaxp/properties/entityExpansionLimit'
is not recognized.
[INFO] Rat check: Summary of files. Unapproved: 0 unknown: 0 generated: 0 approved: 33 licence.
[INFO] 
[CHECKSTYLE] No report found for mojo check[INFO] --- maven-enforcer-plugin:1.3.1:enforce
(enforce-versions) @ tamaya-api ---

[INFO] 
[INFO] --- jacoco-maven-plugin:0.7.2.201409121644:prepare-agent (prepare-agent) @ tamaya-api
---
[INFO] argLine set to -javaagent:/home/jenkins/jenkins-slave/maven-repositories/1/org/jacoco/org.jacoco.agent/0.7.2.201409121644/org.jacoco.agent-0.7.2.201409121644-runtime.jar=destfile=<https://builds.apache.org/job/Tamaya-0.1-branch/ws/api/target/jacoco.exec>
[INFO] 
[INFO] --- maven-remote-resources-plugin:1.5:process (default) @ tamaya-api ---
[INFO] 
[INFO] --- maven-resources-plugin:2.6:resources (default-resources) @ tamaya-api ---
[INFO] Using 'UTF-8' encoding to copy filtered resources.
[INFO] skip non existing resourceDirectory <https://builds.apache.org/job/Tamaya-0.1-branch/ws/api/src/main/resources>
[INFO] Copying 3 resources
[INFO] Copying 3 resources
[INFO] 
[INFO] --- maven-compiler-plugin:2.1:compile (default-compile) @ tamaya-api ---
[INFO] Nothing to compile - all classes are up to date
[INFO] 
[INFO] >>> findbugs-maven-plugin:3.0.0:check (findbugs-analyze) @ tamaya-api >>>
[INFO] 
[INFO] --- findbugs-maven-plugin:3.0.0:findbugs (findbugs) @ tamaya-api ---
[FINDBUGS] No report found for mojo findbugs
[CHECKSTYLE] No report found for mojo check[INFO] 
[INFO] <<< findbugs-maven-plugin:3.0.0:check (findbugs-analyze) @ tamaya-api <<<
[INFO] 
[INFO] --- findbugs-maven-plugin:3.0.0:check (findbugs-analyze) @ tamaya-api ---

[CHECKSTYLE] No report found for mojo check[INFO] 
[INFO] --- maven-resources-plugin:2.6:testResources (default-testResources) @ tamaya-api ---
[INFO] Using 'UTF-8' encoding to copy filtered resources.
[INFO] Copying 3 resources

[INFO] Copying 3 resources
[INFO] Copying 3 resources
[INFO] 
[INFO] --- maven-compiler-plugin:2.1:testCompile (default-testCompile) @ tamaya-api ---
[INFO] Nothing to compile - all classes are up to date
[INFO] 
[INFO] --- maven-surefire-plugin:2.17:test (default-test) @ tamaya-api ---
[INFO] Skipping execution of surefire because it has already been run for this configuration
[JENKINS] Recording test results
[INFO] 
[INFO] --- maven-jar-plugin:2.5:jar (default-jar) @ tamaya-api ---
[INFO] 
[INFO] --- maven-site-plugin:3.3:attach-descriptor (attach-descriptor) @ tamaya-api ---
[INFO] 
[INFO] --- maven-javadoc-plugin:2.9.1:jar (attach-javadocs) @ tamaya-api ---
[INFO] Skipping javadoc generation
[INFO] 
[INFO] --- apache-rat-plugin:0.11:check (default) @ tamaya-api ---
[INFO] 51 implicit excludes (use -debug for more details).
[INFO] Exclude: **/target/*
[INFO] Exclude: **/*.iml
[INFO] Exclude: **/.idea/**
[INFO] Exclude: **/*.adoc
[INFO] 33 resources included (use -debug for more details)
Warning:  org.apache.xerces.jaxp.SAXParserImpl$JAXPSAXParser: Property 'http://www.oracle.com/xml/jaxp/properties/entityExpansionLimit'
is not recognized.
Compiler warnings:
  WARNING:  'org.apache.xerces.jaxp.SAXParserImpl: Property 'http://javax.xml.XMLConstants/property/accessExternalDTD'
is not recognized.'
Warning:  org.apache.xerces.parsers.SAXParser: Feature 'http://javax.xml.XMLConstants/feature/secure-processing'
is not recognized.
Warning:  org.apache.xerces.parsers.SAXParser: Property 'http://javax.xml.XMLConstants/property/accessExternalDTD'
is not recognized.
Warning:  org.apache.xerces.parsers.SAXParser: Property 'http://www.oracle.com/xml/jaxp/properties/entityExpansionLimit'
is not recognized.
[INFO] Rat check: Summary of files. Unapproved: 0 unknown: 0 generated: 0 approved: 33 licence.
[CHECKSTYLE] No report found for mojo check[INFO] 
[INFO] --- maven-install-plugin:2.5.2:install (default-install) @ tamaya-api ---
[INFO] Installing <https://builds.apache.org/job/Tamaya-0.1-branch/ws/api/target/tamaya-api-0.1-SNAPSHOT.jar>
to /home/jenkins/jenkins-slave/maven-repositories/1/org/apache/tamaya/tamaya-api/0.1-SNAPSHOT/tamaya-api-0.1-SNAPSHOT.jar

[INFO] Installing <https://builds.apache.org/job/Tamaya-0.1-branch/ws/api/pom.xml> to
/home/jenkins/jenkins-slave/maven-repositories/1/org/apache/tamaya/tamaya-api/0.1-SNAPSHOT/tamaya-api-0.1-SNAPSHOT.pom
[INFO] 
[INFO] --- maven-deploy-plugin:2.8.2:deploy (default-deploy) @ tamaya-api ---
[INFO] Downloading: https://repository.apache.org/content/repositories/snapshots/org/apache/tamaya/tamaya-api/0.1-SNAPSHOT/maven-metadata.xml
[INFO] Downloaded: https://repository.apache.org/content/repositories/snapshots/org/apache/tamaya/tamaya-api/0.1-SNAPSHOT/maven-metadata.xml
(774 B at 1.2 KB/sec)
[INFO] Uploading: https://repository.apache.org/content/repositories/snapshots/org/apache/tamaya/tamaya-api/0.1-SNAPSHOT/tamaya-api-0.1-20141228.152014-70.jar
[INFO] Uploaded: https://repository.apache.org/content/repositories/snapshots/org/apache/tamaya/tamaya-api/0.1-SNAPSHOT/tamaya-api-0.1-20141228.152014-70.jar
(38 KB at 269.1 KB/sec)
[INFO] Uploading: https://repository.apache.org/content/repositories/snapshots/org/apache/tamaya/tamaya-api/0.1-SNAPSHOT/tamaya-api-0.1-20141228.152014-70.pom
[INFO] Uploaded: https://repository.apache.org/content/repositories/snapshots/org/apache/tamaya/tamaya-api/0.1-SNAPSHOT/tamaya-api-0.1-20141228.152014-70.pom
(3 KB at 6.3 KB/sec)
[INFO] Downloading: https://repository.apache.org/content/repositories/snapshots/org/apache/tamaya/tamaya-api/maven-metadata.xml
[INFO] Downloaded: https://repository.apache.org/content/repositories/snapshots/org/apache/tamaya/tamaya-api/maven-metadata.xml
(323 B at 1.3 KB/sec)
[INFO] Uploading: https://repository.apache.org/content/repositories/snapshots/org/apache/tamaya/tamaya-api/0.1-SNAPSHOT/maven-metadata.xml
[INFO] Uploaded: https://repository.apache.org/content/repositories/snapshots/org/apache/tamaya/tamaya-api/0.1-SNAPSHOT/maven-metadata.xml
(774 B at 4.0 KB/sec)
[INFO] Uploading: https://repository.apache.org/content/repositories/snapshots/org/apache/tamaya/tamaya-api/maven-metadata.xml
[INFO] Uploaded: https://repository.apache.org/content/repositories/snapshots/org/apache/tamaya/tamaya-api/maven-metadata.xml
(323 B at 2.0 KB/sec)
[INFO]                                                                         
[INFO] ------------------------------------------------------------------------
[INFO] Building Apache Tamaya - Core Implementation Library 0.1-SNAPSHOT
[INFO] ------------------------------------------------------------------------
[INFO] 
[INFO] --- maven-clean-plugin:2.5:clean (default-clean) @ tamaya-core ---
[INFO] 
[INFO] --- maven-enforcer-plugin:1.3.1:enforce (enforce-versions) @ tamaya-core ---
[INFO] 
[INFO] --- jacoco-maven-plugin:0.7.2.201409121644:prepare-agent (prepare-agent) @ tamaya-core
---
[INFO] argLine set to -javaagent:/home/jenkins/jenkins-slave/maven-repositories/1/org/jacoco/org.jacoco.agent/0.7.2.201409121644/org.jacoco.agent-0.7.2.201409121644-runtime.jar=destfile=<https://builds.apache.org/job/Tamaya-0.1-branch/ws/core/target/jacoco.exec>
[INFO] 
[INFO] --- maven-remote-resources-plugin:1.5:process (default) @ tamaya-core ---
[INFO] 
[INFO] --- maven-resources-plugin:2.6:resources (default-resources) @ tamaya-core ---
[INFO] Using 'UTF-8' encoding to copy filtered resources.
[INFO] Copying 10 resources
[INFO] Copying 3 resources
[INFO] 
[INFO] --- maven-compiler-plugin:2.1:compile (default-compile) @ tamaya-core ---
[INFO] Compiling 93 source files to <https://builds.apache.org/job/Tamaya-0.1-branch/ws/core/target/classes>
[INFO] -------------------------------------------------------------
[ERROR] COMPILATION ERROR : 
[INFO] -------------------------------------------------------------
[ERROR] <https://builds.apache.org/job/Tamaya-0.1-branch/ws/core/src/main/java/org/apache/tamaya/core/internal/logging/AbstractDelegatingLogger.java>:[121,16]
[deprecation] logrb(Level,String,String,String,String) in Logger has been deprecated

[ERROR] <https://builds.apache.org/job/Tamaya-0.1-branch/ws/core/src/main/java/org/apache/tamaya/core/internal/logging/AbstractDelegatingLogger.java>:[130,16]
[deprecation] logrb(Level,String,String,String,String,Object) in Logger has been deprecated

[ERROR] <https://builds.apache.org/job/Tamaya-0.1-branch/ws/core/src/main/java/org/apache/tamaya/core/internal/logging/AbstractDelegatingLogger.java>:[142,16]
[deprecation] logrb(Level,String,String,String,String,Object[]) in Logger has been deprecated

[ERROR] <https://builds.apache.org/job/Tamaya-0.1-branch/ws/core/src/main/java/org/apache/tamaya/core/internal/logging/AbstractDelegatingLogger.java>:[153,16]
[deprecation] logrb(Level,String,String,String,String,Throwable) in Logger has been deprecated

[ERROR] <https://builds.apache.org/job/Tamaya-0.1-branch/ws/core/src/main/java/org/apache/tamaya/core/properties/BuildablePropertySource.java>:[29,0]
error: BuildablePropertySource is not abstract and does not override abstract method removeForUpdate(ConfigChangeSetCallback)
in PropertySource

[ERROR] <https://builds.apache.org/job/Tamaya-0.1-branch/ws/core/src/main/java/org/apache/tamaya/core/properties/ContextualPropertySource.java>:[30,0]
error: ContextualPropertySource is not abstract and does not override abstract method removeForUpdate(ConfigChangeSetCallback)
in PropertySource

[ERROR] <https://builds.apache.org/job/Tamaya-0.1-branch/ws/core/src/main/java/org/apache/tamaya/core/properties/ValueFilteredPropertySource.java>:[32,0]
error: ValueFilteredPropertySource is not abstract and does not override abstract method removeForUpdate(ConfigChangeSetCallback)
in PropertySource

[ERROR] <https://builds.apache.org/job/Tamaya-0.1-branch/ws/core/src/main/java/org/apache/tamaya/core/properties/DelegatingPropertySource.java>:[36,0]
error: DelegatingPropertySource is not abstract and does not override abstract method removeForUpdate(ConfigChangeSetCallback)
in PropertySource

[ERROR] <https://builds.apache.org/job/Tamaya-0.1-branch/ws/core/src/main/java/org/apache/tamaya/core/properties/ReplacingPropertySource.java>:[30,0]
error: ReplacingPropertySource is not abstract and does not override abstract method removeForUpdate(ConfigChangeSetCallback)
in PropertySource

[ERROR] <https://builds.apache.org/job/Tamaya-0.1-branch/ws/core/src/main/java/org/apache/tamaya/core/internal/config/FileConfiguration.java>:[34,0]
error: FileConfiguration is not abstract and does not override abstract method removeForUpdate(ConfigChangeSetCallback)
in PropertySource

[ERROR] <https://builds.apache.org/job/Tamaya-0.1-branch/ws/core/src/main/java/org/apache/tamaya/core/properties/FreezedPropertySource.java>:[30,6]
error: FreezedPropertySource is not abstract and does not override abstract method removeForUpdate(ConfigChangeSetCallback)
in PropertySource

[INFO] 11 errors 
[INFO] -------------------------------------------------------------
[INFO] ------------------------------------------------------------------------
[INFO] Reactor Summary:
[INFO] 
[INFO] Apache Tamaya ..................................... SUCCESS [ 11.840 s]
[INFO] Apache Tamaya - Build Tools ....................... SUCCESS [  6.773 s]
[INFO] Apache Tamaya - API ............................... SUCCESS [  7.499 s]
[INFO] Apache Tamaya - Core Implementation Library ....... FAILURE [  2.443 s]
[INFO] ------------------------------------------------------------------------
[INFO] BUILD FAILURE
[INFO] ------------------------------------------------------------------------
[INFO] Total time: 31.495 s
[INFO] Finished at: 2014-12-28T15:20:19+00:00
[INFO] Final Memory: 47M/478M
[INFO] ------------------------------------------------------------------------
[ERROR] Failed to execute goal org.apache.maven.plugins:maven-compiler-plugin:2.1:compile
(default-compile) on project tamaya-core: Compilation failure: Compilation failure:
[ERROR] <https://builds.apache.org/job/Tamaya-0.1-branch/ws/core/src/main/java/org/apache/tamaya/core/internal/logging/AbstractDelegatingLogger.java>:[121,16]
[deprecation] logrb(Level,String,String,String,String) in Logger has been deprecated
[ERROR] 
[ERROR] <https://builds.apache.org/job/Tamaya-0.1-branch/ws/core/src/main/java/org/apache/tamaya/core/internal/logging/AbstractDelegatingLogger.java>:[130,16]
[deprecation] logrb(Level,String,String,String,String,Object) in Logger has been deprecated
[ERROR] 
[ERROR] <https://builds.apache.org/job/Tamaya-0.1-branch/ws/core/src/main/java/org/apache/tamaya/core/internal/logging/AbstractDelegatingLogger.java>:[142,16]
[deprecation] logrb(Level,String,String,String,String,Object[]) in Logger has been deprecated
[ERROR] 
[ERROR] <https://builds.apache.org/job/Tamaya-0.1-branch/ws/core/src/main/java/org/apache/tamaya/core/internal/logging/AbstractDelegatingLogger.java>:[153,16]
[deprecation] logrb(Level,String,String,String,String,Throwable) in Logger has been deprecated
[ERROR] 
[ERROR] <https://builds.apache.org/job/Tamaya-0.1-branch/ws/core/src/main/java/org/apache/tamaya/core/properties/BuildablePropertySource.java>:[29,0]
error: BuildablePropertySource is not abstract and does not override abstract method removeForUpdate(ConfigChangeSetCallback)
in PropertySource
[ERROR] 
[ERROR] <https://builds.apache.org/job/Tamaya-0.1-branch/ws/core/src/main/java/org/apache/tamaya/core/properties/ContextualPropertySource.java>:[30,0]
error: ContextualPropertySource is not abstract and does not override abstract method removeForUpdate(ConfigChangeSetCallback)
in PropertySource
[ERROR] 
[ERROR] <https://builds.apache.org/job/Tamaya-0.1-branch/ws/core/src/main/java/org/apache/tamaya/core/properties/ValueFilteredPropertySource.java>:[32,0]
error: ValueFilteredPropertySource is not abstract and does not override abstract method removeForUpdate(ConfigChangeSetCallback)
in PropertySource
[ERROR] 
[ERROR] <https://builds.apache.org/job/Tamaya-0.1-branch/ws/core/src/main/java/org/apache/tamaya/core/properties/DelegatingPropertySource.java>:[36,0]
error: DelegatingPropertySource is not abstract and does not override abstract method removeForUpdate(ConfigChangeSetCallback)
in PropertySource
[ERROR] 
[ERROR] <https://builds.apache.org/job/Tamaya-0.1-branch/ws/core/src/main/java/org/apache/tamaya/core/properties/ReplacingPropertySource.java>:[30,0]
error: ReplacingPropertySource is not abstract and does not override abstract method removeForUpdate(ConfigChangeSetCallback)
in PropertySource
[ERROR] 
[ERROR] <https://builds.apache.org/job/Tamaya-0.1-branch/ws/core/src/main/java/org/apache/tamaya/core/internal/config/FileConfiguration.java>:[34,0]
error: FileConfiguration is not abstract and does not override abstract method removeForUpdate(ConfigChangeSetCallback)
in PropertySource
[ERROR] 
[ERROR] <https://builds.apache.org/job/Tamaya-0.1-branch/ws/core/src/main/java/org/apache/tamaya/core/properties/FreezedPropertySource.java>:[30,6]
error: FreezedPropertySource is not abstract and does not override abstract method removeForUpdate(ConfigChangeSetCallback)
in PropertySource
[ERROR] -> [Help 1]
[ERROR] 
[ERROR] To see the full stack trace of the errors, re-run Maven with the -e switch.
[ERROR] Re-run Maven using the -X switch to enable full debug logging.
[ERROR] 
[ERROR] For more information about the errors and possible solutions, please read the following
articles:
[ERROR] [Help 1] http://cwiki.apache.org/confluence/display/MAVEN/MojoFailureException
[ERROR] 
[ERROR] After correcting the problems, you can resume the build with the command
[ERROR]   mvn <goals> -rf :tamaya-core
[JENKINS] Archiving <https://builds.apache.org/job/Tamaya-0.1-branch/ws/core/pom.xml>
to org.apache.tamaya/tamaya-core/0.1-SNAPSHOT/tamaya-core-0.1-SNAPSHOT.pom
No prior successful build to compare, so performing full copy of artifacts
[JENKINS] Archiving <https://builds.apache.org/job/Tamaya-0.1-branch/ws/pom.xml> to
org.apache.tamaya/tamaya-all/0.1-SNAPSHOT/tamaya-all-0.1-SNAPSHOT.pom
No prior successful build to compare, so performing full copy of artifacts
[JENKINS] Archiving <https://builds.apache.org/job/Tamaya-0.1-branch/ws/api/pom.xml>
to org.apache.tamaya/tamaya-api/0.1-SNAPSHOT/tamaya-api-0.1-SNAPSHOT.pom
[JENKINS] Archiving <https://builds.apache.org/job/Tamaya-0.1-branch/ws/api/target/tamaya-api-0.1-SNAPSHOT.jar>
to org.apache.tamaya/tamaya-api/0.1-20141228.152014-70/tamaya-api-0.1-20141228.152014-70.jar
No prior successful build to compare, so performing full copy of artifacts
[JENKINS] Archiving <https://builds.apache.org/job/Tamaya-0.1-branch/ws/buildtools/pom.xml>
to org.apache.tamaya/buildtools/0.1-SNAPSHOT/buildtools-0.1-SNAPSHOT.pom
[JENKINS] Archiving <https://builds.apache.org/job/Tamaya-0.1-branch/ws/buildtools/target/buildtools-0.1-SNAPSHOT.jar>
to org.apache.tamaya/buildtools/0.1-20141228.152007-53/buildtools-0.1-20141228.152007-53.jar
No prior successful build to compare, so performing full copy of artifacts
channel stopped

Mime
View raw message