tamaya-commits mailing list archives

Site index · List index
Message view « Date » · « Thread »
Top « Date » · « Thread »
From Apache Jenkins Server <jenk...@builds.apache.org>
Subject Build failed in Jenkins: Tamaya-Master-branch #47
Date Sat, 13 Dec 2014 00:59:15 GMT
See <https://builds.apache.org/job/Tamaya-Master-branch/47/changes>

Changes:

[anatole] TAMAYA-3:

------------------------------------------
[...truncated 874 lines...]
[INFO] 
[INFO] --- maven-remote-resources-plugin:1.5:process (default) @ tamaya-integration-all ---
[INFO] 
[INFO] >>> findbugs-maven-plugin:3.0.0:check (findbugs-analyze) @ tamaya-integration-all
>>>
[INFO] 
[INFO] --- findbugs-maven-plugin:3.0.0:findbugs (findbugs) @ tamaya-integration-all ---
[FINDBUGS] No report found for mojo findbugs
[CHECKSTYLE] No report found for mojo check[INFO] 
[INFO] <<< findbugs-maven-plugin:3.0.0:check (findbugs-analyze) @ tamaya-integration-all
<<<
[INFO] 
[INFO] --- findbugs-maven-plugin:3.0.0:check (findbugs-analyze) @ tamaya-integration-all ---

[CHECKSTYLE] No report found for mojo check[INFO] 
[INFO] --- maven-site-plugin:3.3:attach-descriptor (attach-descriptor) @ tamaya-integration-all
---

[INFO] 
[INFO] --- maven-javadoc-plugin:2.9.1:jar (attach-javadocs) @ tamaya-integration-all ---
[INFO] Skipping javadoc generation
[INFO] 
[INFO] --- apache-rat-plugin:0.11:check (default) @ tamaya-integration-all ---
[INFO] RAT will not execute since it is configured to be skipped via system property 'rat.skip'.
[CHECKSTYLE] No report found for mojo check[INFO] 
[INFO] --- maven-install-plugin:2.5.2:install (default-install) @ tamaya-integration-all ---
[INFO] Installing <https://builds.apache.org/job/Tamaya-Master-branch/ws/modules/integration/pom.xml>
to /home/jenkins/jenkins-slave/maven-repositories/0/org/apache/tamaya/integration/tamaya-integration-all/0.1-SNAPSHOT/tamaya-integration-all-0.1-SNAPSHOT.pom

[INFO] 
[INFO] --- maven-enforcer-plugin:1.3.1:enforce (enforce-versions) @ tamaya-integration-all
---
[INFO] 
[INFO] --- maven-remote-resources-plugin:1.5:process (default) @ tamaya-integration-all ---
[INFO] 
[INFO] >>> findbugs-maven-plugin:3.0.0:check (findbugs-analyze) @ tamaya-integration-all
>>>
[INFO] 
[INFO] --- findbugs-maven-plugin:3.0.0:findbugs (findbugs) @ tamaya-integration-all ---
[FINDBUGS] No report found for mojo findbugs
[INFO] 
[INFO] <<< findbugs-maven-plugin:3.0.0:check (findbugs-analyze) @ tamaya-integration-all
<<<
[CHECKSTYLE] No report found for mojo check[INFO] 
[INFO] --- findbugs-maven-plugin:3.0.0:check (findbugs-analyze) @ tamaya-integration-all ---

[CHECKSTYLE] No report found for mojo check[INFO] 
[INFO] --- maven-site-plugin:3.3:attach-descriptor (attach-descriptor) @ tamaya-integration-all
---

[INFO] 
[INFO] --- maven-javadoc-plugin:2.9.1:jar (attach-javadocs) @ tamaya-integration-all ---
[INFO] Skipping javadoc generation
[INFO] 
[INFO] --- apache-rat-plugin:0.11:check (default) @ tamaya-integration-all ---
[INFO] RAT will not execute since it is configured to be skipped via system property 'rat.skip'.
[CHECKSTYLE] No report found for mojo check[INFO] 
[INFO] --- maven-install-plugin:2.5.2:install (default-install) @ tamaya-integration-all ---
[INFO] Installing <https://builds.apache.org/job/Tamaya-Master-branch/ws/modules/integration/pom.xml>
to /home/jenkins/jenkins-slave/maven-repositories/0/org/apache/tamaya/integration/tamaya-integration-all/0.1-SNAPSHOT/tamaya-integration-all-0.1-SNAPSHOT.pom

[INFO] 
[INFO] --- maven-deploy-plugin:2.8.2:deploy (default-deploy) @ tamaya-integration-all ---
[INFO] Downloading: https://repository.apache.org/content/repositories/snapshots/org/apache/tamaya/integration/tamaya-integration-all/0.1-SNAPSHOT/maven-metadata.xml
[INFO] Downloaded: https://repository.apache.org/content/repositories/snapshots/org/apache/tamaya/integration/tamaya-integration-all/0.1-SNAPSHOT/maven-metadata.xml
(624 B at 6.0 KB/sec)
[INFO] Uploading: https://repository.apache.org/content/repositories/snapshots/org/apache/tamaya/integration/tamaya-integration-all/0.1-SNAPSHOT/tamaya-integration-all-0.1-20141213.005904-4.pom
[INFO] Uploaded: https://repository.apache.org/content/repositories/snapshots/org/apache/tamaya/integration/tamaya-integration-all/0.1-SNAPSHOT/tamaya-integration-all-0.1-20141213.005904-4.pom
(2 KB at 8.1 KB/sec)
[INFO] Downloading: https://repository.apache.org/content/repositories/snapshots/org/apache/tamaya/integration/tamaya-integration-all/maven-metadata.xml
[INFO] Downloaded: https://repository.apache.org/content/repositories/snapshots/org/apache/tamaya/integration/tamaya-integration-all/maven-metadata.xml
(309 B at 3.0 KB/sec)
[INFO] Uploading: https://repository.apache.org/content/repositories/snapshots/org/apache/tamaya/integration/tamaya-integration-all/0.1-SNAPSHOT/maven-metadata.xml
[INFO] Uploaded: https://repository.apache.org/content/repositories/snapshots/org/apache/tamaya/integration/tamaya-integration-all/0.1-SNAPSHOT/maven-metadata.xml
(624 B at 4.3 KB/sec)
[INFO] Uploading: https://repository.apache.org/content/repositories/snapshots/org/apache/tamaya/integration/tamaya-integration-all/maven-metadata.xml
[INFO] Uploaded: https://repository.apache.org/content/repositories/snapshots/org/apache/tamaya/integration/tamaya-integration-all/maven-metadata.xml
(309 B at 1.9 KB/sec)
[INFO]                                                                         
[INFO] ------------------------------------------------------------------------
[INFO] Building Apache Tamaya Modules Integration - CDI 0.1-SNAPSHOT
[INFO] ------------------------------------------------------------------------
[INFO] Downloading: http://repository.apache.org/snapshots/org/apache/geronimo/specs/geronimo-jcdi_1.1_spec/1.0-SNAPSHOT/maven-metadata.xml
[INFO] Downloading: http://repository.apache.org/snapshots/org/apache/geronimo/specs/geronimo-jcdi_1.1_spec/1.0-SNAPSHOT/maven-metadata.xml
[INFO] Downloaded: http://repository.apache.org/snapshots/org/apache/geronimo/specs/geronimo-jcdi_1.1_spec/1.0-SNAPSHOT/maven-metadata.xml
(1007 B at 3.3 KB/sec)
[INFO] Downloaded: http://repository.apache.org/snapshots/org/apache/geronimo/specs/geronimo-jcdi_1.1_spec/1.0-SNAPSHOT/maven-metadata.xml
(1007 B at 3.3 KB/sec)
[INFO] Downloading: http://repository.apache.org/snapshots/org/apache/geronimo/specs/geronimo-interceptor_1.2_spec/1.0-SNAPSHOT/maven-metadata.xml
[INFO] Downloading: http://repository.apache.org/snapshots/org/apache/geronimo/specs/geronimo-interceptor_1.2_spec/1.0-SNAPSHOT/maven-metadata.xml
[INFO] Downloaded: http://repository.apache.org/snapshots/org/apache/geronimo/specs/geronimo-interceptor_1.2_spec/1.0-SNAPSHOT/maven-metadata.xml
(1010 B at 3.7 KB/sec)
[INFO] Downloaded: http://repository.apache.org/snapshots/org/apache/geronimo/specs/geronimo-interceptor_1.2_spec/1.0-SNAPSHOT/maven-metadata.xml
(1010 B at 3.7 KB/sec)
[INFO] Downloading: http://repository.apache.org/snapshots/org/apache/geronimo/specs/geronimo-annotation_1.2_spec/1.0.MR2-SNAPSHOT/maven-metadata.xml
[INFO] Downloading: http://repository.apache.org/snapshots/org/apache/geronimo/specs/geronimo-annotation_1.2_spec/1.0.MR2-SNAPSHOT/maven-metadata.xml
[INFO] Downloaded: http://repository.apache.org/snapshots/org/apache/geronimo/specs/geronimo-annotation_1.2_spec/1.0.MR2-SNAPSHOT/maven-metadata.xml
(2 KB at 3.6 KB/sec)
[INFO] Downloaded: http://repository.apache.org/snapshots/org/apache/geronimo/specs/geronimo-annotation_1.2_spec/1.0.MR2-SNAPSHOT/maven-metadata.xml
(2 KB at 3.5 KB/sec)
[INFO] Downloading: http://repository.apache.org/snapshots/org/apache/openwebbeans/openwebbeans-impl/1.5.0-SNAPSHOT/maven-metadata.xml
[INFO] Downloading: http://repository.apache.org/snapshots/org/apache/openwebbeans/openwebbeans-impl/1.5.0-SNAPSHOT/maven-metadata.xml
[INFO] Downloaded: http://repository.apache.org/snapshots/org/apache/openwebbeans/openwebbeans-impl/1.5.0-SNAPSHOT/maven-metadata.xml
(377 B at 1.2 KB/sec)
[INFO] Downloaded: http://repository.apache.org/snapshots/org/apache/openwebbeans/openwebbeans-impl/1.5.0-SNAPSHOT/maven-metadata.xml
(377 B at 1.2 KB/sec)
[INFO] Downloading: http://repository.apache.org/snapshots/org/apache/openwebbeans/openwebbeans/1.5.0-SNAPSHOT/maven-metadata.xml
[INFO] Downloading: http://repository.apache.org/snapshots/org/apache/openwebbeans/openwebbeans/1.5.0-SNAPSHOT/maven-metadata.xml
[INFO] Downloaded: http://repository.apache.org/snapshots/org/apache/openwebbeans/openwebbeans/1.5.0-SNAPSHOT/maven-metadata.xml
(372 B at 2.1 KB/sec)
[INFO] Downloaded: http://repository.apache.org/snapshots/org/apache/openwebbeans/openwebbeans/1.5.0-SNAPSHOT/maven-metadata.xml
(372 B at 2.1 KB/sec)
[INFO] Downloading: http://repository.apache.org/snapshots/org/apache/openwebbeans/openwebbeans-spi/1.5.0-SNAPSHOT/maven-metadata.xml
[INFO] Downloading: http://repository.apache.org/snapshots/org/apache/openwebbeans/openwebbeans-spi/1.5.0-SNAPSHOT/maven-metadata.xml
[INFO] Downloaded: http://repository.apache.org/snapshots/org/apache/openwebbeans/openwebbeans-spi/1.5.0-SNAPSHOT/maven-metadata.xml
(376 B at 1.9 KB/sec)
[INFO] Downloaded: http://repository.apache.org/snapshots/org/apache/openwebbeans/openwebbeans-spi/1.5.0-SNAPSHOT/maven-metadata.xml
(376 B at 1.9 KB/sec)
[INFO] Downloading: http://repository.apache.org/snapshots/org/apache/openwebbeans/openwebbeans-resource/1.5.0-SNAPSHOT/maven-metadata.xml
[INFO] Downloading: http://repository.apache.org/snapshots/org/apache/openwebbeans/openwebbeans-resource/1.5.0-SNAPSHOT/maven-metadata.xml
[INFO] Downloaded: http://repository.apache.org/snapshots/org/apache/openwebbeans/openwebbeans-resource/1.5.0-SNAPSHOT/maven-metadata.xml
(381 B at 1.2 KB/sec)
[INFO] Downloaded: http://repository.apache.org/snapshots/org/apache/openwebbeans/openwebbeans-resource/1.5.0-SNAPSHOT/maven-metadata.xml
(381 B at 1.2 KB/sec)
[INFO] 
[INFO] --- maven-clean-plugin:2.5:clean (default-clean) @ tamaya-cdi ---
[INFO] Deleting <https://builds.apache.org/job/Tamaya-Master-branch/ws/modules/integration/cdi/target>
[INFO] 
[INFO] --- maven-enforcer-plugin:1.3.1:enforce (enforce-versions) @ tamaya-cdi ---
[INFO] 
[INFO] --- jacoco-maven-plugin:0.7.2.201409121644:prepare-agent (prepare-agent) @ tamaya-cdi
---
[INFO] argLine set to -javaagent:/home/jenkins/jenkins-slave/maven-repositories/0/org/jacoco/org.jacoco.agent/0.7.2.201409121644/org.jacoco.agent-0.7.2.201409121644-runtime.jar=destfile=<https://builds.apache.org/job/Tamaya-Master-branch/ws/modules/integration/cdi/target/jacoco.exec>
[INFO] 
[INFO] --- maven-remote-resources-plugin:1.5:process (default) @ tamaya-cdi ---
[INFO] 
[INFO] --- maven-resources-plugin:2.6:resources (default-resources) @ tamaya-cdi ---
[INFO] Using 'UTF-8' encoding to copy filtered resources.
[INFO] Copying 2 resources
[INFO] Copying 3 resources
[INFO] 
[INFO] --- maven-compiler-plugin:2.1:compile (default-compile) @ tamaya-cdi ---
[INFO] Compiling 1 source file to <https://builds.apache.org/job/Tamaya-Master-branch/ws/modules/integration/cdi/target/classes>
[INFO] 
[INFO] >>> findbugs-maven-plugin:3.0.0:check (findbugs-analyze) @ tamaya-cdi >>>
[INFO] 
[INFO] --- findbugs-maven-plugin:3.0.0:findbugs (findbugs) @ tamaya-cdi ---
[FINDBUGS] No report found for mojo findbugs
[INFO] 
[INFO] <<< findbugs-maven-plugin:3.0.0:check (findbugs-analyze) @ tamaya-cdi <<<
[CHECKSTYLE] No report found for mojo check[INFO] 
[INFO] --- findbugs-maven-plugin:3.0.0:check (findbugs-analyze) @ tamaya-cdi ---

[CHECKSTYLE] No report found for mojo check[INFO] 
[INFO] --- maven-resources-plugin:2.6:testResources (default-testResources) @ tamaya-cdi ---
[INFO] Using 'UTF-8' encoding to copy filtered resources.
[INFO] Copying 1 resource
[INFO] Copying 3 resources

[INFO] 
[INFO] --- maven-compiler-plugin:2.1:testCompile (default-testCompile) @ tamaya-cdi ---
[INFO] Compiling 3 source files to <https://builds.apache.org/job/Tamaya-Master-branch/ws/modules/integration/cdi/target/test-classes>
[INFO] -------------------------------------------------------------
[ERROR] COMPILATION ERROR : 
[INFO] -------------------------------------------------------------
[ERROR] <https://builds.apache.org/job/Tamaya-Master-branch/ws/modules/integration/cdi/src/test/java/main/java/metamodel/ext/cdi/TestConfigProvider.java>:[23,24]
error: cannot find symbol

[ERROR]  package org.apache.tamaya
<https://builds.apache.org/job/Tamaya-Master-branch/ws/modules/integration/cdi/src/test/java/main/java/metamodel/ext/cdi/TestConfigProvider.java>:[32,7]
error: TestConfigProvider is not abstract and does not override abstract method reload() in
ConfigurationProviderSpi

[ERROR] <https://builds.apache.org/job/Tamaya-Master-branch/ws/modules/integration/cdi/src/test/java/main/java/metamodel/ext/cdi/TestConfigProvider.java>:[53,21]
error: cannot find symbol

[INFO] 3 errors 
[INFO] -------------------------------------------------------------
[INFO] ------------------------------------------------------------------------
[INFO] Reactor Summary:
[INFO] 
[INFO] Apache Tamaya ..................................... SUCCESS [  9.985 s]
[INFO] Apache Tamaya - Build Tools ....................... SUCCESS [  6.348 s]
[INFO] Apache Tamaya - API ............................... SUCCESS [  8.925 s]
[INFO] Apache Tamaya - Core Implementation Library ....... SUCCESS [ 23.349 s]
[INFO] Apache Tamaya Modules ............................. SUCCESS [  4.566 s]
[INFO] Apache Tamaya Modules Metamodels .................. SUCCESS [  4.511 s]
[INFO] Apache Tamaya Modules Metamodels - Simple ......... SUCCESS [  6.147 s]
[INFO] Apache Tamaya Modules Integration ................. SUCCESS [  4.491 s]
[INFO] Apache Tamaya Modules Integration - CDI ........... FAILURE [  4.757 s]
[INFO] ------------------------------------------------------------------------
[INFO] BUILD FAILURE
[INFO] ------------------------------------------------------------------------
[INFO] Total time: 01:21 min
[INFO] Finished at: 2014-12-13T00:59:12+00:00
[INFO] Final Memory: 71M/420M
[INFO] ------------------------------------------------------------------------
[ERROR] Failed to execute goal org.apache.maven.plugins:maven-compiler-plugin:2.1:testCompile
(default-testCompile) on project tamaya-cdi: Compilation failure: Compilation failure:
[ERROR] <https://builds.apache.org/job/Tamaya-Master-branch/ws/modules/integration/cdi/src/test/java/main/java/metamodel/ext/cdi/TestConfigProvider.java>:[23,24]
error: cannot find symbol
[ERROR] 
[ERROR] package org.apache.tamaya
[ERROR] <https://builds.apache.org/job/Tamaya-Master-branch/ws/modules/integration/cdi/src/test/java/main/java/metamodel/ext/cdi/TestConfigProvider.java>:[32,7]
error: TestConfigProvider is not abstract and does not override abstract method reload() in
ConfigurationProviderSpi
[ERROR] 
[ERROR] <https://builds.apache.org/job/Tamaya-Master-branch/ws/modules/integration/cdi/src/test/java/main/java/metamodel/ext/cdi/TestConfigProvider.java>:[53,21]
error: cannot find symbol
[ERROR] -> [Help 1]
[ERROR] 
[ERROR] To see the full stack trace of the errors, re-run Maven with the -e switch.
[ERROR] Re-run Maven using the -X switch to enable full debug logging.
[ERROR] 
[ERROR] For more information about the errors and possible solutions, please read the following
articles:
[ERROR] [Help 1] http://cwiki.apache.org/confluence/display/MAVEN/MojoFailureException
[ERROR] 
[ERROR] After correcting the problems, you can resume the build with the command
[ERROR]   mvn <goals> -rf :tamaya-cdi
[JENKINS] Archiving <https://builds.apache.org/job/Tamaya-Master-branch/ws/modules/integration/cdi/pom.xml>
to org.apache.tamaya.integration/tamaya-cdi/0.1-SNAPSHOT/tamaya-cdi-0.1-SNAPSHOT.pom
Sending artifact delta relative to Tamaya-Master-branch » Apache Tamaya Modules Integration
- CDI #45
Archived 1 artifacts
Archive block size is 32768
Received 0 blocks and 7308 bytes
Compression is 0.0%
Took 71 ms
[JENKINS] Archiving <https://builds.apache.org/job/Tamaya-Master-branch/ws/modules/integration/pom.xml>
to org.apache.tamaya.integration/tamaya-integration-all/0.1-SNAPSHOT/tamaya-integration-all-0.1-SNAPSHOT.pom
Sending artifact delta relative to Tamaya-Master-branch » Apache Tamaya Modules Integration
#45
Archived 1 artifacts
Archive block size is 32768
Received 0 blocks and 1892 bytes
Compression is 0.0%
Took 69 ms
[JENKINS] Archiving <https://builds.apache.org/job/Tamaya-Master-branch/ws/modules/metamodels/simple/pom.xml>
to org.apache.tamaya.metamodels/tamaya-metamodel-simple/0.1-SNAPSHOT/tamaya-metamodel-simple-0.1-SNAPSHOT.pom
[JENKINS] Archiving <https://builds.apache.org/job/Tamaya-Master-branch/ws/modules/metamodels/simple/target/tamaya-metamodel-simple-0.1-SNAPSHOT.jar>
to org.apache.tamaya.metamodels/tamaya-metamodel-simple/0.1-20141213.005858-4/tamaya-metamodel-simple-0.1-20141213.005858-4.jar
Sending artifact delta relative to Tamaya-Master-branch » Apache Tamaya Modules Metamodels
- Simple #45
Archived 2 artifacts
Archive block size is 32768
Received 0 blocks and 9309 bytes
Compression is 0.0%
Took 72 ms
[JENKINS] Archiving <https://builds.apache.org/job/Tamaya-Master-branch/ws/core/pom.xml>
to org.apache.tamaya/tamaya-core/0.1-SNAPSHOT/tamaya-core-0.1-SNAPSHOT.pom
[JENKINS] Archiving <https://builds.apache.org/job/Tamaya-Master-branch/ws/core/target/tamaya-core-0.1-SNAPSHOT.jar>
to org.apache.tamaya/tamaya-core/0.1-20141213.005841-40/tamaya-core-0.1-20141213.005841-40.jar
Sending artifact delta relative to Tamaya-Master-branch » Apache Tamaya - Core Implementation
Library #45
Archived 2 artifacts
Archive block size is 32768
Received 0 blocks and 221792 bytes
Compression is 0.0%
Took 0.22 sec
[JENKINS] Archiving <https://builds.apache.org/job/Tamaya-Master-branch/ws/pom.xml>
to org.apache.tamaya/tamaya-all/0.1-SNAPSHOT/tamaya-all-0.1-SNAPSHOT.pom
Sending artifact delta relative to Tamaya-Master-branch » Apache Tamaya #46
Archived 1 artifacts
Archive block size is 32768
Received 0 blocks and 23005 bytes
Compression is 0.0%
Took 73 ms
[JENKINS] Archiving <https://builds.apache.org/job/Tamaya-Master-branch/ws/modules/pom.xml>
to org.apache.tamaya.ext/tamaya-ext-all/0.1-SNAPSHOT/tamaya-ext-all-0.1-SNAPSHOT.pom
Sending artifact delta relative to Tamaya-Master-branch » Apache Tamaya Modules #45
Archived 1 artifacts
Archive block size is 32768
Received 0 blocks and 2295 bytes
Compression is 0.0%
Took 70 ms
[JENKINS] Archiving <https://builds.apache.org/job/Tamaya-Master-branch/ws/api/pom.xml>
to org.apache.tamaya/tamaya-api/0.1-SNAPSHOT/tamaya-api-0.1-SNAPSHOT.pom
[JENKINS] Archiving <https://builds.apache.org/job/Tamaya-Master-branch/ws/api/target/tamaya-api-0.1-SNAPSHOT.jar>
to org.apache.tamaya/tamaya-api/0.1-20141213.005817-47/tamaya-api-0.1-20141213.005817-47.jar
Sending artifact delta relative to Tamaya-Master-branch » Apache Tamaya - API #46
Archived 2 artifacts
Archive block size is 32768
Received 0 blocks and 46756 bytes
Compression is 0.0%
Took 78 ms
[JENKINS] Archiving <https://builds.apache.org/job/Tamaya-Master-branch/ws/modules/metamodels/pom.xml>
to org.apache.tamaya.metamodels/tamaya-metamodels-all/0.1-SNAPSHOT/tamaya-metamodels-all-0.1-SNAPSHOT.pom
Sending artifact delta relative to Tamaya-Master-branch » Apache Tamaya Modules Metamodels
#45
Archived 1 artifacts
Archive block size is 32768
Received 0 blocks and 1889 bytes
Compression is 0.0%
Took 70 ms
[JENKINS] Archiving <https://builds.apache.org/job/Tamaya-Master-branch/ws/buildtools/pom.xml>
to org.apache.tamaya/buildtools/0.1-SNAPSHOT/buildtools-0.1-SNAPSHOT.pom
[JENKINS] Archiving <https://builds.apache.org/job/Tamaya-Master-branch/ws/buildtools/target/buildtools-0.1-SNAPSHOT.jar>
to org.apache.tamaya/buildtools/0.1-20141213.005808-30/buildtools-0.1-20141213.005808-30.jar
Sending artifact delta relative to Tamaya-Master-branch » Apache Tamaya - Build Tools #46
Archived 2 artifacts
Archive block size is 32768
Received 0 blocks and 7258 bytes
Compression is 0.0%
Took 72 ms
channel stopped

Mime
View raw message