tamaya-commits mailing list archives

Site index · List index
Message view « Date » · « Thread »
Top « Date » · « Thread »
From Apache Jenkins Server <jenk...@builds.apache.org>
Subject Build failed in Jenkins: Tamaya-Master-branch #46
Date Sat, 13 Dec 2014 00:43:36 GMT
See <https://builds.apache.org/job/Tamaya-Master-branch/46/changes>

Changes:

[anatole] TAMAYA-3:

------------------------------------------
[...truncated 915 lines...]
[ERROR] <https://builds.apache.org/job/Tamaya-Master-branch/ws/core/src/main/java/org/apache/tamaya/core/internal/properties/DefaultPropertyProviderBuilderSpi.java>:[144,11]
error: cannot find symbol
[ERROR] 
[ERROR] class DefaultPropertyProviderBuilderSpi
[ERROR] <https://builds.apache.org/job/Tamaya-Master-branch/ws/core/src/main/java/org/apache/tamaya/core/internal/properties/DefaultPropertyProviderBuilderSpi.java>:[168,88]
error: cannot find symbol
[ERROR] 
[ERROR] class DefaultPropertyProviderBuilderSpi
[ERROR] <https://builds.apache.org/job/Tamaya-Master-branch/ws/core/src/main/java/org/apache/tamaya/core/internal/properties/DefaultPropertyProviderBuilderSpi.java>:[168,11]
error: cannot find symbol
[ERROR] 
[ERROR] class DefaultPropertyProviderBuilderSpi
[ERROR] <https://builds.apache.org/job/Tamaya-Master-branch/ws/core/src/main/java/org/apache/tamaya/core/internal/properties/DefaultPropertyProviderBuilderSpi.java>:[185,55]
error: cannot find symbol
[ERROR] 
[ERROR] class DefaultPropertyProviderBuilderSpi
[ERROR] <https://builds.apache.org/job/Tamaya-Master-branch/ws/core/src/main/java/org/apache/tamaya/core/internal/properties/DefaultPropertyProviderBuilderSpi.java>:[185,11]
error: cannot find symbol
[ERROR] 
[ERROR] class DefaultPropertyProviderBuilderSpi
[ERROR] <https://builds.apache.org/job/Tamaya-Master-branch/ws/core/src/main/java/org/apache/tamaya/core/internal/properties/DefaultPropertyProviderBuilderSpi.java>:[206,101]
error: cannot find symbol
[ERROR] 
[ERROR] class DefaultPropertyProviderBuilderSpi
[ERROR] <https://builds.apache.org/job/Tamaya-Master-branch/ws/core/src/main/java/org/apache/tamaya/core/internal/properties/DefaultPropertyProviderBuilderSpi.java>:[206,11]
error: cannot find symbol
[ERROR] 
[ERROR] class DefaultPropertyProviderBuilderSpi
[ERROR] <https://builds.apache.org/job/Tamaya-Master-branch/ws/core/src/main/java/org/apache/tamaya/core/internal/properties/DefaultPropertyProviderBuilderSpi.java>:[219,58]
error: cannot find symbol
[ERROR] 
[ERROR] class DefaultPropertyProviderBuilderSpi
[ERROR] <https://builds.apache.org/job/Tamaya-Master-branch/ws/core/src/main/java/org/apache/tamaya/core/internal/properties/DefaultPropertyProviderBuilderSpi.java>:[219,88]
error: cannot find symbol
[ERROR] 
[ERROR] class DefaultPropertyProviderBuilderSpi
[ERROR] <https://builds.apache.org/job/Tamaya-Master-branch/ws/core/src/main/java/org/apache/tamaya/core/internal/properties/DefaultPropertyProviderBuilderSpi.java>:[219,11]
error: cannot find symbol
[ERROR] 
[ERROR] class DefaultPropertyProviderBuilderSpi
[ERROR] <https://builds.apache.org/job/Tamaya-Master-branch/ws/core/src/main/java/org/apache/tamaya/core/internal/properties/DefaultPropertyProviderBuilderSpi.java>:[233,82]
error: cannot find symbol
[ERROR] 
[ERROR] class DefaultPropertyProviderBuilderSpi
[ERROR] <https://builds.apache.org/job/Tamaya-Master-branch/ws/core/src/main/java/org/apache/tamaya/core/internal/properties/DefaultPropertyProviderBuilderSpi.java>:[233,11]
error: cannot find symbol
[ERROR] 
[ERROR] class DefaultPropertyProviderBuilderSpi
[ERROR] <https://builds.apache.org/job/Tamaya-Master-branch/ws/core/src/main/java/org/apache/tamaya/core/internal/properties/DefaultPropertyProviderBuilderSpi.java>:[245,67]
error: cannot find symbol
[ERROR] 
[ERROR] class DefaultPropertyProviderBuilderSpi
[ERROR] <https://builds.apache.org/job/Tamaya-Master-branch/ws/core/src/main/java/org/apache/tamaya/core/internal/properties/DefaultPropertyProviderBuilderSpi.java>:[245,11]
error: cannot find symbol
[ERROR] 
[ERROR] class DefaultPropertyProviderBuilderSpi
[ERROR] <https://builds.apache.org/job/Tamaya-Master-branch/ws/core/src/main/java/org/apache/tamaya/core/internal/properties/DefaultPropertyProviderBuilderSpi.java>:[260,58]
error: cannot find symbol
[ERROR] 
[ERROR] class DefaultPropertyProviderBuilderSpi
[ERROR] <https://builds.apache.org/job/Tamaya-Master-branch/ws/core/src/main/java/org/apache/tamaya/core/internal/properties/DefaultPropertyProviderBuilderSpi.java>:[260,11]
error: cannot find symbol
[ERROR] 
[ERROR] class DefaultPropertyProviderBuilderSpi
[ERROR] <https://builds.apache.org/job/Tamaya-Master-branch/ws/core/src/main/java/org/apache/tamaya/core/internal/properties/DefaultPropertyProviderBuilderSpi.java>:[278,57]
error: cannot find symbol
[ERROR] 
[ERROR] class DefaultPropertyProviderBuilderSpi
[ERROR] <https://builds.apache.org/job/Tamaya-Master-branch/ws/core/src/main/java/org/apache/tamaya/core/internal/properties/DefaultPropertyProviderBuilderSpi.java>:[278,11]
error: cannot find symbol
[ERROR] 
[ERROR] class DefaultPropertyProviderBuilderSpi
[ERROR] <https://builds.apache.org/job/Tamaya-Master-branch/ws/core/src/main/java/org/apache/tamaya/core/internal/properties/DefaultPropertyProviderBuilderSpi.java>:[283,53]
error: cannot find symbol
[ERROR] 
[ERROR] class DefaultPropertyProviderBuilderSpi
[ERROR] <https://builds.apache.org/job/Tamaya-Master-branch/ws/core/src/main/java/org/apache/tamaya/core/internal/properties/DefaultPropertyProviderBuilderSpi.java>:[283,11]
error: cannot find symbol
[ERROR] 
[ERROR] class DefaultPropertyProviderBuilderSpi
[ERROR] <https://builds.apache.org/job/Tamaya-Master-branch/ws/core/src/main/java/org/apache/tamaya/core/internal/properties/SystemPropertiesPropertyProvider.java>:[23,40]
error: cannot find symbol
[ERROR] 
[ERROR] package org.apache.tamaya.core.properties
[ERROR] <https://builds.apache.org/job/Tamaya-Master-branch/ws/core/src/main/java/org/apache/tamaya/core/internal/properties/SystemPropertiesPropertyProvider.java>:[30,47]
error: cannot find symbol
[ERROR] 
[ERROR] class AbstractPropertyProvider
[ERROR] <https://builds.apache.org/job/Tamaya-Master-branch/ws/core/src/main/java/org/apache/tamaya/core/internal/properties/ReplacingPropertyProvider.java>:[24,24]
error: cannot find symbol
[ERROR] 
[ERROR] package org.apache.tamaya
[ERROR] <https://builds.apache.org/job/Tamaya-Master-branch/ws/core/src/main/java/org/apache/tamaya/core/internal/properties/ReplacingPropertyProvider.java>:[33,43]
error: cannot find symbol
[ERROR] 
[ERROR] class PropertyProvider
[ERROR] <https://builds.apache.org/job/Tamaya-Master-branch/ws/core/src/main/java/org/apache/tamaya/core/internal/properties/ReplacingPropertyProvider.java>:[36,12]
error: cannot find symbol
[ERROR] 
[ERROR] class ReplacingPropertyProvider
[ERROR] <https://builds.apache.org/job/Tamaya-Master-branch/ws/core/src/main/java/org/apache/tamaya/core/internal/properties/ReplacingPropertyProvider.java>:[47,56]
error: cannot find symbol
[ERROR] 
[ERROR] class ReplacingPropertyProvider
[ERROR] <https://builds.apache.org/job/Tamaya-Master-branch/ws/core/src/main/java/org/apache/tamaya/core/internal/properties/ContextualPropertyProvider.java>:[33,44]
error: cannot find symbol
[ERROR] 
[ERROR] class PropertyProvider
[ERROR] <https://builds.apache.org/job/Tamaya-Master-branch/ws/core/src/main/java/org/apache/tamaya/core/internal/properties/ContextualPropertyProvider.java>:[35,32]
error: cannot find symbol
[ERROR] 
[ERROR] class ContextualPropertyProvider
[ERROR] <https://builds.apache.org/job/Tamaya-Master-branch/ws/core/src/main/java/org/apache/tamaya/core/internal/properties/ContextualPropertyProvider.java>:[37,21]
error: cannot find symbol
[ERROR] 
[ERROR] class ContextualPropertyProvider
[ERROR] <https://builds.apache.org/job/Tamaya-Master-branch/ws/core/src/main/java/org/apache/tamaya/core/internal/properties/ContextualPropertyProvider.java>:[48,66]
error: cannot find symbol
[ERROR] 
[ERROR] class ContextualPropertyProvider
[ERROR] <https://builds.apache.org/job/Tamaya-Master-branch/ws/core/src/main/java/org/apache/tamaya/core/internal/properties/ContextualPropertyProvider.java>:[70,14]
error: cannot find symbol
[ERROR] 
[ERROR] class ContextualPropertyProvider
[ERROR] <https://builds.apache.org/job/Tamaya-Master-branch/ws/core/src/main/java/org/apache/tamaya/core/internal/properties/ContextualPropertyProvider.java>:[138,11]
error: cannot find symbol
[ERROR] 
[ERROR] class ContextualPropertyProvider
[ERROR] <https://builds.apache.org/job/Tamaya-Master-branch/ws/core/src/main/java/org/apache/tamaya/core/internal/properties/ContextualPropertyProvider.java>:[165,20]
error: cannot find symbol
[ERROR] 
[ERROR] class ContextualPropertyProvider
[ERROR] <https://builds.apache.org/job/Tamaya-Master-branch/ws/core/src/main/java/org/apache/tamaya/core/internal/properties/URLBasedPropertyProvider.java>:[28,40]
error: cannot find symbol
[ERROR] 
[ERROR] package org.apache.tamaya.core.properties
[ERROR] <https://builds.apache.org/job/Tamaya-Master-branch/ws/core/src/main/java/org/apache/tamaya/core/internal/properties/URLBasedPropertyProvider.java>:[41,45]
error: cannot find symbol
[ERROR] 
[ERROR] class AbstractPropertyProvider
[ERROR] <https://builds.apache.org/job/Tamaya-Master-branch/ws/core/src/main/java/org/apache/tamaya/core/internal/properties/PathBasedPropertyProvider.java>:[23,40]
error: cannot find symbol
[ERROR] 
[ERROR] package org.apache.tamaya.core.properties
[ERROR] <https://builds.apache.org/job/Tamaya-Master-branch/ws/core/src/main/java/org/apache/tamaya/core/internal/properties/PathBasedPropertyProvider.java>:[34,46]
error: cannot find symbol
[ERROR] 
[ERROR] class AbstractPropertyProvider
[ERROR] <https://builds.apache.org/job/Tamaya-Master-branch/ws/core/src/main/java/org/apache/tamaya/core/internal/properties/SubtractingPropertyProvider.java>:[24,24]
error: cannot find symbol
[ERROR] 
[ERROR] package org.apache.tamaya
[ERROR] <https://builds.apache.org/job/Tamaya-Master-branch/ws/core/src/main/java/org/apache/tamaya/core/internal/properties/SubtractingPropertyProvider.java>:[25,40]
error: cannot find symbol
[ERROR] 
[ERROR] package org.apache.tamaya.core.properties
[ERROR] <https://builds.apache.org/job/Tamaya-Master-branch/ws/core/src/main/java/org/apache/tamaya/core/internal/properties/SubtractingPropertyProvider.java>:[30,42]
error: cannot find symbol
[ERROR] 
[ERROR] class AbstractPropertyProvider
[ERROR] <https://builds.apache.org/job/Tamaya-Master-branch/ws/core/src/main/java/org/apache/tamaya/core/internal/properties/SubtractingPropertyProvider.java>:[33,12]
error: cannot find symbol
[ERROR] 
[ERROR] class SubtractingPropertyProvider
[ERROR] <https://builds.apache.org/job/Tamaya-Master-branch/ws/core/src/main/java/org/apache/tamaya/core/internal/properties/SubtractingPropertyProvider.java>:[34,17]
error: cannot find symbol
[ERROR] 
[ERROR] class SubtractingPropertyProvider
[ERROR] <https://builds.apache.org/job/Tamaya-Master-branch/ws/core/src/main/java/org/apache/tamaya/core/internal/properties/SubtractingPropertyProvider.java>:[36,58]
error: cannot find symbol
[ERROR] 
[ERROR] class SubtractingPropertyProvider
[ERROR] <https://builds.apache.org/job/Tamaya-Master-branch/ws/core/src/main/java/org/apache/tamaya/core/internal/properties/SubtractingPropertyProvider.java>:[36,95]
error: cannot find symbol
[ERROR] 
[ERROR] class SubtractingPropertyProvider
[ERROR] <https://builds.apache.org/job/Tamaya-Master-branch/ws/core/src/main/java/org/apache/tamaya/core/internal/properties/DelegatingPropertyProvider.java>:[24,24]
error: cannot find symbol
[ERROR] 
[ERROR] package org.apache.tamaya
[ERROR] <https://builds.apache.org/job/Tamaya-Master-branch/ws/core/src/main/java/org/apache/tamaya/core/internal/properties/DelegatingPropertyProvider.java>:[39,44]
error: cannot find symbol
[ERROR] 
[ERROR] class PropertyProvider
[ERROR] <https://builds.apache.org/job/Tamaya-Master-branch/ws/core/src/main/java/org/apache/tamaya/core/internal/properties/DelegatingPropertyProvider.java>:[42,12]
error: cannot find symbol
[ERROR] 
[ERROR] class DelegatingPropertyProvider
[ERROR] <https://builds.apache.org/job/Tamaya-Master-branch/ws/core/src/main/java/org/apache/tamaya/core/internal/properties/DelegatingPropertyProvider.java>:[53,57]
error: cannot find symbol
[ERROR] 
[ERROR] class DelegatingPropertyProvider
[ERROR] <https://builds.apache.org/job/Tamaya-Master-branch/ws/core/src/main/java/org/apache/tamaya/core/internal/properties/BuildablePropertyProvider.java>:[41,4]
error: method does not override or implement a method from a supertype
[ERROR] 
[ERROR] <https://builds.apache.org/job/Tamaya-Master-branch/ws/core/src/main/java/org/apache/tamaya/core/internal/properties/BuildablePropertyProvider.java>:[46,4]
error: method does not override or implement a method from a supertype
[ERROR] 
[ERROR] <https://builds.apache.org/job/Tamaya-Master-branch/ws/core/src/main/java/org/apache/tamaya/core/internal/properties/BuildablePropertyProvider.java>:[51,4]
error: method does not override or implement a method from a supertype
[ERROR] 
[ERROR] <https://builds.apache.org/job/Tamaya-Master-branch/ws/core/src/main/java/org/apache/tamaya/core/internal/properties/BuildablePropertyProvider.java>:[56,4]
error: method does not override or implement a method from a supertype
[ERROR] 
[ERROR] <https://builds.apache.org/job/Tamaya-Master-branch/ws/core/src/main/java/org/apache/tamaya/core/internal/logging/AbstractDelegatingLogger.java>:[121,16]
[deprecation] logrb(Level,String,String,String,String) in Logger has been deprecated
[ERROR] 
[ERROR] <https://builds.apache.org/job/Tamaya-Master-branch/ws/core/src/main/java/org/apache/tamaya/core/internal/logging/AbstractDelegatingLogger.java>:[130,16]
[deprecation] logrb(Level,String,String,String,String,Object) in Logger has been deprecated
[ERROR] 
[ERROR] <https://builds.apache.org/job/Tamaya-Master-branch/ws/core/src/main/java/org/apache/tamaya/core/internal/logging/AbstractDelegatingLogger.java>:[142,16]
[deprecation] logrb(Level,String,String,String,String,Object[]) in Logger has been deprecated
[ERROR] 
[ERROR] <https://builds.apache.org/job/Tamaya-Master-branch/ws/core/src/main/java/org/apache/tamaya/core/internal/logging/AbstractDelegatingLogger.java>:[153,16]
[deprecation] logrb(Level,String,String,String,String,Throwable) in Logger has been deprecated
[ERROR] 
[ERROR] <https://builds.apache.org/job/Tamaya-Master-branch/ws/core/src/main/java/org/apache/tamaya/core/internal/properties/FreezedPropertyProvider.java>:[60,4]
error: method does not override or implement a method from a supertype
[ERROR] 
[ERROR] <https://builds.apache.org/job/Tamaya-Master-branch/ws/core/src/main/java/org/apache/tamaya/core/internal/properties/FreezedPropertyProvider.java>:[62,46]
error: incompatible types: FreezedPropertyProvider cannot be converted to PropertySource
[ERROR] 
[ERROR] <https://builds.apache.org/job/Tamaya-Master-branch/ws/core/src/main/java/org/apache/tamaya/core/internal/properties/FreezedPropertyProvider.java>:[73,4]
error: method does not override or implement a method from a supertype
[ERROR] 
[ERROR] <https://builds.apache.org/job/Tamaya-Master-branch/ws/core/src/main/java/org/apache/tamaya/core/internal/properties/FreezedPropertyProvider.java>:[78,4]
error: method does not override or implement a method from a supertype
[ERROR] 
[ERROR] <https://builds.apache.org/job/Tamaya-Master-branch/ws/core/src/main/java/org/apache/tamaya/core/internal/properties/FreezedPropertyProvider.java>:[83,4]
error: method does not override or implement a method from a supertype
[ERROR] 
[ERROR] <https://builds.apache.org/job/Tamaya-Master-branch/ws/core/src/main/java/org/apache/tamaya/core/env/ConfiguredSystemProperties.java>:[201,16]
[deprecation] save(OutputStream,String) in Properties has been deprecated
[ERROR] 
[ERROR] <https://builds.apache.org/job/Tamaya-Master-branch/ws/core/src/main/java/org/apache/tamaya/core/env/ConfiguredSystemProperties.java>:[202,13]
[deprecation] save(OutputStream,String) in Properties has been deprecated
[ERROR] -> [Help 1]
[ERROR] 
[ERROR] To see the full stack trace of the errors, re-run Maven with the -e switch.
[ERROR] Re-run Maven using the -X switch to enable full debug logging.
[ERROR] 
[ERROR] For more information about the errors and possible solutions, please read the following
articles:
[ERROR] [Help 1] http://cwiki.apache.org/confluence/display/MAVEN/MojoFailureException
[ERROR] 
[ERROR] After correcting the problems, you can resume the build with the command
[ERROR]   mvn <goals> -rf :tamaya-core
[JENKINS] Archiving <https://builds.apache.org/job/Tamaya-Master-branch/ws/modules/integration/cdi/pom.xml>
to org.apache.tamaya.integration/tamaya-cdi/0.1-SNAPSHOT/tamaya-cdi-0.1-SNAPSHOT.pom
Sending artifact delta relative to Tamaya-Master-branch » Apache Tamaya Modules Integration
- CDI #45
Archived 1 artifacts
Archive block size is 32768
Received 0 blocks and 7308 bytes
Compression is 0.0%
Took 0.19 sec
[JENKINS] Archiving <https://builds.apache.org/job/Tamaya-Master-branch/ws/modules/integration/pom.xml>
to org.apache.tamaya.integration/tamaya-integration-all/0.1-SNAPSHOT/tamaya-integration-all-0.1-SNAPSHOT.pom
Sending artifact delta relative to Tamaya-Master-branch » Apache Tamaya Modules Integration
#45
Archived 1 artifacts
Archive block size is 32768
Received 0 blocks and 1892 bytes
Compression is 0.0%
Took 0.1 sec
[JENKINS] Archiving <https://builds.apache.org/job/Tamaya-Master-branch/ws/modules/metamodels/simple/pom.xml>
to org.apache.tamaya.metamodels/tamaya-metamodel-simple/0.1-SNAPSHOT/tamaya-metamodel-simple-0.1-SNAPSHOT.pom
Sending artifact delta relative to Tamaya-Master-branch » Apache Tamaya Modules Metamodels
- Simple #45
Archived 1 artifacts
Archive block size is 32768
Received 0 blocks and 2918 bytes
Compression is 0.0%
Took 82 ms
[JENKINS] Archiving <https://builds.apache.org/job/Tamaya-Master-branch/ws/core/pom.xml>
to org.apache.tamaya/tamaya-core/0.1-SNAPSHOT/tamaya-core-0.1-SNAPSHOT.pom
Sending artifact delta relative to Tamaya-Master-branch » Apache Tamaya - Core Implementation
Library #45
Archived 1 artifacts
Archive block size is 32768
Received 0 blocks and 4673 bytes
Compression is 0.0%
Took 0.16 sec
[JENKINS] Archiving <https://builds.apache.org/job/Tamaya-Master-branch/ws/pom.xml>
to org.apache.tamaya/tamaya-all/0.1-SNAPSHOT/tamaya-all-0.1-SNAPSHOT.pom
Sending artifact delta relative to Tamaya-Master-branch » Apache Tamaya #45
Archived 1 artifacts
Archive block size is 32768
Received 0 blocks and 23005 bytes
Compression is 0.0%
Took 0.15 sec
[JENKINS] Archiving <https://builds.apache.org/job/Tamaya-Master-branch/ws/modules/pom.xml>
to org.apache.tamaya.ext/tamaya-ext-all/0.1-SNAPSHOT/tamaya-ext-all-0.1-SNAPSHOT.pom
Sending artifact delta relative to Tamaya-Master-branch » Apache Tamaya Modules #45
Archived 1 artifacts
Archive block size is 32768
Received 0 blocks and 2295 bytes
Compression is 0.0%
Took 0.1 sec
[JENKINS] Archiving <https://builds.apache.org/job/Tamaya-Master-branch/ws/api/pom.xml>
to org.apache.tamaya/tamaya-api/0.1-SNAPSHOT/tamaya-api-0.1-SNAPSHOT.pom
[JENKINS] Archiving <https://builds.apache.org/job/Tamaya-Master-branch/ws/api/target/tamaya-api-0.1-SNAPSHOT.jar>
to org.apache.tamaya/tamaya-api/0.1-20141213.004325-46/tamaya-api-0.1-20141213.004325-46.jar
Sending artifact delta relative to Tamaya-Master-branch » Apache Tamaya - API #45
Archived 2 artifacts
Archive block size is 32768
Received 0 blocks and 47584 bytes
Compression is 0.0%
Took 0.16 sec
[JENKINS] Archiving <https://builds.apache.org/job/Tamaya-Master-branch/ws/modules/metamodels/pom.xml>
to org.apache.tamaya.metamodels/tamaya-metamodels-all/0.1-SNAPSHOT/tamaya-metamodels-all-0.1-SNAPSHOT.pom
Sending artifact delta relative to Tamaya-Master-branch » Apache Tamaya Modules Metamodels
#45
Archived 1 artifacts
Archive block size is 32768
Received 0 blocks and 1889 bytes
Compression is 0.0%
Took 0.11 sec
[JENKINS] Archiving <https://builds.apache.org/job/Tamaya-Master-branch/ws/buildtools/pom.xml>
to org.apache.tamaya/buildtools/0.1-SNAPSHOT/buildtools-0.1-SNAPSHOT.pom
[JENKINS] Archiving <https://builds.apache.org/job/Tamaya-Master-branch/ws/buildtools/target/buildtools-0.1-SNAPSHOT.jar>
to org.apache.tamaya/buildtools/0.1-20141213.004313-29/buildtools-0.1-20141213.004313-29.jar
Sending artifact delta relative to Tamaya-Master-branch » Apache Tamaya - Build Tools #45
Archived 2 artifacts
Archive block size is 32768
Received 0 blocks and 7258 bytes
Compression is 0.0%
Took 0.15 sec
channel stopped

Mime
View raw message