tamaya-commits mailing list archives

Site index · List index
Message view « Date » · « Thread »
Top « Date » · « Thread »
From Apache Jenkins Server <jenk...@builds.apache.org>
Subject Build failed in Jenkins: Tamaya-Master-branch #78
Date Fri, 26 Dec 2014 16:13:05 GMT
See <https://builds.apache.org/job/Tamaya-Master-branch/78/changes>

Changes:

[johndament] Get Tamaya back to the compiling state.

------------------------------------------
Started by an SCM change
Building remotely on H11 (Ubuntu ubuntu) in workspace <https://builds.apache.org/job/Tamaya-Master-branch/ws/>
 > git rev-parse --is-inside-work-tree # timeout=10
Fetching changes from the remote Git repository
 > git config remote.origin.url https://git-wip-us.apache.org/repos/asf/incubator-tamaya.git
# timeout=10
Fetching upstream changes from https://git-wip-us.apache.org/repos/asf/incubator-tamaya.git
 > git --version # timeout=10
 > git fetch --tags --progress https://git-wip-us.apache.org/repos/asf/incubator-tamaya.git
+refs/heads/*:refs/remotes/origin/*
 > git rev-parse refs/remotes/origin/master^{commit} # timeout=10
 > git rev-parse refs/remotes/origin/origin/master^{commit} # timeout=10
Checking out Revision 702156cd98fd32571b529888954c091f89292360 (refs/remotes/origin/master)
 > git config core.sparsecheckout # timeout=10
 > git checkout -f 702156cd98fd32571b529888954c091f89292360
 > git rev-list 95b54ec5668cd8d9b57d839937f51aba534a1d58 # timeout=10
Parsing POMs
Discovered a new module org.apache.tamaya.metamodels:tamaya-metamodel-environment Apache Tamaya
Modules Metamodels - environment
Discovered a new module org.apache.tamaya.integration:tamaya-integration-managed Apache Tamaya
Modules Integration - Java Management Extensions
Discovered a new module org.apache.tamaya.integration:tamaya-integration-se Apache Tamaya
Modules Integration - Java SE
Modules changed, recalculating dependency graph
maven31-agent.jar already up to date
maven31-interceptor.jar already up to date
maven3-interceptor-commons.jar already up to date
[Tamaya-Master-branch] $ /home/jenkins/jenkins-slave/tools/hudson.model.JDK/latest1.8/bin/java
-Xmx2g -Xms256m -XX:MaxPermSize=512m -cp /home/jenkins/jenkins-slave/maven31-agent.jar:/home/jenkins/jenkins-slave/tools/hudson.tasks.Maven_MavenInstallation/maven-3.2.1/boot/plexus-classworlds-2.5.1.jar:/home/jenkins/jenkins-slave/tools/hudson.tasks.Maven_MavenInstallation/maven-3.2.1/conf/logging
jenkins.maven3.agent.Maven31Main /home/jenkins/jenkins-slave/tools/hudson.tasks.Maven_MavenInstallation/maven-3.2.1
/home/jenkins/jenkins-slave/slave.jar /home/jenkins/jenkins-slave/maven31-interceptor.jar
/home/jenkins/jenkins-slave/maven3-interceptor-commons.jar 57285
Java HotSpot(TM) 64-Bit Server VM warning: ignoring option MaxPermSize=512m; support was removed
in 8.0
<===[JENKINS REMOTING CAPACITY]===>   channel started
Executing Maven:  -B -f <https://builds.apache.org/job/Tamaya-Master-branch/ws/pom.xml>
-Dmaven.repo.local=/home/jenkins/jenkins-slave/maven-repositories/0 clean install apache-rat:check
deploy
[INFO] Scanning for projects...
[INFO] ------------------------------------------------------------------------
[INFO] Reactor Build Order:
[INFO] 
[INFO] Apache Tamaya
[INFO] Apache Tamaya - Build Tools
[INFO] Apache Tamaya - API
[INFO] Apache Tamaya - Core Implementation Library
[INFO] Apache Tamaya Modules
[INFO] Apache Tamaya Modules Metamodels
[INFO] Apache Tamaya Modules Metamodels - Simple
[INFO] Apache Tamaya Modules Metamodels - environment
[INFO] tamaya-integration-all
[INFO] Apache Tamaya Modules Integration - Java Management Extensions
[INFO] Apache Tamaya Modules Integration - CDI
[INFO] Apache Tamaya Modules Integration - Java SE
[INFO] 
[INFO] Using the builder org.apache.maven.lifecycle.internal.builder.singlethreaded.SingleThreadedBuilder
with a thread count of 1
[INFO]                                                                         
[INFO] ------------------------------------------------------------------------
[INFO] Building Apache Tamaya 0.1-SNAPSHOT
[INFO] ------------------------------------------------------------------------
[INFO] 
[INFO] --- maven-clean-plugin:2.5:clean (default-clean) @ tamaya-all ---
[INFO] Deleting <https://builds.apache.org/job/Tamaya-Master-branch/ws/target>
[INFO] 
[INFO] --- maven-enforcer-plugin:1.3.1:enforce (enforce-versions) @ tamaya-all ---
[INFO] 
[INFO] --- maven-remote-resources-plugin:1.5:process (default) @ tamaya-all ---
[INFO] 
[INFO] >>> findbugs-maven-plugin:3.0.0:check (findbugs-analyze) @ tamaya-all >>>
[INFO] 
[INFO] --- findbugs-maven-plugin:3.0.0:findbugs (findbugs) @ tamaya-all ---
[FINDBUGS] No report found for mojo findbugs
[CHECKSTYLE] No report found for mojo check[INFO] 
[INFO] <<< findbugs-maven-plugin:3.0.0:check (findbugs-analyze) @ tamaya-all <<<
[INFO] 
[INFO] --- findbugs-maven-plugin:3.0.0:check (findbugs-analyze) @ tamaya-all ---

[CHECKSTYLE] No report found for mojo check[INFO] 
[INFO] --- maven-site-plugin:3.3:attach-descriptor (attach-descriptor) @ tamaya-all ---

[INFO] 
[INFO] --- maven-javadoc-plugin:2.9.1:jar (attach-javadocs) @ tamaya-all ---
[INFO] Skipping javadoc generation
[INFO] 
[INFO] --- apache-rat-plugin:0.11:check (default) @ tamaya-all ---
[INFO] 55 implicit excludes (use -debug for more details).
[INFO] Exclude: **/target
[INFO] Exclude: *.iml
[INFO] Exclude: **/.idea/**
[INFO] 64 resources included (use -debug for more details)
Warning:  org.apache.xerces.jaxp.SAXParserImpl$JAXPSAXParser: Property 'http://www.oracle.com/xml/jaxp/properties/entityExpansionLimit'
is not recognized.
Compiler warnings:
  WARNING:  'org.apache.xerces.jaxp.SAXParserImpl: Property 'http://javax.xml.XMLConstants/property/accessExternalDTD'
is not recognized.'
Warning:  org.apache.xerces.parsers.SAXParser: Feature 'http://javax.xml.XMLConstants/feature/secure-processing'
is not recognized.
Warning:  org.apache.xerces.parsers.SAXParser: Property 'http://javax.xml.XMLConstants/property/accessExternalDTD'
is not recognized.
Warning:  org.apache.xerces.parsers.SAXParser: Property 'http://www.oracle.com/xml/jaxp/properties/entityExpansionLimit'
is not recognized.
[INFO] Rat check: Summary of files. Unapproved: 20 unknown: 20 generated: 0 approved: 10 licence.
[CHECKSTYLE] No report found for mojo check
[INFO] ------------------------------------------------------------------------
[INFO] Reactor Summary:
[INFO] 
[INFO] Apache Tamaya ..................................... FAILURE [  8.661 s]
[INFO] Apache Tamaya - Build Tools ....................... SKIPPED
[INFO] Apache Tamaya - API ............................... SKIPPED
[INFO] Apache Tamaya - Core Implementation Library ....... SKIPPED
[INFO] Apache Tamaya Modules ............................. SKIPPED
[INFO] Apache Tamaya Modules Metamodels .................. SKIPPED
[INFO] Apache Tamaya Modules Metamodels - Simple ......... SKIPPED
[INFO] Apache Tamaya Modules Metamodels - environment .... SKIPPED
[INFO] tamaya-integration-all ............................ SKIPPED
[INFO] Apache Tamaya Modules Integration - Java Management Extensions  SKIPPED
[INFO] Apache Tamaya Modules Integration - CDI ........... SKIPPED
[INFO] Apache Tamaya Modules Integration - Java SE ....... SKIPPED
[INFO] ------------------------------------------------------------------------
[INFO] BUILD FAILURE
[INFO] ------------------------------------------------------------------------
[INFO] Total time: 13.351 s
[INFO] Finished at: 2014-12-26T16:13:01+00:00
[INFO] Final Memory: 29M/353M
[INFO] ------------------------------------------------------------------------
[ERROR] Failed to execute goal org.apache.rat:apache-rat-plugin:0.11:check (default) on project
tamaya-all: Too many files with unapproved license: 20 See RAT report in: <https://builds.apache.org/job/Tamaya-Master-branch/ws/target/rat.txt>
-> [Help 1]
[ERROR] 
[ERROR] To see the full stack trace of the errors, re-run Maven with the -e switch.
[ERROR] Re-run Maven using the -X switch to enable full debug logging.
[ERROR] 
[ERROR] For more information about the errors and possible solutions, please read the following
articles:
[ERROR] [Help 1] http://cwiki.apache.org/confluence/display/MAVEN/MojoFailureException
[JENKINS] Archiving <https://builds.apache.org/job/Tamaya-Master-branch/ws/modules/integration/cdi/pom.xml>
to org.apache.tamaya.integration/tamaya-cdi/0.1-SNAPSHOT/tamaya-cdi-0.1-SNAPSHOT.pom
Sending artifact delta relative to Tamaya-Master-branch » Apache Tamaya Modules Integration
- CDI #69
Archived 1 artifacts
Archive block size is 32768
Received 0 blocks and 7308 bytes
Compression is 0.0%
Took 0.1 sec
[JENKINS] Archiving <https://builds.apache.org/job/Tamaya-Master-branch/ws/modules/integration/pom.xml>
to org.apache.tamaya.integration/tamaya-integration-all/0.1-SNAPSHOT/tamaya-integration-all-0.1-SNAPSHOT.pom
Sending artifact delta relative to Tamaya-Master-branch » tamaya-integration-all #69
Archived 1 artifacts
Archive block size is 32768
Received 0 blocks and 1660 bytes
Compression is 0.0%
Took 80 ms
[JENKINS] Archiving <https://builds.apache.org/job/Tamaya-Master-branch/ws/modules/metamodels/environment/pom.xml>
to org.apache.tamaya.metamodels/tamaya-metamodel-environment/0.1-SNAPSHOT/tamaya-metamodel-environment-0.1-SNAPSHOT.pom
No prior successful build to compare, so performing full copy of artifacts
[JENKINS] Archiving <https://builds.apache.org/job/Tamaya-Master-branch/ws/modules/integration/managed/pom.xml>
to org.apache.tamaya.integration/tamaya-integration-managed/0.1-SNAPSHOT/tamaya-integration-managed-0.1-SNAPSHOT.pom
No prior successful build to compare, so performing full copy of artifacts
[JENKINS] Archiving <https://builds.apache.org/job/Tamaya-Master-branch/ws/modules/metamodels/simple/pom.xml>
to org.apache.tamaya.metamodels/tamaya-metamodel-simple/0.1-SNAPSHOT/tamaya-metamodel-simple-0.1-SNAPSHOT.pom
Sending artifact delta relative to Tamaya-Master-branch » Apache Tamaya Modules Metamodels
- Simple #69
Archived 1 artifacts
Archive block size is 32768
Received 0 blocks and 2918 bytes
Compression is 0.0%
Took 0.11 sec
[JENKINS] Archiving <https://builds.apache.org/job/Tamaya-Master-branch/ws/modules/integration/se/pom.xml>
to org.apache.tamaya.integration/tamaya-integration-se/0.1-SNAPSHOT/tamaya-integration-se-0.1-SNAPSHOT.pom
No prior successful build to compare, so performing full copy of artifacts
[JENKINS] Archiving <https://builds.apache.org/job/Tamaya-Master-branch/ws/core/pom.xml>
to org.apache.tamaya/tamaya-core/0.1-SNAPSHOT/tamaya-core-0.1-SNAPSHOT.pom
Sending artifact delta relative to Tamaya-Master-branch » Apache Tamaya - Core Implementation
Library #69
Archived 1 artifacts
Archive block size is 32768
Received 0 blocks and 4673 bytes
Compression is 0.0%
Took 0.1 sec
[JENKINS] Archiving <https://builds.apache.org/job/Tamaya-Master-branch/ws/pom.xml>
to org.apache.tamaya/tamaya-all/0.1-SNAPSHOT/tamaya-all-0.1-SNAPSHOT.pom
Sending artifact delta relative to Tamaya-Master-branch » Apache Tamaya #69
Archived 1 artifacts
Archive block size is 32768
Received 0 blocks and 23765 bytes
Compression is 0.0%
Took 72 ms
[JENKINS] Archiving <https://builds.apache.org/job/Tamaya-Master-branch/ws/modules/pom.xml>
to org.apache.tamaya.ext/tamaya-ext-all/0.1-SNAPSHOT/tamaya-ext-all-0.1-SNAPSHOT.pom
Sending artifact delta relative to Tamaya-Master-branch » Apache Tamaya Modules #69
Archived 1 artifacts
Archive block size is 32768
Received 0 blocks and 2341 bytes
Compression is 0.0%
Took 71 ms
[JENKINS] Archiving <https://builds.apache.org/job/Tamaya-Master-branch/ws/api/pom.xml>
to org.apache.tamaya/tamaya-api/0.1-SNAPSHOT/tamaya-api-0.1-SNAPSHOT.pom
Sending artifact delta relative to Tamaya-Master-branch » Apache Tamaya - API #69
Archived 1 artifacts
Archive block size is 32768
Received 0 blocks and 3147 bytes
Compression is 0.0%
Took 71 ms
[JENKINS] Archiving <https://builds.apache.org/job/Tamaya-Master-branch/ws/modules/metamodels/pom.xml>
to org.apache.tamaya.metamodels/tamaya-metamodels-all/0.1-SNAPSHOT/tamaya-metamodels-all-0.1-SNAPSHOT.pom
Sending artifact delta relative to Tamaya-Master-branch » Apache Tamaya Modules Metamodels
#69
Archived 1 artifacts
Archive block size is 32768
Received 0 blocks and 1926 bytes
Compression is 0.0%
Took 70 ms
[JENKINS] Archiving <https://builds.apache.org/job/Tamaya-Master-branch/ws/buildtools/pom.xml>
to org.apache.tamaya/buildtools/0.1-SNAPSHOT/buildtools-0.1-SNAPSHOT.pom
Sending artifact delta relative to Tamaya-Master-branch » Apache Tamaya - Build Tools #69
Archived 1 artifacts
Archive block size is 32768
Received 0 blocks and 1408 bytes
Compression is 0.0%
Took 78 ms
channel stopped

Mime
View raw message