tajo-issues mailing list archives

Site index · List index
Message view « Date » · « Thread »
Top « Date » · « Thread »
From Apache Jenkins Server <jenk...@builds.apache.org>
Subject Build failed in Jenkins: Tajo-master-nightly #878
Date Tue, 06 Oct 2015 04:47:15 GMT
See <https://builds.apache.org/job/Tajo-master-nightly/878/changes>

Changes:

[hyunsik] TAJO-1895: Add a maven profile to skip the unit tests of

------------------------------------------
Started by user hyunsik
Started by an SCM change
[EnvInject] - Loading node environment variables.
Building remotely on H4 (Mapreduce zookeeper Hadoop Pig falcon Hdfs) in workspace <https://builds.apache.org/job/Tajo-master-nightly/ws/>
 > git rev-parse --is-inside-work-tree # timeout=10
Fetching changes from the remote Git repository
 > git config remote.origin.url http://git-wip-us.apache.org/repos/asf/tajo.git # timeout=10
Cleaning workspace
 > git rev-parse --verify HEAD # timeout=10
Resetting working tree
 > git reset --hard # timeout=10
 > git clean -fdx # timeout=10
Fetching upstream changes from http://git-wip-us.apache.org/repos/asf/tajo.git
 > git --version # timeout=10
 > git -c core.askpass=true fetch --tags --progress http://git-wip-us.apache.org/repos/asf/tajo.git
+refs/heads/*:refs/remotes/origin/*
 > git rev-parse origin/master^{commit} # timeout=10
Checking out Revision 356c48efa21a1e6b0c98791ccc3578393d96f5ff (origin/master)
 > git config core.sparsecheckout # timeout=10
 > git checkout -f 356c48efa21a1e6b0c98791ccc3578393d96f5ff
 > git rev-list dd16f119c200b23e23e6859d6adf1b3e630bc825 # timeout=10
[Tajo-master-nightly] $ /bin/bash -x /tmp/hudson4325052569304314226.sh
+ export MAVEN_HOME=/home/jenkins/tools/maven/latest
+ MAVEN_HOME=/home/jenkins/tools/maven/latest
+ export PATH=/home/jenkins/tools/java/latest1.7/bin:/home/jenkins/tools/maven/latest/bin:/home/jenkins/tools/java/latest1.7/bin:/usr/local/sbin:/usr/local/bin:/usr/sbin:/usr/bin:/sbin:/bin:/usr/games:/usr/local/games
+ PATH=/home/jenkins/tools/java/latest1.7/bin:/home/jenkins/tools/maven/latest/bin:/home/jenkins/tools/java/latest1.7/bin:/usr/local/sbin:/usr/local/bin:/usr/sbin:/usr/bin:/sbin:/bin:/usr/games:/usr/local/games
+ which java
/home/jenkins/tools/java/latest1.7/bin/java
+ java -version
java version "1.7.0_25"
Java(TM) SE Runtime Environment (build 1.7.0_25-b15)
Java HotSpot(TM) Server VM (build 23.25-b01, mixed mode)
+ protoc --version
libprotoc 2.5.0
+ cd <https://builds.apache.org/job/Tajo-master-nightly/ws/>
+ /home/jenkins/tools/maven/latest/bin/mvn clean install -Pdist -Dtar
[INFO] Scanning for projects...
[INFO] ------------------------------------------------------------------------
[INFO] Reactor Build Order:
[INFO] 
[INFO] Tajo Main
[INFO] Tajo Project POM
[INFO] Tajo Maven Plugins
[INFO] Tajo Common
[INFO] Tajo Algebra
[INFO] Tajo Catalog Common
[INFO] Tajo Plan
[INFO] Tajo Rpc Common
[INFO] Tajo Protocol Buffer Rpc
[INFO] Tajo Catalog Client
[INFO] Tajo Catalog Server
[INFO] Tajo Storage Common
[INFO] Tajo HDFS Storage
[INFO] Tajo PullServer
[INFO] Tajo Client
[INFO] Tajo CLI tools
[INFO] Tajo SQL Parser
[INFO] ASM (thirdparty)
[INFO] Tajo RESTful Container
[INFO] Tajo Metrics
[INFO] Tajo Core
[INFO] Tajo RPC
[INFO] Tajo Catalog Drivers Hive
[INFO] Tajo Catalog Drivers
[INFO] Tajo Catalog
[INFO] Tajo Client Example
[INFO] Tajo HBase Storage
[INFO] Tajo Cluster Tests
[INFO] Tajo JDBC Driver
[INFO] Tajo JDBC storage common
[INFO] Tajo PostgreSQL JDBC storage
[INFO] Tajo Storage
[INFO] Tajo Distribution
[INFO] Tajo Core Tests
[INFO] 
[INFO] Using the builder org.apache.maven.lifecycle.internal.builder.singlethreaded.SingleThreadedBuilder
with a thread count of 1
[INFO]                                                                         
[INFO] ------------------------------------------------------------------------
[INFO] Building Tajo Main 0.12.0-SNAPSHOT
[INFO] ------------------------------------------------------------------------
[INFO] 
[INFO] --- maven-enforcer-plugin:1.4:enforce (clean) @ tajo-main ---
[WARNING] Rule 1: org.apache.maven.plugins.enforcer.RequireJavaVersion failed with message:
Detected JDK Version: 1.7.0-25 is not in the allowed range 1.8.
[INFO] ------------------------------------------------------------------------
[INFO] Reactor Summary:
[INFO] 
[INFO] Tajo Main ......................................... FAILURE [  0.660 s]
[INFO] Tajo Project POM .................................. SKIPPED
[INFO] Tajo Maven Plugins ................................ SKIPPED
[INFO] Tajo Common ....................................... SKIPPED
[INFO] Tajo Algebra ...................................... SKIPPED
[INFO] Tajo Catalog Common ............................... SKIPPED
[INFO] Tajo Plan ......................................... SKIPPED
[INFO] Tajo Rpc Common ................................... SKIPPED
[INFO] Tajo Protocol Buffer Rpc .......................... SKIPPED
[INFO] Tajo Catalog Client ............................... SKIPPED
[INFO] Tajo Catalog Server ............................... SKIPPED
[INFO] Tajo Storage Common ............................... SKIPPED
[INFO] Tajo HDFS Storage ................................. SKIPPED
[INFO] Tajo PullServer ................................... SKIPPED
[INFO] Tajo Client ....................................... SKIPPED
[INFO] Tajo CLI tools .................................... SKIPPED
[INFO] Tajo SQL Parser ................................... SKIPPED
[INFO] ASM (thirdparty) .................................. SKIPPED
[INFO] Tajo RESTful Container ............................ SKIPPED
[INFO] Tajo Metrics ...................................... SKIPPED
[INFO] Tajo Core ......................................... SKIPPED
[INFO] Tajo RPC .......................................... SKIPPED
[INFO] Tajo Catalog Drivers Hive ......................... SKIPPED
[INFO] Tajo Catalog Drivers .............................. SKIPPED
[INFO] Tajo Catalog ...................................... SKIPPED
[INFO] Tajo Client Example ............................... SKIPPED
[INFO] Tajo HBase Storage ................................ SKIPPED
[INFO] Tajo Cluster Tests ................................ SKIPPED
[INFO] Tajo JDBC Driver .................................. SKIPPED
[INFO] Tajo JDBC storage common .......................... SKIPPED
[INFO] Tajo PostgreSQL JDBC storage ...................... SKIPPED
[INFO] Tajo Storage ...................................... SKIPPED
[INFO] Tajo Distribution ................................. SKIPPED
[INFO] Tajo Core Tests ................................... SKIPPED
[INFO] ------------------------------------------------------------------------
[INFO] BUILD FAILURE
[INFO] ------------------------------------------------------------------------
[INFO] Total time: 1.727 s
[INFO] Finished at: 2015-10-06T04:47:50+00:00
[INFO] Final Memory: 17M/159M
[INFO] ------------------------------------------------------------------------
[ERROR] Failed to execute goal org.apache.maven.plugins:maven-enforcer-plugin:1.4:enforce
(clean) on project tajo-main: Some Enforcer rules have failed. Look above for specific messages
explaining why the rule failed. -> [Help 1]
[ERROR] 
[ERROR] To see the full stack trace of the errors, re-run Maven with the -e switch.
[ERROR] Re-run Maven using the -X switch to enable full debug logging.
[ERROR] 
[ERROR] For more information about the errors and possible solutions, please read the following
articles:
[ERROR] [Help 1] http://cwiki.apache.org/confluence/display/MAVEN/MojoExecutionException
Build step 'Execute shell' marked build as failure
Archiving artifacts
Recording test results
ERROR: Publisher 'Publish JUnit test result report' failed: No test report files were found.
Configuration error?


Mime
View raw message