tajo-issues mailing list archives

Site index · List index
Message view « Date » · « Thread »
Top « Date » · « Thread »
From Apache Jenkins Server <jenk...@builds.apache.org>
Subject Build failed in Jenkins: Tajo-master-jdk8-nightly #184
Date Mon, 05 Oct 2015 09:33:00 GMT
See <https://builds.apache.org/job/Tajo-master-jdk8-nightly/184/changes>

Changes:

[jihoonson] TAJO-1893: Remove unused import.

------------------------------------------
[...truncated 11394 lines...]
	at org.junit.runners.ParentRunner.run(ParentRunner.java:309)
	at org.apache.maven.surefire.junit4.JUnit4Provider.execute(JUnit4Provider.java:264)
	at org.apache.maven.surefire.junit4.JUnit4Provider.executeTestSet(JUnit4Provider.java:153)
	at org.apache.maven.surefire.junit4.JUnit4Provider.invoke(JUnit4Provider.java:124)
	at org.apache.maven.surefire.booter.ForkedBooter.invokeProviderInSameClassLoader(ForkedBooter.java:200)
	at org.apache.maven.surefire.booter.ForkedBooter.runSuitesInProcess(ForkedBooter.java:153)
	at org.apache.maven.surefire.booter.ForkedBooter.main(ForkedBooter.java:103)

testTablespaceHandler(org.apache.tajo.storage.pgsql.TestPgSQLJdbcTableSpace)  Time elapsed:
0.001 sec  <<< ERROR!
java.lang.NoClassDefFoundError: Could not initialize class org.apache.tajo.storage.pgsql.TestPgSQLJdbcTableSpace
	at sun.reflect.NativeConstructorAccessorImpl.newInstance0(Native Method)
	at sun.reflect.NativeConstructorAccessorImpl.newInstance(NativeConstructorAccessorImpl.java:62)
	at sun.reflect.DelegatingConstructorAccessorImpl.newInstance(DelegatingConstructorAccessorImpl.java:45)
	at java.lang.reflect.Constructor.newInstance(Constructor.java:422)
	at org.junit.runners.BlockJUnit4ClassRunner.createTest(BlockJUnit4ClassRunner.java:195)
	at org.junit.runners.BlockJUnit4ClassRunner$1.runReflectiveCall(BlockJUnit4ClassRunner.java:244)
	at org.junit.internal.runners.model.ReflectiveCallable.run(ReflectiveCallable.java:12)
	at org.junit.runners.BlockJUnit4ClassRunner.methodBlock(BlockJUnit4ClassRunner.java:241)
	at org.junit.runners.BlockJUnit4ClassRunner.runChild(BlockJUnit4ClassRunner.java:70)
	at org.junit.runners.BlockJUnit4ClassRunner.runChild(BlockJUnit4ClassRunner.java:50)
	at org.junit.runners.ParentRunner$3.run(ParentRunner.java:238)
	at org.junit.runners.ParentRunner$1.schedule(ParentRunner.java:63)
	at org.junit.runners.ParentRunner.runChildren(ParentRunner.java:236)
	at org.junit.runners.ParentRunner.access$000(ParentRunner.java:53)
	at org.junit.runners.ParentRunner$2.evaluate(ParentRunner.java:229)
	at org.junit.runners.ParentRunner.run(ParentRunner.java:309)
	at org.apache.maven.surefire.junit4.JUnit4Provider.execute(JUnit4Provider.java:264)
	at org.apache.maven.surefire.junit4.JUnit4Provider.executeTestSet(JUnit4Provider.java:153)
	at org.apache.maven.surefire.junit4.JUnit4Provider.invoke(JUnit4Provider.java:124)
	at org.apache.maven.surefire.booter.ForkedBooter.invokeProviderInSameClassLoader(ForkedBooter.java:200)
	at org.apache.maven.surefire.booter.ForkedBooter.runSuitesInProcess(ForkedBooter.java:153)
	at org.apache.maven.surefire.booter.ForkedBooter.main(ForkedBooter.java:103)

testGetSplits(org.apache.tajo.storage.pgsql.TestPgSQLJdbcTableSpace)  Time elapsed: 0 sec
 <<< ERROR!
java.lang.NoClassDefFoundError: Could not initialize class org.apache.tajo.storage.pgsql.TestPgSQLJdbcTableSpace
	at sun.reflect.NativeConstructorAccessorImpl.newInstance0(Native Method)
	at sun.reflect.NativeConstructorAccessorImpl.newInstance(NativeConstructorAccessorImpl.java:62)
	at sun.reflect.DelegatingConstructorAccessorImpl.newInstance(DelegatingConstructorAccessorImpl.java:45)
	at java.lang.reflect.Constructor.newInstance(Constructor.java:422)
	at org.junit.runners.BlockJUnit4ClassRunner.createTest(BlockJUnit4ClassRunner.java:195)
	at org.junit.runners.BlockJUnit4ClassRunner$1.runReflectiveCall(BlockJUnit4ClassRunner.java:244)
	at org.junit.internal.runners.model.ReflectiveCallable.run(ReflectiveCallable.java:12)
	at org.junit.runners.BlockJUnit4ClassRunner.methodBlock(BlockJUnit4ClassRunner.java:241)
	at org.junit.runners.BlockJUnit4ClassRunner.runChild(BlockJUnit4ClassRunner.java:70)
	at org.junit.runners.BlockJUnit4ClassRunner.runChild(BlockJUnit4ClassRunner.java:50)
	at org.junit.runners.ParentRunner$3.run(ParentRunner.java:238)
	at org.junit.runners.ParentRunner$1.schedule(ParentRunner.java:63)
	at org.junit.runners.ParentRunner.runChildren(ParentRunner.java:236)
	at org.junit.runners.ParentRunner.access$000(ParentRunner.java:53)
	at org.junit.runners.ParentRunner$2.evaluate(ParentRunner.java:229)
	at org.junit.runners.ParentRunner.run(ParentRunner.java:309)
	at org.apache.maven.surefire.junit4.JUnit4Provider.execute(JUnit4Provider.java:264)
	at org.apache.maven.surefire.junit4.JUnit4Provider.executeTestSet(JUnit4Provider.java:153)
	at org.apache.maven.surefire.junit4.JUnit4Provider.invoke(JUnit4Provider.java:124)
	at org.apache.maven.surefire.booter.ForkedBooter.invokeProviderInSameClassLoader(ForkedBooter.java:200)
	at org.apache.maven.surefire.booter.ForkedBooter.runSuitesInProcess(ForkedBooter.java:153)
	at org.apache.maven.surefire.booter.ForkedBooter.main(ForkedBooter.java:103)

Running org.apache.tajo.storage.pgsql.TestPgSQLMetadataProvider
Tests run: 1, Failures: 0, Errors: 1, Skipped: 0, Time elapsed: 0.001 sec <<< FAILURE!
- in org.apache.tajo.storage.pgsql.TestPgSQLMetadataProvider
org.apache.tajo.storage.pgsql.TestPgSQLMetadataProvider  Time elapsed: 0 sec  <<<
ERROR!
java.lang.NoClassDefFoundError: Could not initialize class org.apache.tajo.storage.pgsql.PgSQLTestServer
	at org.apache.tajo.storage.pgsql.TestPgSQLMetadataProvider.<clinit>(TestPgSQLMetadataProvider.java:34)

Running org.apache.tajo.storage.pgsql.TestPgSQLEndPointTests
2015-10-05 09:33:27,896 INFO: org.apache.tajo.session.SessionManager (createSession(79)) -
Session 290fcf9f-877e-46b7-9aa0-51347bc0747a is created.
Tests run: 3, Failures: 0, Errors: 3, Skipped: 0, Time elapsed: 0 sec <<< FAILURE!
- in org.apache.tajo.storage.pgsql.TestPgSQLEndPointTests
org.apache.tajo.storage.pgsql.TestPgSQLEndPointTests  Time elapsed: 0 sec  <<< ERROR!
java.lang.NoClassDefFoundError: Could not initialize class org.apache.tajo.storage.pgsql.PgSQLTestServer
	at org.apache.tajo.storage.pgsql.TestPgSQLEndPointTests.<clinit>(TestPgSQLEndPointTests.java:36)

org.apache.tajo.storage.pgsql.TestPgSQLEndPointTests  Time elapsed: 0 sec  <<< ERROR!
java.lang.NoClassDefFoundError: Could not initialize class org.apache.tajo.storage.pgsql.TestPgSQLEndPointTests
	at sun.reflect.NativeMethodAccessorImpl.invoke0(Native Method)
	at sun.reflect.NativeMethodAccessorImpl.invoke(NativeMethodAccessorImpl.java:62)
	at sun.reflect.DelegatingMethodAccessorImpl.invoke(DelegatingMethodAccessorImpl.java:43)
	at java.lang.reflect.Method.invoke(Method.java:497)
	at org.junit.runners.model.FrameworkMethod$1.runReflectiveCall(FrameworkMethod.java:47)
	at org.junit.internal.runners.model.ReflectiveCallable.run(ReflectiveCallable.java:12)
	at org.junit.runners.model.FrameworkMethod.invokeExplosively(FrameworkMethod.java:44)
	at org.junit.internal.runners.statements.RunAfters.evaluate(RunAfters.java:33)
	at org.junit.runners.ParentRunner.run(ParentRunner.java:309)
	at org.apache.maven.surefire.junit4.JUnit4Provider.execute(JUnit4Provider.java:264)
	at org.apache.maven.surefire.junit4.JUnit4Provider.executeTestSet(JUnit4Provider.java:153)
	at org.apache.maven.surefire.junit4.JUnit4Provider.invoke(JUnit4Provider.java:124)
	at org.apache.maven.surefire.booter.ForkedBooter.invokeProviderInSameClassLoader(ForkedBooter.java:200)
	at org.apache.maven.surefire.booter.ForkedBooter.runSuitesInProcess(ForkedBooter.java:153)
	at org.apache.maven.surefire.booter.ForkedBooter.main(ForkedBooter.java:103)

org.apache.tajo.storage.pgsql.TestPgSQLEndPointTests  Time elapsed: 0 sec  <<< ERROR!
java.lang.NullPointerException: null
	at org.apache.tajo.QueryTestCaseBase.tearDownClass(QueryTestCaseBase.java:229)
	at sun.reflect.NativeMethodAccessorImpl.invoke0(Native Method)
	at sun.reflect.NativeMethodAccessorImpl.invoke(NativeMethodAccessorImpl.java:62)
	at sun.reflect.DelegatingMethodAccessorImpl.invoke(DelegatingMethodAccessorImpl.java:43)
	at java.lang.reflect.Method.invoke(Method.java:497)
	at org.junit.runners.model.FrameworkMethod$1.runReflectiveCall(FrameworkMethod.java:47)
	at org.junit.internal.runners.model.ReflectiveCallable.run(ReflectiveCallable.java:12)
	at org.junit.runners.model.FrameworkMethod.invokeExplosively(FrameworkMethod.java:44)
	at org.junit.internal.runners.statements.RunAfters.evaluate(RunAfters.java:33)
	at org.junit.runners.ParentRunner.run(ParentRunner.java:309)
	at org.apache.maven.surefire.junit4.JUnit4Provider.execute(JUnit4Provider.java:264)
	at org.apache.maven.surefire.junit4.JUnit4Provider.executeTestSet(JUnit4Provider.java:153)
	at org.apache.maven.surefire.junit4.JUnit4Provider.invoke(JUnit4Provider.java:124)
	at org.apache.maven.surefire.booter.ForkedBooter.invokeProviderInSameClassLoader(ForkedBooter.java:200)
	at org.apache.maven.surefire.booter.ForkedBooter.runSuitesInProcess(ForkedBooter.java:153)
	at org.apache.maven.surefire.booter.ForkedBooter.main(ForkedBooter.java:103)

Running org.apache.tajo.storage.pgsql.TestPgSQLQueryTests
2015-10-05 09:33:27,918 INFO: org.apache.tajo.session.SessionManager (createSession(79)) -
Session 9402f832-e36f-4ed3-ad61-d3d2f59c246f is created.
Tests run: 2, Failures: 0, Errors: 2, Skipped: 0, Time elapsed: 0 sec <<< FAILURE!
- in org.apache.tajo.storage.pgsql.TestPgSQLQueryTests
org.apache.tajo.storage.pgsql.TestPgSQLQueryTests  Time elapsed: 0 sec  <<< ERROR!
java.lang.NoClassDefFoundError: Could not initialize class org.apache.tajo.storage.pgsql.PgSQLTestServer
	at org.apache.tajo.storage.pgsql.TestPgSQLQueryTests.<clinit>(TestPgSQLQueryTests.java:35)

org.apache.tajo.storage.pgsql.TestPgSQLQueryTests  Time elapsed: 0 sec  <<< ERROR!
java.lang.NullPointerException: null
	at org.apache.tajo.QueryTestCaseBase.tearDownClass(QueryTestCaseBase.java:229)
	at sun.reflect.NativeMethodAccessorImpl.invoke0(Native Method)
	at sun.reflect.NativeMethodAccessorImpl.invoke(NativeMethodAccessorImpl.java:62)
	at sun.reflect.DelegatingMethodAccessorImpl.invoke(DelegatingMethodAccessorImpl.java:43)
	at java.lang.reflect.Method.invoke(Method.java:497)
	at org.junit.runners.model.FrameworkMethod$1.runReflectiveCall(FrameworkMethod.java:47)
	at org.junit.internal.runners.model.ReflectiveCallable.run(ReflectiveCallable.java:12)
	at org.junit.runners.model.FrameworkMethod.invokeExplosively(FrameworkMethod.java:44)
	at org.junit.internal.runners.statements.RunAfters.evaluate(RunAfters.java:33)
	at org.junit.runners.ParentRunner.run(ParentRunner.java:309)
	at org.apache.maven.surefire.junit4.JUnit4Provider.execute(JUnit4Provider.java:264)
	at org.apache.maven.surefire.junit4.JUnit4Provider.executeTestSet(JUnit4Provider.java:153)
	at org.apache.maven.surefire.junit4.JUnit4Provider.invoke(JUnit4Provider.java:124)
	at org.apache.maven.surefire.booter.ForkedBooter.invokeProviderInSameClassLoader(ForkedBooter.java:200)
	at org.apache.maven.surefire.booter.ForkedBooter.runSuitesInProcess(ForkedBooter.java:153)
	at org.apache.maven.surefire.booter.ForkedBooter.main(ForkedBooter.java:103)

2015-10-05 09:33:27,928 INFO: org.apache.tajo.worker.TajoWorker (run(564)) - ============================================
2015-10-05 09:33:27,929 INFO: org.apache.tajo.worker.TajoWorker (run(565)) - TajoWorker received
SIGINT Signal
2015-10-05 09:33:27,929 INFO: org.apache.tajo.worker.TajoWorker (run(566)) - ============================================
2015-10-05 09:33:27,934 INFO: org.apache.tajo.util.history.HistoryCleaner (run(136)) - History
cleaner stopped
2015-10-05 09:33:27,934 INFO: org.apache.tajo.util.history.HistoryWriter (run(275)) - HistoryWriter_asf907.gq1.ygridcore.net_24226
stopped.
2015-10-05 09:33:27,940 INFO: org.apache.tajo.worker.NodeStatusUpdater (serviceStop(115))
- NodeStatusUpdater stopped.
2015-10-05 09:33:27,941 INFO: org.apache.tajo.worker.NodeStatusUpdater (run(265)) - Heartbeat
Thread stopped.
2015-10-05 09:33:27,944 INFO: org.apache.tajo.rpc.NettyServerBase (shutdown(173)) - Rpc (QueryMasterProtocol)
listened on 0:0:0:0:0:0:0:0:24228) shutdown
2015-10-05 09:33:27,944 INFO: org.apache.tajo.querymaster.QueryMasterManagerService (serviceStop(106))
- QueryMasterManagerService stopped
2015-10-05 09:33:27,945 INFO: org.apache.tajo.querymaster.QueryMaster (run(427)) - QueryMaster
heartbeat thread stopped
2015-10-05 09:33:27,946 INFO: org.apache.tajo.querymaster.QueryMaster (serviceStop(162)) -
QueryMaster stopped
2015-10-05 09:33:27,947 INFO: org.apache.tajo.worker.TajoWorkerClientService (stop(98)) -
TajoWorkerClientService stopping
2015-10-05 09:33:27,948 INFO: org.apache.tajo.rpc.NettyServerBase (shutdown(173)) - Rpc (QueryMasterClientProtocol)
listened on 0:0:0:0:0:0:0:0:24227) shutdown
2015-10-05 09:33:27,948 INFO: org.apache.tajo.worker.TajoWorkerClientService (stop(102)) -
TajoWorkerClientService stopped
2015-10-05 09:33:27,950 INFO: org.apache.tajo.rpc.NettyServerBase (shutdown(173)) - Rpc (TajoWorkerProtocol)
listened on 0:0:0:0:0:0:0:0:24226) shutdown
2015-10-05 09:33:27,950 INFO: org.apache.tajo.worker.TajoWorkerManagerService (serviceStop(93))
- TajoWorkerManagerService stopped
2015-10-05 09:33:27,952 INFO: org.apache.tajo.worker.TajoWorker (serviceStop(374)) - TajoWorker
main thread exiting
2015-10-05 09:33:30,167 INFO: org.apache.tajo.master.TajoMaster (run(577)) - ============================================
2015-10-05 09:33:30,168 INFO: org.apache.tajo.master.TajoMaster (run(578)) - TajoMaster received
SIGINT Signal
2015-10-05 09:33:30,168 INFO: org.apache.tajo.master.TajoMaster (run(579)) - ============================================
2015-10-05 09:33:30,170 INFO: org.apache.tajo.rpc.NettyServerBase (shutdown(173)) - Rpc (Tajo-REST)
listened on 0:0:0:0:0:0:0:0:24225) shutdown
2015-10-05 09:33:30,170 INFO: org.apache.tajo.ws.rs.TajoRestService (serviceStop(129)) - Tajo
Rest Service stopped.
2015-10-05 09:33:30,172 INFO: org.apache.tajo.util.history.HistoryWriter (run(275)) - HistoryWriter_127.0.0.1_24224
stopped.
2015-10-05 09:33:30,172 INFO: org.apache.tajo.util.history.HistoryCleaner (run(136)) - History
cleaner stopped
2015-10-05 09:33:30,175 INFO: org.apache.tajo.rpc.NettyServerBase (shutdown(173)) - Rpc (QueryCoordinatorProtocol)
listened on 127.0.0.1:24224) shutdown
2015-10-05 09:33:30,176 INFO: org.apache.tajo.rpc.NettyServerBase (shutdown(173)) - Rpc (TajoMasterClientProtocol)
listened on 127.0.0.1:24223) shutdown
2015-10-05 09:33:30,181 INFO: org.apache.tajo.catalog.CatalogServer (serviceStop(186)) - Catalog
Server (127.0.0.1:24222) shutdown
2015-10-05 09:33:30,191 INFO: org.apache.tajo.rpc.NettyServerBase (shutdown(173)) - Rpc (CatalogProtocol)
listened on 127.0.0.1:24222) shutdown
2015-10-05 09:33:30,197 INFO: org.apache.tajo.catalog.store.DerbyStore (close(3157)) - Close
database (jdbc:derby:memory:<https://builds.apache.org/job/Tajo-master-jdk8-nightly/ws/tajo-storage/tajo-storage-pgsql/target/test-data/92b7f2b6-88b3-4340-8f5a-cd928b648dd1/db;create=true)>
2015-10-05 09:33:30,199 INFO: org.apache.tajo.rpc.NettyServerBase (shutdown(173)) - Rpc (TajoResourceTrackerProtocol)
listened on 127.0.0.1:24221) shutdown
2015-10-05 09:33:30,200 INFO: org.apache.tajo.master.TajoMaster (serviceStop(437)) - Tajo
Master main thread exiting
2015-10-05 09:33:30,254 INFO: org.apache.tajo.catalog.store.DerbyStore (shutdown(68)) - Derby
shutdown complete normally.
2015-10-05 09:33:30,254 INFO: org.apache.tajo.catalog.store.DerbyStore (shutdown(75)) - Shutdown
database

Results :

Tests in error: 
  TestPgSQLSimpleQueryTests.<clinit>:26 ExceptionInInitializer
  TestPgSQLSimpleQueryTests>QueryTestCaseBase.tearDownClass:229 » NullPointer
  TestPgSQLJdbcTableSpace.<clinit>:44 NoClassDefFound Could not initialize class...
  TestPgSQLJdbcTableSpace.testConnPropertiesNegative » NoClassDefFound Could not...
  TestPgSQLJdbcTableSpace.testConnProperties » NoClassDefFound Could not initial...
  TestPgSQLJdbcTableSpace.testDropTable » NoClassDefFound Could not initialize c...
  TestPgSQLJdbcTableSpace.testTemporaryTablespace » NoClassDefFound Could not in...
  TestPgSQLJdbcTableSpace.testTablespaceHandler » NoClassDefFound Could not init...
  TestPgSQLJdbcTableSpace.testGetSplits » NoClassDefFound Could not initialize c...
  TestPgSQLMetadataProvider.<clinit>:34 NoClassDefFound Could not initialize cla...
  TestPgSQLEndPointTests.<clinit>:36 NoClassDefFound Could not initialize class ...
  TestPgSQLEndPointTests.org.apache.tajo.storage.pgsql.TestPgSQLEndPointTests » NoClassDefFound
  TestPgSQLEndPointTests>QueryTestCaseBase.tearDownClass:229 » NullPointer
  TestPgSQLQueryTests.<clinit>:35 NoClassDefFound Could not initialize class org...
  TestPgSQLQueryTests>QueryTestCaseBase.tearDownClass:229 » NullPointer

Tests run: 15, Failures: 0, Errors: 15, Skipped: 0

[INFO] ------------------------------------------------------------------------
[INFO] Reactor Summary:
[INFO] 
[INFO] Tajo Main ......................................... SUCCESS [  2.070 s]
[INFO] Tajo Project POM .................................. SUCCESS [  1.824 s]
[INFO] Tajo Maven Plugins ................................ SUCCESS [  3.537 s]
[INFO] Tajo Common ....................................... SUCCESS [ 34.367 s]
[INFO] Tajo Algebra ...................................... SUCCESS [  2.584 s]
[INFO] Tajo Catalog Common ............................... SUCCESS [  6.880 s]
[INFO] Tajo Plan ......................................... SUCCESS [  9.391 s]
[INFO] Tajo Rpc Common ................................... SUCCESS [  1.444 s]
[INFO] Tajo Protocol Buffer Rpc .......................... SUCCESS [ 50.617 s]
[INFO] Tajo Catalog Client ............................... SUCCESS [  1.677 s]
[INFO] Tajo Catalog Server ............................... SUCCESS [ 12.368 s]
[INFO] Tajo Storage Common ............................... SUCCESS [  3.191 s]
[INFO] Tajo HDFS Storage ................................. SUCCESS [ 54.061 s]
[INFO] Tajo PullServer ................................... SUCCESS [  1.062 s]
[INFO] Tajo Client ....................................... SUCCESS [  2.837 s]
[INFO] Tajo CLI tools .................................... SUCCESS [  1.775 s]
[INFO] Tajo SQL Parser ................................... SUCCESS [  4.480 s]
[INFO] ASM (thirdparty) .................................. SUCCESS [  2.452 s]
[INFO] Tajo RESTful Container ............................ SUCCESS [  4.087 s]
[INFO] Tajo Metrics ...................................... SUCCESS [  1.400 s]
[INFO] Tajo Core ......................................... SUCCESS [  7.252 s]
[INFO] Tajo RPC .......................................... SUCCESS [  0.934 s]
[INFO] Tajo Catalog Drivers Hive ......................... SUCCESS [ 10.529 s]
[INFO] Tajo Catalog Drivers .............................. SUCCESS [  0.073 s]
[INFO] Tajo Catalog ...................................... SUCCESS [  0.976 s]
[INFO] Tajo Client Example ............................... SUCCESS [  1.024 s]
[INFO] Tajo HBase Storage ................................ SUCCESS [  3.706 s]
[INFO] Tajo Cluster Tests ................................ SUCCESS [  2.562 s]
[INFO] Tajo JDBC Driver .................................. SUCCESS [ 40.806 s]
[INFO] Tajo JDBC storage common .......................... SUCCESS [  0.937 s]
[INFO] Tajo PostgreSQL JDBC storage ...................... FAILURE [ 19.302 s]
[INFO] Tajo Storage ...................................... SKIPPED
[INFO] Tajo Distribution ................................. SKIPPED
[INFO] Tajo Core Tests ................................... SKIPPED
[INFO] ------------------------------------------------------------------------
[INFO] BUILD FAILURE
[INFO] ------------------------------------------------------------------------
[INFO] Total time: 04:51 min
[INFO] Finished at: 2015-10-05T09:33:30+00:00
[INFO] Final Memory: 179M/2090M
[INFO] ------------------------------------------------------------------------
[ERROR] Failed to execute goal org.apache.maven.plugins:maven-surefire-plugin:2.17:test (default-test)
on project tajo-storage-pgsql: There are test failures.
[ERROR] 
[ERROR] Please refer to <https://builds.apache.org/job/Tajo-master-jdk8-nightly/ws/tajo-storage/tajo-storage-pgsql/target/surefire-reports>
for the individual test results.
[ERROR] -> [Help 1]
[ERROR] 
[ERROR] To see the full stack trace of the errors, re-run Maven with the -e switch.
[ERROR] Re-run Maven using the -X switch to enable full debug logging.
[ERROR] 
[ERROR] For more information about the errors and possible solutions, please read the following
articles:
[ERROR] [Help 1] http://cwiki.apache.org/confluence/display/MAVEN/MojoFailureException
[ERROR] 
[ERROR] After correcting the problems, you can resume the build with the command
[ERROR]   mvn <goals> -rf :tajo-storage-pgsql
Build step 'Execute shell' marked build as failure
Archiving artifacts
Recording test results

Mime
View raw message