tajo-issues mailing list archives

Site index · List index
Message view « Date » · « Thread »
Top « Date » · « Thread »
From Apache Jenkins Server <jenk...@builds.apache.org>
Subject Build failed in Jenkins: Tajo-master-jdk8-nightly #185
Date Mon, 05 Oct 2015 14:18:41 GMT
See <https://builds.apache.org/job/Tajo-master-jdk8-nightly/185/changes>

Changes:

[jihoonson] TAJO-1899: Calling 'Arrays.asList()' with too few arguments cause memory

------------------------------------------
[...truncated 11422 lines...]
	at org.junit.runners.ParentRunner$2.evaluate(ParentRunner.java:229)
	at org.junit.runners.ParentRunner.run(ParentRunner.java:309)
	at org.apache.maven.surefire.junit4.JUnit4Provider.execute(JUnit4Provider.java:264)
	at org.apache.maven.surefire.junit4.JUnit4Provider.executeTestSet(JUnit4Provider.java:153)
	at org.apache.maven.surefire.junit4.JUnit4Provider.invoke(JUnit4Provider.java:124)
	at org.apache.maven.surefire.booter.ForkedBooter.invokeProviderInSameClassLoader(ForkedBooter.java:200)
	at org.apache.maven.surefire.booter.ForkedBooter.runSuitesInProcess(ForkedBooter.java:153)
	at org.apache.maven.surefire.booter.ForkedBooter.main(ForkedBooter.java:103)

testConnProperties(org.apache.tajo.storage.pgsql.TestPgSQLJdbcTableSpace)  Time elapsed: 0
sec  <<< ERROR!
java.lang.NoClassDefFoundError: Could not initialize class org.apache.tajo.storage.pgsql.TestPgSQLJdbcTableSpace
	at sun.reflect.NativeConstructorAccessorImpl.newInstance0(Native Method)
	at sun.reflect.NativeConstructorAccessorImpl.newInstance(NativeConstructorAccessorImpl.java:62)
	at sun.reflect.DelegatingConstructorAccessorImpl.newInstance(DelegatingConstructorAccessorImpl.java:45)
	at java.lang.reflect.Constructor.newInstance(Constructor.java:422)
	at org.junit.runners.BlockJUnit4ClassRunner.createTest(BlockJUnit4ClassRunner.java:195)
	at org.junit.runners.BlockJUnit4ClassRunner$1.runReflectiveCall(BlockJUnit4ClassRunner.java:244)
	at org.junit.internal.runners.model.ReflectiveCallable.run(ReflectiveCallable.java:12)
	at org.junit.runners.BlockJUnit4ClassRunner.methodBlock(BlockJUnit4ClassRunner.java:241)
	at org.junit.runners.BlockJUnit4ClassRunner.runChild(BlockJUnit4ClassRunner.java:70)
	at org.junit.runners.BlockJUnit4ClassRunner.runChild(BlockJUnit4ClassRunner.java:50)
	at org.junit.runners.ParentRunner$3.run(ParentRunner.java:238)
	at org.junit.runners.ParentRunner$1.schedule(ParentRunner.java:63)
	at org.junit.runners.ParentRunner.runChildren(ParentRunner.java:236)
	at org.junit.runners.ParentRunner.access$000(ParentRunner.java:53)
	at org.junit.runners.ParentRunner$2.evaluate(ParentRunner.java:229)
	at org.junit.runners.ParentRunner.run(ParentRunner.java:309)
	at org.apache.maven.surefire.junit4.JUnit4Provider.execute(JUnit4Provider.java:264)
	at org.apache.maven.surefire.junit4.JUnit4Provider.executeTestSet(JUnit4Provider.java:153)
	at org.apache.maven.surefire.junit4.JUnit4Provider.invoke(JUnit4Provider.java:124)
	at org.apache.maven.surefire.booter.ForkedBooter.invokeProviderInSameClassLoader(ForkedBooter.java:200)
	at org.apache.maven.surefire.booter.ForkedBooter.runSuitesInProcess(ForkedBooter.java:153)
	at org.apache.maven.surefire.booter.ForkedBooter.main(ForkedBooter.java:103)

testDropTable(org.apache.tajo.storage.pgsql.TestPgSQLJdbcTableSpace)  Time elapsed: 0 sec
 <<< ERROR!
java.lang.NoClassDefFoundError: Could not initialize class org.apache.tajo.storage.pgsql.TestPgSQLJdbcTableSpace
	at sun.reflect.NativeConstructorAccessorImpl.newInstance0(Native Method)
	at sun.reflect.NativeConstructorAccessorImpl.newInstance(NativeConstructorAccessorImpl.java:62)
	at sun.reflect.DelegatingConstructorAccessorImpl.newInstance(DelegatingConstructorAccessorImpl.java:45)
	at java.lang.reflect.Constructor.newInstance(Constructor.java:422)
	at org.junit.runners.BlockJUnit4ClassRunner.createTest(BlockJUnit4ClassRunner.java:195)
	at org.junit.runners.BlockJUnit4ClassRunner$1.runReflectiveCall(BlockJUnit4ClassRunner.java:244)
	at org.junit.internal.runners.model.ReflectiveCallable.run(ReflectiveCallable.java:12)
	at org.junit.runners.BlockJUnit4ClassRunner.methodBlock(BlockJUnit4ClassRunner.java:241)
	at org.junit.runners.BlockJUnit4ClassRunner.runChild(BlockJUnit4ClassRunner.java:70)
	at org.junit.runners.BlockJUnit4ClassRunner.runChild(BlockJUnit4ClassRunner.java:50)
	at org.junit.runners.ParentRunner$3.run(ParentRunner.java:238)
	at org.junit.runners.ParentRunner$1.schedule(ParentRunner.java:63)
	at org.junit.runners.ParentRunner.runChildren(ParentRunner.java:236)
	at org.junit.runners.ParentRunner.access$000(ParentRunner.java:53)
	at org.junit.runners.ParentRunner$2.evaluate(ParentRunner.java:229)
	at org.junit.runners.ParentRunner.run(ParentRunner.java:309)
	at org.apache.maven.surefire.junit4.JUnit4Provider.execute(JUnit4Provider.java:264)
	at org.apache.maven.surefire.junit4.JUnit4Provider.executeTestSet(JUnit4Provider.java:153)
	at org.apache.maven.surefire.junit4.JUnit4Provider.invoke(JUnit4Provider.java:124)
	at org.apache.maven.surefire.booter.ForkedBooter.invokeProviderInSameClassLoader(ForkedBooter.java:200)
	at org.apache.maven.surefire.booter.ForkedBooter.runSuitesInProcess(ForkedBooter.java:153)
	at org.apache.maven.surefire.booter.ForkedBooter.main(ForkedBooter.java:103)

testTemporaryTablespace(org.apache.tajo.storage.pgsql.TestPgSQLJdbcTableSpace)  Time elapsed:
0 sec  <<< ERROR!
java.lang.NoClassDefFoundError: Could not initialize class org.apache.tajo.storage.pgsql.TestPgSQLJdbcTableSpace
	at sun.reflect.NativeConstructorAccessorImpl.newInstance0(Native Method)
	at sun.reflect.NativeConstructorAccessorImpl.newInstance(NativeConstructorAccessorImpl.java:62)
	at sun.reflect.DelegatingConstructorAccessorImpl.newInstance(DelegatingConstructorAccessorImpl.java:45)
	at java.lang.reflect.Constructor.newInstance(Constructor.java:422)
	at org.junit.runners.BlockJUnit4ClassRunner.createTest(BlockJUnit4ClassRunner.java:195)
	at org.junit.runners.BlockJUnit4ClassRunner$1.runReflectiveCall(BlockJUnit4ClassRunner.java:244)
	at org.junit.internal.runners.model.ReflectiveCallable.run(ReflectiveCallable.java:12)
	at org.junit.runners.BlockJUnit4ClassRunner.methodBlock(BlockJUnit4ClassRunner.java:241)
	at org.junit.runners.BlockJUnit4ClassRunner.runChild(BlockJUnit4ClassRunner.java:70)
	at org.junit.runners.BlockJUnit4ClassRunner.runChild(BlockJUnit4ClassRunner.java:50)
	at org.junit.runners.ParentRunner$3.run(ParentRunner.java:238)
	at org.junit.runners.ParentRunner$1.schedule(ParentRunner.java:63)
	at org.junit.runners.ParentRunner.runChildren(ParentRunner.java:236)
	at org.junit.runners.ParentRunner.access$000(ParentRunner.java:53)
	at org.junit.runners.ParentRunner$2.evaluate(ParentRunner.java:229)
	at org.junit.runners.ParentRunner.run(ParentRunner.java:309)
	at org.apache.maven.surefire.junit4.JUnit4Provider.execute(JUnit4Provider.java:264)
	at org.apache.maven.surefire.junit4.JUnit4Provider.executeTestSet(JUnit4Provider.java:153)
	at org.apache.maven.surefire.junit4.JUnit4Provider.invoke(JUnit4Provider.java:124)
	at org.apache.maven.surefire.booter.ForkedBooter.invokeProviderInSameClassLoader(ForkedBooter.java:200)
	at org.apache.maven.surefire.booter.ForkedBooter.runSuitesInProcess(ForkedBooter.java:153)
	at org.apache.maven.surefire.booter.ForkedBooter.main(ForkedBooter.java:103)

testTablespaceHandler(org.apache.tajo.storage.pgsql.TestPgSQLJdbcTableSpace)  Time elapsed:
0 sec  <<< ERROR!
java.lang.NoClassDefFoundError: Could not initialize class org.apache.tajo.storage.pgsql.TestPgSQLJdbcTableSpace
	at sun.reflect.NativeConstructorAccessorImpl.newInstance0(Native Method)
	at sun.reflect.NativeConstructorAccessorImpl.newInstance(NativeConstructorAccessorImpl.java:62)
	at sun.reflect.DelegatingConstructorAccessorImpl.newInstance(DelegatingConstructorAccessorImpl.java:45)
	at java.lang.reflect.Constructor.newInstance(Constructor.java:422)
	at org.junit.runners.BlockJUnit4ClassRunner.createTest(BlockJUnit4ClassRunner.java:195)
	at org.junit.runners.BlockJUnit4ClassRunner$1.runReflectiveCall(BlockJUnit4ClassRunner.java:244)
	at org.junit.internal.runners.model.ReflectiveCallable.run(ReflectiveCallable.java:12)
	at org.junit.runners.BlockJUnit4ClassRunner.methodBlock(BlockJUnit4ClassRunner.java:241)
	at org.junit.runners.BlockJUnit4ClassRunner.runChild(BlockJUnit4ClassRunner.java:70)
	at org.junit.runners.BlockJUnit4ClassRunner.runChild(BlockJUnit4ClassRunner.java:50)
	at org.junit.runners.ParentRunner$3.run(ParentRunner.java:238)
	at org.junit.runners.ParentRunner$1.schedule(ParentRunner.java:63)
	at org.junit.runners.ParentRunner.runChildren(ParentRunner.java:236)
	at org.junit.runners.ParentRunner.access$000(ParentRunner.java:53)
	at org.junit.runners.ParentRunner$2.evaluate(ParentRunner.java:229)
	at org.junit.runners.ParentRunner.run(ParentRunner.java:309)
	at org.apache.maven.surefire.junit4.JUnit4Provider.execute(JUnit4Provider.java:264)
	at org.apache.maven.surefire.junit4.JUnit4Provider.executeTestSet(JUnit4Provider.java:153)
	at org.apache.maven.surefire.junit4.JUnit4Provider.invoke(JUnit4Provider.java:124)
	at org.apache.maven.surefire.booter.ForkedBooter.invokeProviderInSameClassLoader(ForkedBooter.java:200)
	at org.apache.maven.surefire.booter.ForkedBooter.runSuitesInProcess(ForkedBooter.java:153)
	at org.apache.maven.surefire.booter.ForkedBooter.main(ForkedBooter.java:103)

testGetSplits(org.apache.tajo.storage.pgsql.TestPgSQLJdbcTableSpace)  Time elapsed: 0 sec
 <<< ERROR!
java.lang.NoClassDefFoundError: Could not initialize class org.apache.tajo.storage.pgsql.TestPgSQLJdbcTableSpace
	at sun.reflect.NativeConstructorAccessorImpl.newInstance0(Native Method)
	at sun.reflect.NativeConstructorAccessorImpl.newInstance(NativeConstructorAccessorImpl.java:62)
	at sun.reflect.DelegatingConstructorAccessorImpl.newInstance(DelegatingConstructorAccessorImpl.java:45)
	at java.lang.reflect.Constructor.newInstance(Constructor.java:422)
	at org.junit.runners.BlockJUnit4ClassRunner.createTest(BlockJUnit4ClassRunner.java:195)
	at org.junit.runners.BlockJUnit4ClassRunner$1.runReflectiveCall(BlockJUnit4ClassRunner.java:244)
	at org.junit.internal.runners.model.ReflectiveCallable.run(ReflectiveCallable.java:12)
	at org.junit.runners.BlockJUnit4ClassRunner.methodBlock(BlockJUnit4ClassRunner.java:241)
	at org.junit.runners.BlockJUnit4ClassRunner.runChild(BlockJUnit4ClassRunner.java:70)
	at org.junit.runners.BlockJUnit4ClassRunner.runChild(BlockJUnit4ClassRunner.java:50)
	at org.junit.runners.ParentRunner$3.run(ParentRunner.java:238)
	at org.junit.runners.ParentRunner$1.schedule(ParentRunner.java:63)
	at org.junit.runners.ParentRunner.runChildren(ParentRunner.java:236)
	at org.junit.runners.ParentRunner.access$000(ParentRunner.java:53)
	at org.junit.runners.ParentRunner$2.evaluate(ParentRunner.java:229)
	at org.junit.runners.ParentRunner.run(ParentRunner.java:309)
	at org.apache.maven.surefire.junit4.JUnit4Provider.execute(JUnit4Provider.java:264)
	at org.apache.maven.surefire.junit4.JUnit4Provider.executeTestSet(JUnit4Provider.java:153)
	at org.apache.maven.surefire.junit4.JUnit4Provider.invoke(JUnit4Provider.java:124)
	at org.apache.maven.surefire.booter.ForkedBooter.invokeProviderInSameClassLoader(ForkedBooter.java:200)
	at org.apache.maven.surefire.booter.ForkedBooter.runSuitesInProcess(ForkedBooter.java:153)
	at org.apache.maven.surefire.booter.ForkedBooter.main(ForkedBooter.java:103)

2015-10-05 14:19:09,482 INFO: org.apache.tajo.worker.TajoWorker (run(564)) - ============================================
2015-10-05 14:19:09,482 INFO: org.apache.tajo.worker.TajoWorker (run(565)) - TajoWorker received
SIGINT Signal
2015-10-05 14:19:09,482 INFO: org.apache.tajo.worker.TajoWorker (run(566)) - ============================================
2015-10-05 14:19:09,487 INFO: org.apache.tajo.util.history.HistoryWriter (run(275)) - HistoryWriter_asf903.gq1.ygridcore.net_35696
stopped.
2015-10-05 14:19:09,487 INFO: org.apache.tajo.util.history.HistoryCleaner (run(136)) - History
cleaner stopped
2015-10-05 14:19:09,494 INFO: org.apache.tajo.worker.NodeStatusUpdater (serviceStop(115))
- NodeStatusUpdater stopped.
2015-10-05 14:19:09,494 INFO: org.apache.tajo.worker.NodeStatusUpdater (run(265)) - Heartbeat
Thread stopped.
2015-10-05 14:19:09,499 INFO: org.apache.tajo.rpc.NettyServerBase (shutdown(173)) - Rpc (QueryMasterProtocol)
listened on 0:0:0:0:0:0:0:0:35698) shutdown
2015-10-05 14:19:09,500 INFO: org.apache.tajo.querymaster.QueryMasterManagerService (serviceStop(106))
- QueryMasterManagerService stopped
2015-10-05 14:19:09,501 INFO: org.apache.tajo.querymaster.QueryMaster (run(427)) - QueryMaster
heartbeat thread stopped
2015-10-05 14:19:09,503 INFO: org.apache.tajo.querymaster.QueryMaster (serviceStop(162)) -
QueryMaster stopped
2015-10-05 14:19:09,503 INFO: org.apache.tajo.worker.TajoWorkerClientService (stop(98)) -
TajoWorkerClientService stopping
2015-10-05 14:19:09,504 INFO: org.apache.tajo.rpc.NettyServerBase (shutdown(173)) - Rpc (QueryMasterClientProtocol)
listened on 0:0:0:0:0:0:0:0:35697) shutdown
2015-10-05 14:19:09,504 INFO: org.apache.tajo.worker.TajoWorkerClientService (stop(102)) -
TajoWorkerClientService stopped
2015-10-05 14:19:09,506 INFO: org.apache.tajo.rpc.NettyServerBase (shutdown(173)) - Rpc (TajoWorkerProtocol)
listened on 0:0:0:0:0:0:0:0:35696) shutdown
2015-10-05 14:19:09,506 INFO: org.apache.tajo.worker.TajoWorkerManagerService (serviceStop(93))
- TajoWorkerManagerService stopped
2015-10-05 14:19:09,508 INFO: org.apache.tajo.worker.TajoWorker (serviceStop(374)) - TajoWorker
main thread exiting
2015-10-05 14:19:11,725 INFO: org.apache.tajo.master.TajoMaster (run(577)) - ============================================
2015-10-05 14:19:11,727 INFO: org.apache.tajo.master.TajoMaster (run(578)) - TajoMaster received
SIGINT Signal
2015-10-05 14:19:11,727 INFO: org.apache.tajo.master.TajoMaster (run(579)) - ============================================
2015-10-05 14:19:11,729 INFO: org.apache.tajo.rpc.NettyServerBase (shutdown(173)) - Rpc (Tajo-REST)
listened on 0:0:0:0:0:0:0:0:35695) shutdown
2015-10-05 14:19:11,729 INFO: org.apache.tajo.ws.rs.TajoRestService (serviceStop(129)) - Tajo
Rest Service stopped.
2015-10-05 14:19:11,731 INFO: org.apache.tajo.util.history.HistoryWriter (run(275)) - HistoryWriter_127.0.0.1_35694
stopped.
2015-10-05 14:19:11,732 INFO: org.apache.tajo.util.history.HistoryCleaner (run(136)) - History
cleaner stopped
2015-10-05 14:19:11,733 INFO: org.apache.tajo.rpc.NettyServerBase (shutdown(173)) - Rpc (QueryCoordinatorProtocol)
listened on 127.0.0.1:35694) shutdown
2015-10-05 14:19:11,734 INFO: org.apache.tajo.rpc.NettyServerBase (shutdown(173)) - Rpc (TajoMasterClientProtocol)
listened on 127.0.0.1:35693) shutdown
2015-10-05 14:19:11,739 INFO: org.apache.tajo.catalog.CatalogServer (serviceStop(186)) - Catalog
Server (127.0.0.1:35692) shutdown
2015-10-05 14:19:11,740 INFO: org.apache.tajo.rpc.NettyServerBase (shutdown(173)) - Rpc (CatalogProtocol)
listened on 127.0.0.1:35692) shutdown
2015-10-05 14:19:11,744 INFO: org.apache.tajo.catalog.store.DerbyStore (close(3157)) - Close
database (jdbc:derby:memory:<https://builds.apache.org/job/Tajo-master-jdk8-nightly/ws/tajo-storage/tajo-storage-pgsql/target/test-data/bfcf0421-fd42-4759-a680-ff893119375d/db;create=true)>
2015-10-05 14:19:11,745 INFO: org.apache.tajo.rpc.NettyServerBase (shutdown(173)) - Rpc (TajoResourceTrackerProtocol)
listened on 127.0.0.1:35691) shutdown
2015-10-05 14:19:11,745 INFO: org.apache.tajo.master.TajoMaster (serviceStop(437)) - Tajo
Master main thread exiting
2015-10-05 14:19:11,790 INFO: org.apache.tajo.catalog.store.DerbyStore (shutdown(68)) - Derby
shutdown complete normally.
2015-10-05 14:19:11,790 INFO: org.apache.tajo.catalog.store.DerbyStore (shutdown(75)) - Shutdown
database

Results :

Tests in error: 
  TestPgSQLMetadataProvider.<clinit>:34 ExceptionInInitializer
  TestPgSQLQueryTests.<clinit>:35 NoClassDefFound Could not initialize class org...
  TestPgSQLQueryTests>QueryTestCaseBase.tearDownClass:229 » NullPointer
  TestPgSQLSimpleQueryTests.<clinit>:26 NoClassDefFound Could not initialize cla...
  TestPgSQLSimpleQueryTests>QueryTestCaseBase.tearDownClass:229 » NullPointer
  TestPgSQLEndPointTests.<clinit>:36 NoClassDefFound Could not initialize class ...
  TestPgSQLEndPointTests.org.apache.tajo.storage.pgsql.TestPgSQLEndPointTests » NoClassDefFound
  TestPgSQLEndPointTests>QueryTestCaseBase.tearDownClass:229 » NullPointer
  TestPgSQLJdbcTableSpace.<clinit>:44 NoClassDefFound Could not initialize class...
  TestPgSQLJdbcTableSpace.testConnPropertiesNegative » NoClassDefFound Could not...
  TestPgSQLJdbcTableSpace.testConnProperties » NoClassDefFound Could not initial...
  TestPgSQLJdbcTableSpace.testDropTable » NoClassDefFound Could not initialize c...
  TestPgSQLJdbcTableSpace.testTemporaryTablespace » NoClassDefFound Could not in...
  TestPgSQLJdbcTableSpace.testTablespaceHandler » NoClassDefFound Could not init...
  TestPgSQLJdbcTableSpace.testGetSplits » NoClassDefFound Could not initialize c...

Tests run: 15, Failures: 0, Errors: 15, Skipped: 0

[INFO] ------------------------------------------------------------------------
[INFO] Reactor Summary:
[INFO] 
[INFO] Tajo Main ......................................... SUCCESS [  1.677 s]
[INFO] Tajo Project POM .................................. SUCCESS [  1.795 s]
[INFO] Tajo Maven Plugins ................................ SUCCESS [  2.727 s]
[INFO] Tajo Common ....................................... SUCCESS [ 28.290 s]
[INFO] Tajo Algebra ...................................... SUCCESS [  2.165 s]
[INFO] Tajo Catalog Common ............................... SUCCESS [  4.912 s]
[INFO] Tajo Plan ......................................... SUCCESS [  7.157 s]
[INFO] Tajo Rpc Common ................................... SUCCESS [  1.278 s]
[INFO] Tajo Protocol Buffer Rpc .......................... SUCCESS [ 51.276 s]
[INFO] Tajo Catalog Client ............................... SUCCESS [  1.418 s]
[INFO] Tajo Catalog Server ............................... SUCCESS [ 10.700 s]
[INFO] Tajo Storage Common ............................... SUCCESS [  2.614 s]
[INFO] Tajo HDFS Storage ................................. SUCCESS [ 52.555 s]
[INFO] Tajo PullServer ................................... SUCCESS [  0.917 s]
[INFO] Tajo Client ....................................... SUCCESS [  2.575 s]
[INFO] Tajo CLI tools .................................... SUCCESS [  1.710 s]
[INFO] Tajo SQL Parser ................................... SUCCESS [  3.931 s]
[INFO] ASM (thirdparty) .................................. SUCCESS [  1.913 s]
[INFO] Tajo RESTful Container ............................ SUCCESS [  3.638 s]
[INFO] Tajo Metrics ...................................... SUCCESS [  1.353 s]
[INFO] Tajo Core ......................................... SUCCESS [  6.343 s]
[INFO] Tajo RPC .......................................... SUCCESS [  0.908 s]
[INFO] Tajo Catalog Drivers Hive ......................... SUCCESS [  9.462 s]
[INFO] Tajo Catalog Drivers .............................. SUCCESS [  0.052 s]
[INFO] Tajo Catalog ...................................... SUCCESS [  0.943 s]
[INFO] Tajo Client Example ............................... SUCCESS [  1.050 s]
[INFO] Tajo HBase Storage ................................ SUCCESS [  3.417 s]
[INFO] Tajo Cluster Tests ................................ SUCCESS [  2.466 s]
[INFO] Tajo JDBC Driver .................................. SUCCESS [ 36.030 s]
[INFO] Tajo JDBC storage common .......................... SUCCESS [  0.812 s]
[INFO] Tajo PostgreSQL JDBC storage ...................... FAILURE [ 15.885 s]
[INFO] Tajo Storage ...................................... SKIPPED
[INFO] Tajo Distribution ................................. SKIPPED
[INFO] Tajo Core Tests ................................... SKIPPED
[INFO] ------------------------------------------------------------------------
[INFO] BUILD FAILURE
[INFO] ------------------------------------------------------------------------
[INFO] Total time: 04:22 min
[INFO] Finished at: 2015-10-05T14:19:12+00:00
[INFO] Final Memory: 178M/2042M
[INFO] ------------------------------------------------------------------------
[ERROR] Failed to execute goal org.apache.maven.plugins:maven-surefire-plugin:2.17:test (default-test)
on project tajo-storage-pgsql: There are test failures.
[ERROR] 
[ERROR] Please refer to <https://builds.apache.org/job/Tajo-master-jdk8-nightly/ws/tajo-storage/tajo-storage-pgsql/target/surefire-reports>
for the individual test results.
[ERROR] -> [Help 1]
[ERROR] 
[ERROR] To see the full stack trace of the errors, re-run Maven with the -e switch.
[ERROR] Re-run Maven using the -X switch to enable full debug logging.
[ERROR] 
[ERROR] For more information about the errors and possible solutions, please read the following
articles:
[ERROR] [Help 1] http://cwiki.apache.org/confluence/display/MAVEN/MojoFailureException
[ERROR] 
[ERROR] After correcting the problems, you can resume the build with the command
[ERROR]   mvn <goals> -rf :tajo-storage-pgsql
Build step 'Execute shell' marked build as failure
Archiving artifacts
Recording test results

Mime
View raw message