systemml-dev mailing list archives

Site index · List index
Message view « Date » · « Thread »
Top « Date » · « Thread »
From jenk...@spark.tc
Subject Build failed in Jenkins: SystemML-DailyTest #1146
Date Tue, 01 Aug 2017 10:14:01 GMT
See <https://sparktc.ibmcloud.com/jenkins/job/SystemML-DailyTest/1146/>

------------------------------------------
[...truncated 28591 lines...]
17/08/01 04:34:32 INFO scheduler.TaskSchedulerImpl: Removed TaskSet 1.0, whose tasks have
all completed, from pool default
17/08/01 04:34:32 INFO scheduler.DAGScheduler: ShuffleMapStage 0 (parallelizePairs at SparkExecutionContext.java:700)
finished in 0.305 s
17/08/01 04:34:32 INFO scheduler.DAGScheduler: looking for newly runnable stages
17/08/01 04:34:32 INFO scheduler.DAGScheduler: running: Set(ShuffleMapStage 1)
17/08/01 04:34:32 INFO scheduler.DAGScheduler: waiting: Set(ResultStage 2)
17/08/01 04:34:32 INFO scheduler.DAGScheduler: failed: Set()
17/08/01 04:34:32 INFO scheduler.DAGScheduler: ShuffleMapStage 1 (parallelizePairs at SparkExecutionContext.java:700)
finished in 0.166 s
17/08/01 04:34:32 INFO scheduler.DAGScheduler: looking for newly runnable stages
17/08/01 04:34:32 INFO scheduler.DAGScheduler: running: Set()
17/08/01 04:34:32 INFO scheduler.DAGScheduler: waiting: Set(ResultStage 2)
17/08/01 04:34:32 INFO scheduler.DAGScheduler: failed: Set()
17/08/01 04:34:32 INFO scheduler.DAGScheduler: Submitting ResultStage 2 (MapPartitionsRDD[5]
at mapValues at BinarySPInstruction.java:117), which has no missing parents
17/08/01 04:34:32 INFO memory.MemoryStore: Block broadcast_2 stored as values in memory (estimated
size 4.2 KB, free 1033.8 MB)
17/08/01 04:34:32 INFO memory.MemoryStore: Block broadcast_2_piece0 stored as bytes in memory
(estimated size 2.3 KB, free 1033.8 MB)
17/08/01 04:34:32 INFO storage.BlockManagerInfo: Added broadcast_2_piece0 in memory on 23.246.248.181:36729
(size: 2.3 KB, free: 1033.8 MB)
17/08/01 04:34:32 INFO spark.SparkContext: Created broadcast 2 from broadcast at DAGScheduler.scala:996
17/08/01 04:34:32 INFO scheduler.DAGScheduler: Submitting 1 missing tasks from ResultStage
2 (MapPartitionsRDD[5] at mapValues at BinarySPInstruction.java:117)
17/08/01 04:34:32 INFO scheduler.TaskSchedulerImpl: Adding task set 2.0 with 1 tasks
17/08/01 04:34:32 INFO scheduler.FairSchedulableBuilder: Added task set TaskSet_2.0 tasks
to pool default
17/08/01 04:34:32 INFO scheduler.TaskSetManager: Starting task 0.0 in stage 2.0 (TID 2, localhost,
executor driver, partition 0, PROCESS_LOCAL, 5813 bytes)
17/08/01 04:34:32 INFO executor.Executor: Running task 0.0 in stage 2.0 (TID 2)
17/08/01 04:34:32 INFO storage.ShuffleBlockFetcherIterator: Getting 1 non-empty blocks out
of 1 blocks
17/08/01 04:34:32 INFO storage.ShuffleBlockFetcherIterator: Started 0 remote fetches in 5
ms
17/08/01 04:34:32 INFO storage.ShuffleBlockFetcherIterator: Getting 1 non-empty blocks out
of 1 blocks
17/08/01 04:34:32 INFO storage.ShuffleBlockFetcherIterator: Started 0 remote fetches in 0
ms
17/08/01 04:34:32 INFO executor.Executor: Finished task 0.0 in stage 2.0 (TID 2). 2077 bytes
result sent to driver
17/08/01 04:34:32 INFO scheduler.TaskSetManager: Finished task 0.0 in stage 2.0 (TID 2) in
86 ms on localhost (executor driver) (1/1)
17/08/01 04:34:32 INFO scheduler.TaskSchedulerImpl: Removed TaskSet 2.0, whose tasks have
all completed, from pool default
17/08/01 04:34:32 INFO scheduler.DAGScheduler: ResultStage 2 (collect at SparkExecutionContext.java:790)
finished in 0.091 s
17/08/01 04:34:33 INFO storage.BlockManagerInfo: Removed broadcast_2_piece0 on 23.246.248.181:36729
in memory (size: 2.3 KB, free: 1033.8 MB)
17/08/01 04:34:33 INFO storage.BlockManagerInfo: Removed broadcast_1_piece0 on 23.246.248.181:36729
in memory (size: 1302.0 B, free: 1033.8 MB)
17/08/01 04:34:33 INFO scheduler.DAGScheduler: Registering RDD 7 (parallelizePairs at SparkExecutionContext.java:700)
17/08/01 04:34:33 INFO scheduler.DAGScheduler: Registering RDD 6 (parallelizePairs at SparkExecutionContext.java:700)
17/08/01 04:34:33 INFO scheduler.DAGScheduler: Got job 1 (collect at SparkExecutionContext.java:790)
with 1 output partitions
17/08/01 04:34:33 INFO scheduler.DAGScheduler: Final stage: ResultStage 5 (collect at SparkExecutionContext.java:790)
17/08/01 04:34:33 INFO scheduler.DAGScheduler: Parents of final stage: List(ShuffleMapStage
3, ShuffleMapStage 4)
17/08/01 04:34:33 INFO scheduler.DAGScheduler: Missing parents: List(ShuffleMapStage 3, ShuffleMapStage
4)
17/08/01 04:34:33 INFO scheduler.DAGScheduler: Submitting ShuffleMapStage 3 (ParallelCollectionRDD[7]
at parallelizePairs at SparkExecutionContext.java:700), which has no missing parents
17/08/01 04:34:33 INFO memory.MemoryStore: Block broadcast_3 stored as values in memory (estimated
size 2032.0 B, free 1033.8 MB)
17/08/01 04:34:33 INFO memory.MemoryStore: Block broadcast_3_piece0 stored as bytes in memory
(estimated size 1305.0 B, free 1033.8 MB)
17/08/01 04:34:33 INFO storage.BlockManagerInfo: Added broadcast_3_piece0 in memory on 23.246.248.181:36729
(size: 1305.0 B, free: 1033.8 MB)
17/08/01 04:34:33 INFO spark.SparkContext: Created broadcast 3 from broadcast at DAGScheduler.scala:996
17/08/01 04:34:33 INFO scheduler.DAGScheduler: Submitting 1 missing tasks from ShuffleMapStage
3 (ParallelCollectionRDD[7] at parallelizePairs at SparkExecutionContext.java:700)
17/08/01 04:34:33 INFO scheduler.TaskSchedulerImpl: Adding task set 3.0 with 1 tasks
17/08/01 04:34:33 INFO scheduler.FairSchedulableBuilder: Added task set TaskSet_3.0 tasks
to pool default
17/08/01 04:34:33 INFO scheduler.DAGScheduler: Submitting ShuffleMapStage 4 (ParallelCollectionRDD[6]
at parallelizePairs at SparkExecutionContext.java:700), which has no missing parents
17/08/01 04:34:33 INFO scheduler.TaskSetManager: Starting task 0.0 in stage 3.0 (TID 3, localhost,
executor driver, partition 0, PROCESS_LOCAL, 6445 bytes)
17/08/01 04:34:33 INFO executor.Executor: Running task 0.0 in stage 3.0 (TID 3)
17/08/01 04:34:33 INFO memory.MemoryStore: Block broadcast_4 stored as values in memory (estimated
size 2032.0 B, free 1033.8 MB)
17/08/01 04:34:33 INFO memory.MemoryStore: Block broadcast_4_piece0 stored as bytes in memory
(estimated size 1305.0 B, free 1033.8 MB)
17/08/01 04:34:33 INFO storage.BlockManagerInfo: Added broadcast_4_piece0 in memory on 23.246.248.181:36729
(size: 1305.0 B, free: 1033.8 MB)
17/08/01 04:34:33 INFO spark.SparkContext: Created broadcast 4 from broadcast at DAGScheduler.scala:996
17/08/01 04:34:33 INFO scheduler.DAGScheduler: Submitting 1 missing tasks from ShuffleMapStage
4 (ParallelCollectionRDD[6] at parallelizePairs at SparkExecutionContext.java:700)
17/08/01 04:34:33 INFO scheduler.TaskSchedulerImpl: Adding task set 4.0 with 1 tasks
17/08/01 04:34:33 INFO scheduler.FairSchedulableBuilder: Added task set TaskSet_4.0 tasks
to pool default
17/08/01 04:34:33 INFO executor.Executor: Finished task 0.0 in stage 3.0 (TID 3). 1341 bytes
result sent to driver
17/08/01 04:34:33 INFO scheduler.TaskSetManager: Starting task 0.0 in stage 4.0 (TID 4, localhost,
executor driver, partition 0, PROCESS_LOCAL, 6445 bytes)
17/08/01 04:34:33 INFO executor.Executor: Running task 0.0 in stage 4.0 (TID 4)
17/08/01 04:34:33 INFO scheduler.TaskSetManager: Finished task 0.0 in stage 3.0 (TID 3) in
9 ms on localhost (executor driver) (1/1)
17/08/01 04:34:33 INFO scheduler.TaskSchedulerImpl: Removed TaskSet 3.0, whose tasks have
all completed, from pool default
17/08/01 04:34:33 INFO scheduler.DAGScheduler: ShuffleMapStage 3 (parallelizePairs at SparkExecutionContext.java:700)
finished in 0.010 s
17/08/01 04:34:33 INFO scheduler.DAGScheduler: looking for newly runnable stages
17/08/01 04:34:33 INFO scheduler.DAGScheduler: running: Set(ShuffleMapStage 4)
17/08/01 04:34:33 INFO scheduler.DAGScheduler: waiting: Set(ResultStage 5)
17/08/01 04:34:33 INFO scheduler.DAGScheduler: failed: Set()
17/08/01 04:34:33 INFO executor.Executor: Finished task 0.0 in stage 4.0 (TID 4). 1254 bytes
result sent to driver
17/08/01 04:34:33 INFO scheduler.TaskSetManager: Finished task 0.0 in stage 4.0 (TID 4) in
7 ms on localhost (executor driver) (1/1)
17/08/01 04:34:33 INFO scheduler.TaskSchedulerImpl: Removed TaskSet 4.0, whose tasks have
all completed, from pool default
17/08/01 04:34:33 INFO scheduler.DAGScheduler: ShuffleMapStage 4 (parallelizePairs at SparkExecutionContext.java:700)
finished in 0.009 s
17/08/01 04:34:33 INFO scheduler.DAGScheduler: looking for newly runnable stages
17/08/01 04:34:33 INFO scheduler.DAGScheduler: running: Set()
17/08/01 04:34:33 INFO scheduler.DAGScheduler: waiting: Set(ResultStage 5)
17/08/01 04:34:33 INFO scheduler.DAGScheduler: failed: Set()
17/08/01 04:34:33 INFO scheduler.DAGScheduler: Submitting ResultStage 5 (MapPartitionsRDD[11]
at mapValues at BinarySPInstruction.java:117), which has no missing parents
17/08/01 04:34:33 INFO memory.MemoryStore: Block broadcast_5 stored as values in memory (estimated
size 4.2 KB, free 1033.8 MB)
17/08/01 04:34:33 INFO memory.MemoryStore: Block broadcast_5_piece0 stored as bytes in memory
(estimated size 2.3 KB, free 1033.8 MB)
17/08/01 04:34:33 INFO storage.BlockManagerInfo: Added broadcast_5_piece0 in memory on 23.246.248.181:36729
(size: 2.3 KB, free: 1033.8 MB)
17/08/01 04:34:33 INFO spark.SparkContext: Created broadcast 5 from broadcast at DAGScheduler.scala:996
17/08/01 04:34:33 INFO scheduler.DAGScheduler: Submitting 1 missing tasks from ResultStage
5 (MapPartitionsRDD[11] at mapValues at BinarySPInstruction.java:117)
17/08/01 04:34:33 INFO scheduler.TaskSchedulerImpl: Adding task set 5.0 with 1 tasks
17/08/01 04:34:33 INFO scheduler.FairSchedulableBuilder: Added task set TaskSet_5.0 tasks
to pool default
17/08/01 04:34:33 INFO scheduler.TaskSetManager: Starting task 0.0 in stage 5.0 (TID 5, localhost,
executor driver, partition 0, PROCESS_LOCAL, 5814 bytes)
17/08/01 04:34:33 INFO executor.Executor: Running task 0.0 in stage 5.0 (TID 5)
17/08/01 04:34:33 INFO storage.ShuffleBlockFetcherIterator: Getting 1 non-empty blocks out
of 1 blocks
17/08/01 04:34:33 INFO storage.ShuffleBlockFetcherIterator: Started 0 remote fetches in 0
ms
17/08/01 04:34:33 INFO storage.ShuffleBlockFetcherIterator: Getting 1 non-empty blocks out
of 1 blocks
17/08/01 04:34:33 INFO storage.ShuffleBlockFetcherIterator: Started 0 remote fetches in 0
ms
17/08/01 04:34:33 INFO executor.Executor: Finished task 0.0 in stage 5.0 (TID 5). 2240 bytes
result sent to driver
17/08/01 04:34:33 INFO scheduler.TaskSetManager: Finished task 0.0 in stage 5.0 (TID 5) in
8 ms on localhost (executor driver) (1/1)
17/08/01 04:34:33 INFO scheduler.TaskSchedulerImpl: Removed TaskSet 5.0, whose tasks have
all completed, from pool default
17/08/01 04:34:33 INFO scheduler.DAGScheduler: ResultStage 5 (collect at SparkExecutionContext.java:790)
finished in 0.008 s
17/08/01 04:34:33 INFO storage.BlockManagerInfo: Removed broadcast_5_piece0 on 23.246.248.181:36729
in memory (size: 2.3 KB, free: 1033.8 MB)
17/08/01 04:34:33 INFO storage.BlockManagerInfo: Removed broadcast_4_piece0 on 23.246.248.181:36729
in memory (size: 1305.0 B, free: 1033.8 MB)
17/08/01 04:34:33 INFO storage.BlockManagerInfo: Removed broadcast_3_piece0 on 23.246.248.181:36729
in memory (size: 1305.0 B, free: 1033.8 MB)
17/08/01 04:34:33 INFO spark.ContextCleaner: Cleaned shuffle 2
17/08/01 04:34:33 INFO spark.ContextCleaner: Cleaned shuffle 3
17/08/01 04:35:46 INFO server.ServerConnector: Stopped ServerConnector@1fcf2b87{HTTP/1.1}{0.0.0.0:4041}
17/08/01 04:35:46 INFO handler.ContextHandler: Stopped o.s.j.s.ServletContextHandler@70bf6aa6{/stages/stage/kill,null,UNAVAILABLE}
17/08/01 04:35:46 INFO handler.ContextHandler: Stopped o.s.j.s.ServletContextHandler@2886ff17{/jobs/job/kill,null,UNAVAILABLE}
17/08/01 04:35:46 INFO handler.ContextHandler: Stopped o.s.j.s.ServletContextHandler@61ef9357{/api,null,UNAVAILABLE}
17/08/01 04:35:46 INFO handler.ContextHandler: Stopped o.s.j.s.ServletContextHandler@2dec8333{/,null,UNAVAILABLE}
17/08/01 04:35:46 INFO handler.ContextHandler: Stopped o.s.j.s.ServletContextHandler@23ef61c0{/static,null,UNAVAILABLE}
17/08/01 04:35:46 INFO handler.ContextHandler: Stopped o.s.j.s.ServletContextHandler@40e1382d{/executors/threadDump/json,null,UNAVAILABLE}
17/08/01 04:35:46 INFO handler.ContextHandler: Stopped o.s.j.s.ServletContextHandler@32dfc203{/executors/threadDump,null,UNAVAILABLE}
17/08/01 04:35:46 INFO handler.ContextHandler: Stopped o.s.j.s.ServletContextHandler@1812d3f5{/executors/json,null,UNAVAILABLE}
17/08/01 04:35:46 INFO handler.ContextHandler: Stopped o.s.j.s.ServletContextHandler@1d4fd44d{/executors,null,UNAVAILABLE}
17/08/01 04:35:46 INFO handler.ContextHandler: Stopped o.s.j.s.ServletContextHandler@268a98c5{/environment/json,null,UNAVAILABLE}
17/08/01 04:35:46 INFO handler.ContextHandler: Stopped o.s.j.s.ServletContextHandler@550ffd01{/environment,null,UNAVAILABLE}
17/08/01 04:35:46 INFO handler.ContextHandler: Stopped o.s.j.s.ServletContextHandler@74fe24dd{/storage/rdd/json,null,UNAVAILABLE}
17/08/01 04:35:46 INFO handler.ContextHandler: Stopped o.s.j.s.ServletContextHandler@510d4e6f{/storage/rdd,null,UNAVAILABLE}
17/08/01 04:35:46 INFO handler.ContextHandler: Stopped o.s.j.s.ServletContextHandler@383979fc{/storage/json,null,UNAVAILABLE}
17/08/01 04:35:46 INFO handler.ContextHandler: Stopped o.s.j.s.ServletContextHandler@70ea2744{/storage,null,UNAVAILABLE}
17/08/01 04:35:46 INFO handler.ContextHandler: Stopped o.s.j.s.ServletContextHandler@39238eb5{/stages/pool/json,null,UNAVAILABLE}
17/08/01 04:35:46 INFO handler.ContextHandler: Stopped o.s.j.s.ServletContextHandler@78f235e9{/stages/pool,null,UNAVAILABLE}
17/08/01 04:35:46 INFO handler.ContextHandler: Stopped o.s.j.s.ServletContextHandler@69c43bee{/stages/stage/json,null,UNAVAILABLE}
17/08/01 04:35:46 INFO handler.ContextHandler: Stopped o.s.j.s.ServletContextHandler@5633e66b{/stages/stage,null,UNAVAILABLE}
17/08/01 04:35:46 INFO handler.ContextHandler: Stopped o.s.j.s.ServletContextHandler@5db38476{/stages/json,null,UNAVAILABLE}
17/08/01 04:35:46 INFO handler.ContextHandler: Stopped o.s.j.s.ServletContextHandler@2a476c0b{/stages,null,UNAVAILABLE}
17/08/01 04:35:46 INFO handler.ContextHandler: Stopped o.s.j.s.ServletContextHandler@cb67fdc{/jobs/job/json,null,UNAVAILABLE}
17/08/01 04:35:46 INFO handler.ContextHandler: Stopped o.s.j.s.ServletContextHandler@66ddbad9{/jobs/job,null,UNAVAILABLE}
17/08/01 04:35:46 INFO handler.ContextHandler: Stopped o.s.j.s.ServletContextHandler@5eb536db{/jobs/json,null,UNAVAILABLE}
17/08/01 04:35:46 INFO handler.ContextHandler: Stopped o.s.j.s.ServletContextHandler@79fbe584{/jobs,null,UNAVAILABLE}
17/08/01 04:35:46 INFO ui.SparkUI: Stopped Spark web UI at http://23.246.248.181:4041
17/08/01 04:35:46 INFO spark.MapOutputTrackerMasterEndpoint: MapOutputTrackerMasterEndpoint
stopped!
17/08/01 04:35:46 INFO memory.MemoryStore: MemoryStore cleared
17/08/01 04:35:46 INFO storage.BlockManager: BlockManager stopped
17/08/01 04:35:46 INFO storage.BlockManagerMaster: BlockManagerMaster stopped
17/08/01 04:35:46 INFO scheduler.OutputCommitCoordinator$OutputCommitCoordinatorEndpoint:
OutputCommitCoordinator stopped!
17/08/01 04:35:46 INFO spark.SparkContext: Successfully stopped SparkContext
Running org.apache.sysml.test.integration.scripts.nn.NNTest
Tests run: 1, Failures: 0, Errors: 0, Skipped: 0, Time elapsed: 420.712 sec - in org.apache.sysml.test.integration.scripts.nn.NNTest
17/08/01 04:35:46 INFO util.ShutdownHookManager: Shutdown hook called
17/08/01 04:35:46 INFO util.ShutdownHookManager: Deleting directory /tmp/spark-34ec92a6-ff2a-4cb4-8997-f0f025d1ed2e
Running org.apache.sysml.test.integration.functions.quaternary.WeightedDivMatrixMultTest
Tests run: 90, Failures: 0, Errors: 0, Skipped: 0, Time elapsed: 1,096.159 sec - in org.apache.sysml.test.integration.functions.quaternary.WeightedDivMatrixMultTest
17/08/01 04:36:39 INFO util.ShutdownHookManager: Shutdown hook called
17/08/01 04:36:39 INFO util.ShutdownHookManager: Deleting directory /tmp/spark-d785b97c-3e10-43f3-a5ba-a5ba8d8b2c0d
Running org.apache.sysml.test.integration.applications.descriptivestats.UnivariateWeightedScaleDenseTest
Tests run: 24, Failures: 0, Errors: 0, Skipped: 0, Time elapsed: 293.039 sec - in org.apache.sysml.test.integration.applications.descriptivestats.UnivariateWeightedScaleDenseTest
Running org.apache.sysml.test.integration.functions.append.AppendChainTest
Tests run: 12, Failures: 0, Errors: 0, Skipped: 0, Time elapsed: 826.113 sec - in org.apache.sysml.test.integration.functions.append.AppendChainTest
Running org.apache.sysml.test.integration.applications.parfor.ParForNaiveBayesTest
Tests run: 10, Failures: 0, Errors: 0, Skipped: 0, Time elapsed: 392.44 sec - in org.apache.sysml.test.integration.applications.parfor.ParForNaiveBayesTest
Running org.apache.sysml.test.integration.applications.dml.HITSDMLTest
Tests run: 1, Failures: 0, Errors: 0, Skipped: 0, Time elapsed: 71.797 sec - in org.apache.sysml.test.integration.applications.dml.HITSDMLTest
Running org.apache.sysml.test.integration.applications.parfor.ParForSampleTest
Tests run: 6, Failures: 0, Errors: 0, Skipped: 0, Time elapsed: 88.355 sec - in org.apache.sysml.test.integration.applications.parfor.ParForSampleTest
Running org.apache.sysml.test.integration.applications.parfor.ParForUnivariateStatsTest
Tests run: 3, Failures: 0, Errors: 0, Skipped: 0, Time elapsed: 5.917 sec - in org.apache.sysml.test.integration.applications.parfor.ParForUnivariateStatsTest
Running org.apache.sysml.test.integration.applications.descriptivestats.UnivariateUnweightedScaleSparseTest
Tests run: 24, Failures: 0, Errors: 0, Skipped: 0, Time elapsed: 232.437 sec - in org.apache.sysml.test.integration.applications.descriptivestats.UnivariateUnweightedScaleSparseTest
Running org.apache.sysml.test.integration.functions.append.AppendMatrixTest
Tests run: 22, Failures: 0, Errors: 0, Skipped: 0, Time elapsed: 983.835 sec - in org.apache.sysml.test.integration.functions.append.AppendMatrixTest
Running org.apache.sysml.test.integration.applications.descriptivestats.UnivariateWeightedScaleSparseTest
Tests run: 24, Failures: 0, Errors: 0, Skipped: 0, Time elapsed: 300.586 sec - in org.apache.sysml.test.integration.applications.descriptivestats.UnivariateWeightedScaleSparseTest
Running org.apache.sysml.test.integration.applications.pydml.ArimaPyDMLTest
Tests run: 1, Failures: 0, Errors: 0, Skipped: 0, Time elapsed: 23.227 sec - in org.apache.sysml.test.integration.applications.pydml.ArimaPyDMLTest
Running org.apache.sysml.test.integration.applications.pydml.HITSPyDMLTest
Tests run: 1, Failures: 0, Errors: 0, Skipped: 0, Time elapsed: 54.605 sec - in org.apache.sysml.test.integration.applications.pydml.HITSPyDMLTest
Running org.apache.sysml.test.integration.applications.dml.LinearRegressionDMLTest
Tests run: 7, Failures: 0, Errors: 0, Skipped: 0, Time elapsed: 36.176 sec - in org.apache.sysml.test.integration.applications.dml.LinearRegressionDMLTest
Running org.apache.sysml.test.integration.applications.pydml.CsplineDSPyDMLTest
Tests run: 3, Failures: 0, Errors: 0, Skipped: 0, Time elapsed: 4.082 sec - in org.apache.sysml.test.integration.applications.pydml.CsplineDSPyDMLTest
Running org.apache.sysml.test.integration.applications.pydml.LinearLogRegPyDMLTest
Tests run: 7, Failures: 0, Errors: 0, Skipped: 0, Time elapsed: 66.374 sec - in org.apache.sysml.test.integration.applications.pydml.LinearLogRegPyDMLTest
Running org.apache.sysml.test.integration.applications.pydml.NaiveBayesPyDMLTest
Tests run: 6, Failures: 0, Errors: 0, Skipped: 0, Time elapsed: 47.409 sec - in org.apache.sysml.test.integration.applications.pydml.NaiveBayesPyDMLTest
Running org.apache.sysml.test.integration.applications.dml.CsplineCGDMLTest
Tests run: 3, Failures: 0, Errors: 0, Skipped: 0, Time elapsed: 14.663 sec - in org.apache.sysml.test.integration.applications.dml.CsplineCGDMLTest
Running org.apache.sysml.test.integration.applications.dml.L2SVMDMLTest
Tests run: 9, Failures: 0, Errors: 0, Skipped: 0, Time elapsed: 53.821 sec - in org.apache.sysml.test.integration.applications.dml.L2SVMDMLTest
Running org.apache.sysml.test.integration.applications.pydml.MDABivariateStatsPyDMLTest
Tests run: 4, Failures: 0, Errors: 0, Skipped: 0, Time elapsed: 196.6 sec - in org.apache.sysml.test.integration.applications.pydml.MDABivariateStatsPyDMLTest
Running org.apache.sysml.test.integration.applications.pydml.PageRankPyDMLTest
Tests run: 3, Failures: 0, Errors: 0, Skipped: 0, Time elapsed: 4.199 sec - in org.apache.sysml.test.integration.applications.pydml.PageRankPyDMLTest
Running org.apache.sysml.test.integration.applications.pydml.NaiveBayesParforPyDMLTest
Tests run: 6, Failures: 0, Errors: 0, Skipped: 0, Time elapsed: 47.451 sec - in org.apache.sysml.test.integration.applications.pydml.NaiveBayesParforPyDMLTest
Running org.apache.sysml.test.integration.applications.dml.NaiveBayesDMLTest
Tests run: 6, Failures: 0, Errors: 0, Skipped: 0, Time elapsed: 47.325 sec - in org.apache.sysml.test.integration.applications.dml.NaiveBayesDMLTest
Running org.apache.sysml.test.integration.applications.dml.MDABivariateStatsDMLTest
Tests run: 4, Failures: 0, Errors: 0, Skipped: 0, Time elapsed: 199.207 sec - in org.apache.sysml.test.integration.applications.dml.MDABivariateStatsDMLTest
Running org.apache.sysml.test.integration.applications.dml.PageRankDMLTest
Tests run: 3, Failures: 0, Errors: 0, Skipped: 0, Time elapsed: 4.24 sec - in org.apache.sysml.test.integration.applications.dml.PageRankDMLTest
Running org.apache.sysml.test.integration.applications.pydml.GLMPyDMLTest
Tests run: 30, Failures: 0, Errors: 0, Skipped: 0, Time elapsed: 370.762 sec - in org.apache.sysml.test.integration.applications.pydml.GLMPyDMLTest
Running org.apache.sysml.test.integration.applications.pydml.MultiClassSVMPyDMLTest
Tests run: 9, Failures: 0, Errors: 0, Skipped: 0, Time elapsed: 50.246 sec - in org.apache.sysml.test.integration.applications.pydml.MultiClassSVMPyDMLTest
Running org.apache.sysml.test.integration.applications.dml.ID3DMLTest
Tests run: 2, Failures: 0, Errors: 0, Skipped: 0, Time elapsed: 242.725 sec - in org.apache.sysml.test.integration.applications.dml.ID3DMLTest
Running org.apache.sysml.test.integration.applications.dml.GLMDMLTest
Tests run: 30, Failures: 0, Errors: 0, Skipped: 0, Time elapsed: 616.948 sec - in org.apache.sysml.test.integration.applications.dml.GLMDMLTest
Running org.apache.sysml.test.integration.applications.pydml.CsplineCGPyDMLTest
Tests run: 3, Failures: 0, Errors: 0, Skipped: 0, Time elapsed: 3.602 sec - in org.apache.sysml.test.integration.applications.pydml.CsplineCGPyDMLTest
Running org.apache.sysml.test.integration.applications.pydml.WelchTPyDMLTest
Tests run: 3, Failures: 0, Errors: 0, Skipped: 0, Time elapsed: 3.933 sec - in org.apache.sysml.test.integration.applications.pydml.WelchTPyDMLTest
Running org.apache.sysml.test.integration.applications.dml.MultiClassSVMDMLTest
Tests run: 9, Failures: 0, Errors: 0, Skipped: 0, Time elapsed: 49.383 sec - in org.apache.sysml.test.integration.applications.dml.MultiClassSVMDMLTest
Running org.apache.sysml.test.integration.applications.dml.CsplineDSDMLTest
Tests run: 3, Failures: 0, Errors: 0, Skipped: 0, Time elapsed: 12.965 sec - in org.apache.sysml.test.integration.applications.dml.CsplineDSDMLTest
Running org.apache.sysml.test.integration.applications.pydml.ApplyTransformPyDMLTest
Tests run: 7, Failures: 0, Errors: 0, Skipped: 0, Time elapsed: 0.548 sec - in org.apache.sysml.test.integration.applications.pydml.ApplyTransformPyDMLTest
Running org.apache.sysml.test.integration.applications.dml.NaiveBayesParforDMLTest
Tests run: 6, Failures: 0, Errors: 0, Skipped: 0, Time elapsed: 47.74 sec - in org.apache.sysml.test.integration.applications.dml.NaiveBayesParforDMLTest
Running org.apache.sysml.test.integration.applications.pydml.L2SVMPyDMLTest
Tests run: 9, Failures: 0, Errors: 0, Skipped: 0, Time elapsed: 46.554 sec - in org.apache.sysml.test.integration.applications.pydml.L2SVMPyDMLTest
Running org.apache.sysml.test.integration.applications.pydml.LinearRegressionPyDMLTest
Tests run: 7, Failures: 0, Errors: 0, Skipped: 0, Time elapsed: 35.821 sec - in org.apache.sysml.test.integration.applications.pydml.LinearRegressionPyDMLTest
Running org.apache.sysml.test.integration.applications.dml.LinearLogRegDMLTest
Tests run: 7, Failures: 0, Errors: 0, Skipped: 0, Time elapsed: 49.647 sec - in org.apache.sysml.test.integration.applications.dml.LinearLogRegDMLTest
Running org.apache.sysml.test.integration.applications.dml.GNMFDMLTest
Tests run: 3, Failures: 0, Errors: 0, Skipped: 0, Time elapsed: 50.792 sec - in org.apache.sysml.test.integration.applications.dml.GNMFDMLTest
Running org.apache.sysml.test.integration.applications.dml.WelchTDMLTest
Tests run: 3, Failures: 0, Errors: 0, Skipped: 0, Time elapsed: 4.038 sec - in org.apache.sysml.test.integration.applications.dml.WelchTDMLTest
Running org.apache.sysml.test.integration.applications.dml.ApplyTransformDMLTest
Tests run: 7, Failures: 0, Errors: 0, Skipped: 0, Time elapsed: 13.426 sec - in org.apache.sysml.test.integration.applications.dml.ApplyTransformDMLTest
Running org.apache.sysml.test.integration.applications.pydml.ID3PyDMLTest
Tests run: 2, Failures: 0, Errors: 0, Skipped: 0, Time elapsed: 222.642 sec - in org.apache.sysml.test.integration.applications.pydml.ID3PyDMLTest
Running org.apache.sysml.test.integration.applications.pydml.GNMFPyDMLTest
Tests run: 3, Failures: 0, Errors: 0, Skipped: 0, Time elapsed: 39.085 sec - in org.apache.sysml.test.integration.applications.pydml.GNMFPyDMLTest

Results :

Failed tests: 
  FullReblockTest.testTextCellMultipleMSparseSP:149->runReblockTest:467 31 values are not
in equal

Tests run: 7216, Failures: 1, Errors: 0, Skipped: 0

[INFO] 
[INFO] --- maven-failsafe-plugin:2.17:verify (default) @ systemml ---
[INFO] Failsafe report directory: <https://sparktc.ibmcloud.com/jenkins/job/SystemML-DailyTest/ws/target/failsafe-reports>
[INFO] ------------------------------------------------------------------------
[INFO] BUILD FAILURE
[INFO] ------------------------------------------------------------------------
[INFO] Total time: 01:51 h
[INFO] Finished at: 2017-08-01T05:14:00-05:00
[INFO] Final Memory: 63M/2820M
[INFO] ------------------------------------------------------------------------
[ERROR] Failed to execute goal org.apache.maven.plugins:maven-failsafe-plugin:2.17:verify
(default) on project systemml: There are test failures.
[ERROR] 
[ERROR] Please refer to <https://sparktc.ibmcloud.com/jenkins/job/SystemML-DailyTest/ws/target/failsafe-reports>
for the individual test results.
[ERROR] -> [Help 1]
[ERROR] 
[ERROR] To see the full stack trace of the errors, re-run Maven with the -e switch.
[ERROR] Re-run Maven using the -X switch to enable full debug logging.
[ERROR] 
[ERROR] For more information about the errors and possible solutions, please read the following
articles:
[ERROR] [Help 1] http://cwiki.apache.org/confluence/display/MAVEN/MojoFailureException
Build step 'Execute shell' marked build as failure
Run condition [Always] enabling perform for step [[]]

Mime
View raw message