systemml-dev mailing list archives

Site index · List index
Message view « Date » · « Thread »
Top « Date » · « Thread »
From jenk...@spark.tc
Subject Build failed in Jenkins: SystemML-DailyTest #1074
Date Mon, 26 Jun 2017 10:00:33 GMT
See <https://sparktc.ibmcloud.com/jenkins/job/SystemML-DailyTest/1074/>

------------------------------------------
[...truncated 28623 lines...]
17/06/26 03:59:41 INFO scheduler.DAGScheduler: running: Set(ShuffleMapStage 1)
17/06/26 03:59:41 INFO scheduler.DAGScheduler: waiting: Set(ResultStage 2)
17/06/26 03:59:41 INFO scheduler.DAGScheduler: failed: Set()
17/06/26 03:59:41 INFO scheduler.DAGScheduler: ShuffleMapStage 1 (parallelizePairs at SparkExecutionContext.java:699)
finished in 0.190 s
17/06/26 03:59:41 INFO scheduler.DAGScheduler: looking for newly runnable stages
17/06/26 03:59:41 INFO scheduler.DAGScheduler: running: Set()
17/06/26 03:59:41 INFO scheduler.DAGScheduler: waiting: Set(ResultStage 2)
17/06/26 03:59:41 INFO scheduler.DAGScheduler: failed: Set()
17/06/26 03:59:41 INFO scheduler.DAGScheduler: Submitting ResultStage 2 (MapPartitionsRDD[5]
at mapValues at BinarySPInstruction.java:117), which has no missing parents
17/06/26 03:59:41 INFO memory.MemoryStore: Block broadcast_2 stored as values in memory (estimated
size 4.2 KB, free 1033.8 MB)
17/06/26 03:59:41 INFO memory.MemoryStore: Block broadcast_2_piece0 stored as bytes in memory
(estimated size 2.3 KB, free 1033.8 MB)
17/06/26 03:59:41 INFO storage.BlockManagerInfo: Added broadcast_2_piece0 in memory on 169.54.146.43:51244
(size: 2.3 KB, free: 1033.8 MB)
17/06/26 03:59:41 INFO spark.SparkContext: Created broadcast 2 from broadcast at DAGScheduler.scala:996
17/06/26 03:59:41 INFO scheduler.DAGScheduler: Submitting 1 missing tasks from ResultStage
2 (MapPartitionsRDD[5] at mapValues at BinarySPInstruction.java:117)
17/06/26 03:59:41 INFO scheduler.TaskSchedulerImpl: Adding task set 2.0 with 1 tasks
17/06/26 03:59:41 INFO scheduler.FairSchedulableBuilder: Added task set TaskSet_2.0 tasks
to pool default
17/06/26 03:59:41 INFO scheduler.TaskSetManager: Starting task 0.0 in stage 2.0 (TID 2, localhost,
executor driver, partition 0, PROCESS_LOCAL, 5813 bytes)
17/06/26 03:59:41 INFO executor.Executor: Running task 0.0 in stage 2.0 (TID 2)
17/06/26 03:59:41 INFO storage.ShuffleBlockFetcherIterator: Getting 1 non-empty blocks out
of 1 blocks
17/06/26 03:59:41 INFO storage.ShuffleBlockFetcherIterator: Started 0 remote fetches in 8
ms
17/06/26 03:59:41 INFO storage.ShuffleBlockFetcherIterator: Getting 1 non-empty blocks out
of 1 blocks
17/06/26 03:59:41 INFO storage.ShuffleBlockFetcherIterator: Started 0 remote fetches in 0
ms
17/06/26 03:59:41 INFO executor.Executor: Finished task 0.0 in stage 2.0 (TID 2). 2077 bytes
result sent to driver
17/06/26 03:59:41 INFO scheduler.TaskSetManager: Finished task 0.0 in stage 2.0 (TID 2) in
95 ms on localhost (executor driver) (1/1)
17/06/26 03:59:41 INFO scheduler.TaskSchedulerImpl: Removed TaskSet 2.0, whose tasks have
all completed, from pool default
17/06/26 03:59:41 INFO scheduler.DAGScheduler: ResultStage 2 (collect at SparkExecutionContext.java:789)
finished in 0.096 s
17/06/26 03:59:41 INFO scheduler.DAGScheduler: Registering RDD 7 (parallelizePairs at SparkExecutionContext.java:699)
17/06/26 03:59:41 INFO scheduler.DAGScheduler: Registering RDD 6 (parallelizePairs at SparkExecutionContext.java:699)
17/06/26 03:59:41 INFO scheduler.DAGScheduler: Got job 1 (collect at SparkExecutionContext.java:789)
with 1 output partitions
17/06/26 03:59:41 INFO scheduler.DAGScheduler: Final stage: ResultStage 5 (collect at SparkExecutionContext.java:789)
17/06/26 03:59:41 INFO scheduler.DAGScheduler: Parents of final stage: List(ShuffleMapStage
3, ShuffleMapStage 4)
17/06/26 03:59:41 INFO scheduler.DAGScheduler: Missing parents: List(ShuffleMapStage 3, ShuffleMapStage
4)
17/06/26 03:59:41 INFO scheduler.DAGScheduler: Submitting ShuffleMapStage 3 (ParallelCollectionRDD[7]
at parallelizePairs at SparkExecutionContext.java:699), which has no missing parents
17/06/26 03:59:41 INFO memory.MemoryStore: Block broadcast_3 stored as values in memory (estimated
size 2032.0 B, free 1033.8 MB)
17/06/26 03:59:41 INFO memory.MemoryStore: Block broadcast_3_piece0 stored as bytes in memory
(estimated size 1305.0 B, free 1033.8 MB)
17/06/26 03:59:41 INFO storage.BlockManagerInfo: Added broadcast_3_piece0 in memory on 169.54.146.43:51244
(size: 1305.0 B, free: 1033.8 MB)
17/06/26 03:59:41 INFO spark.SparkContext: Created broadcast 3 from broadcast at DAGScheduler.scala:996
17/06/26 03:59:41 INFO scheduler.DAGScheduler: Submitting 1 missing tasks from ShuffleMapStage
3 (ParallelCollectionRDD[7] at parallelizePairs at SparkExecutionContext.java:699)
17/06/26 03:59:41 INFO scheduler.TaskSchedulerImpl: Adding task set 3.0 with 1 tasks
17/06/26 03:59:41 INFO scheduler.FairSchedulableBuilder: Added task set TaskSet_3.0 tasks
to pool default
17/06/26 03:59:41 INFO scheduler.DAGScheduler: Submitting ShuffleMapStage 4 (ParallelCollectionRDD[6]
at parallelizePairs at SparkExecutionContext.java:699), which has no missing parents
17/06/26 03:59:41 INFO scheduler.TaskSetManager: Starting task 0.0 in stage 3.0 (TID 3, localhost,
executor driver, partition 0, PROCESS_LOCAL, 6445 bytes)
17/06/26 03:59:41 INFO memory.MemoryStore: Block broadcast_4 stored as values in memory (estimated
size 2032.0 B, free 1033.8 MB)
17/06/26 03:59:41 INFO executor.Executor: Running task 0.0 in stage 3.0 (TID 3)
17/06/26 03:59:41 INFO memory.MemoryStore: Block broadcast_4_piece0 stored as bytes in memory
(estimated size 1305.0 B, free 1033.8 MB)
17/06/26 03:59:41 INFO storage.BlockManagerInfo: Added broadcast_4_piece0 in memory on 169.54.146.43:51244
(size: 1305.0 B, free: 1033.8 MB)
17/06/26 03:59:41 INFO executor.Executor: Finished task 0.0 in stage 3.0 (TID 3). 1253 bytes
result sent to driver
17/06/26 03:59:41 INFO spark.SparkContext: Created broadcast 4 from broadcast at DAGScheduler.scala:996
17/06/26 03:59:41 INFO scheduler.DAGScheduler: Submitting 1 missing tasks from ShuffleMapStage
4 (ParallelCollectionRDD[6] at parallelizePairs at SparkExecutionContext.java:699)
17/06/26 03:59:41 INFO scheduler.TaskSchedulerImpl: Adding task set 4.0 with 1 tasks
17/06/26 03:59:41 INFO scheduler.TaskSetManager: Finished task 0.0 in stage 3.0 (TID 3) in
10 ms on localhost (executor driver) (1/1)
17/06/26 03:59:41 INFO scheduler.TaskSchedulerImpl: Removed TaskSet 3.0, whose tasks have
all completed, from pool default
17/06/26 03:59:41 INFO scheduler.FairSchedulableBuilder: Added task set TaskSet_4.0 tasks
to pool default
17/06/26 03:59:41 INFO scheduler.DAGScheduler: ShuffleMapStage 3 (parallelizePairs at SparkExecutionContext.java:699)
finished in 0.013 s
17/06/26 03:59:41 INFO scheduler.DAGScheduler: looking for newly runnable stages
17/06/26 03:59:41 INFO scheduler.TaskSetManager: Starting task 0.0 in stage 4.0 (TID 4, localhost,
executor driver, partition 0, PROCESS_LOCAL, 6445 bytes)
17/06/26 03:59:41 INFO scheduler.DAGScheduler: running: Set(ShuffleMapStage 4)
17/06/26 03:59:41 INFO scheduler.DAGScheduler: waiting: Set(ResultStage 5)
17/06/26 03:59:41 INFO scheduler.DAGScheduler: failed: Set()
17/06/26 03:59:41 INFO executor.Executor: Running task 0.0 in stage 4.0 (TID 4)
17/06/26 03:59:41 INFO executor.Executor: Finished task 0.0 in stage 4.0 (TID 4). 1253 bytes
result sent to driver
17/06/26 03:59:41 INFO scheduler.TaskSetManager: Finished task 0.0 in stage 4.0 (TID 4) in
9 ms on localhost (executor driver) (1/1)
17/06/26 03:59:41 INFO scheduler.TaskSchedulerImpl: Removed TaskSet 4.0, whose tasks have
all completed, from pool default
17/06/26 03:59:41 INFO scheduler.DAGScheduler: ShuffleMapStage 4 (parallelizePairs at SparkExecutionContext.java:699)
finished in 0.011 s
17/06/26 03:59:41 INFO scheduler.DAGScheduler: looking for newly runnable stages
17/06/26 03:59:41 INFO scheduler.DAGScheduler: running: Set()
17/06/26 03:59:41 INFO scheduler.DAGScheduler: waiting: Set(ResultStage 5)
17/06/26 03:59:41 INFO scheduler.DAGScheduler: failed: Set()
17/06/26 03:59:41 INFO scheduler.DAGScheduler: Submitting ResultStage 5 (MapPartitionsRDD[11]
at mapValues at BinarySPInstruction.java:117), which has no missing parents
17/06/26 03:59:41 INFO memory.MemoryStore: Block broadcast_5 stored as values in memory (estimated
size 4.2 KB, free 1033.8 MB)
17/06/26 03:59:41 INFO memory.MemoryStore: Block broadcast_5_piece0 stored as bytes in memory
(estimated size 2.3 KB, free 1033.8 MB)
17/06/26 03:59:41 INFO storage.BlockManagerInfo: Added broadcast_5_piece0 in memory on 169.54.146.43:51244
(size: 2.3 KB, free: 1033.8 MB)
17/06/26 03:59:41 INFO spark.SparkContext: Created broadcast 5 from broadcast at DAGScheduler.scala:996
17/06/26 03:59:41 INFO scheduler.DAGScheduler: Submitting 1 missing tasks from ResultStage
5 (MapPartitionsRDD[11] at mapValues at BinarySPInstruction.java:117)
17/06/26 03:59:41 INFO scheduler.TaskSchedulerImpl: Adding task set 5.0 with 1 tasks
17/06/26 03:59:41 INFO scheduler.FairSchedulableBuilder: Added task set TaskSet_5.0 tasks
to pool default
17/06/26 03:59:41 INFO scheduler.TaskSetManager: Starting task 0.0 in stage 5.0 (TID 5, localhost,
executor driver, partition 0, PROCESS_LOCAL, 5814 bytes)
17/06/26 03:59:41 INFO executor.Executor: Running task 0.0 in stage 5.0 (TID 5)
17/06/26 03:59:41 INFO storage.ShuffleBlockFetcherIterator: Getting 1 non-empty blocks out
of 1 blocks
17/06/26 03:59:41 INFO storage.ShuffleBlockFetcherIterator: Started 0 remote fetches in 1
ms
17/06/26 03:59:41 INFO storage.ShuffleBlockFetcherIterator: Getting 1 non-empty blocks out
of 1 blocks
17/06/26 03:59:41 INFO storage.ShuffleBlockFetcherIterator: Started 0 remote fetches in 0
ms
17/06/26 03:59:41 INFO executor.Executor: Finished task 0.0 in stage 5.0 (TID 5). 2240 bytes
result sent to driver
17/06/26 03:59:41 INFO scheduler.TaskSetManager: Finished task 0.0 in stage 5.0 (TID 5) in
10 ms on localhost (executor driver) (1/1)
17/06/26 03:59:41 INFO scheduler.TaskSchedulerImpl: Removed TaskSet 5.0, whose tasks have
all completed, from pool default
17/06/26 03:59:41 INFO scheduler.DAGScheduler: ResultStage 5 (collect at SparkExecutionContext.java:789)
finished in 0.012 s
17/06/26 03:59:42 INFO storage.BlockManagerInfo: Removed broadcast_4_piece0 on 169.54.146.43:51244
in memory (size: 1305.0 B, free: 1033.8 MB)
17/06/26 03:59:42 INFO spark.ContextCleaner: Cleaned shuffle 0
17/06/26 03:59:42 INFO spark.ContextCleaner: Cleaned shuffle 1
17/06/26 03:59:42 INFO storage.BlockManagerInfo: Removed broadcast_0_piece0 on 169.54.146.43:51244
in memory (size: 1305.0 B, free: 1033.8 MB)
17/06/26 03:59:42 INFO storage.BlockManagerInfo: Removed broadcast_5_piece0 on 169.54.146.43:51244
in memory (size: 2.3 KB, free: 1033.8 MB)
17/06/26 03:59:42 INFO storage.BlockManagerInfo: Removed broadcast_2_piece0 on 169.54.146.43:51244
in memory (size: 2.3 KB, free: 1033.8 MB)
17/06/26 03:59:42 INFO spark.ContextCleaner: Cleaned shuffle 2
17/06/26 03:59:42 INFO spark.ContextCleaner: Cleaned shuffle 3
17/06/26 03:59:42 INFO storage.BlockManagerInfo: Removed broadcast_3_piece0 on 169.54.146.43:51244
in memory (size: 1305.0 B, free: 1033.8 MB)
17/06/26 03:59:42 INFO storage.BlockManagerInfo: Removed broadcast_1_piece0 on 169.54.146.43:51244
in memory (size: 1302.0 B, free: 1033.8 MB)
17/06/26 04:02:00 INFO server.ServerConnector: Stopped ServerConnector@546659ae{HTTP/1.1}{0.0.0.0:4040}
17/06/26 04:02:00 INFO handler.ContextHandler: Stopped o.s.j.s.ServletContextHandler@564be3dd{/stages/stage/kill,null,UNAVAILABLE}
17/06/26 04:02:00 INFO handler.ContextHandler: Stopped o.s.j.s.ServletContextHandler@ed0a4cd{/jobs/job/kill,null,UNAVAILABLE}
17/06/26 04:02:00 INFO handler.ContextHandler: Stopped o.s.j.s.ServletContextHandler@24e65670{/api,null,UNAVAILABLE}
17/06/26 04:02:00 INFO handler.ContextHandler: Stopped o.s.j.s.ServletContextHandler@d92b612{/,null,UNAVAILABLE}
17/06/26 04:02:00 INFO handler.ContextHandler: Stopped o.s.j.s.ServletContextHandler@372deddf{/static,null,UNAVAILABLE}
17/06/26 04:02:00 INFO handler.ContextHandler: Stopped o.s.j.s.ServletContextHandler@5b0e324b{/executors/threadDump/json,null,UNAVAILABLE}
17/06/26 04:02:00 INFO handler.ContextHandler: Stopped o.s.j.s.ServletContextHandler@7fbaccfc{/executors/threadDump,null,UNAVAILABLE}
17/06/26 04:02:00 INFO handler.ContextHandler: Stopped o.s.j.s.ServletContextHandler@2cc2c8e0{/executors/json,null,UNAVAILABLE}
17/06/26 04:02:00 INFO handler.ContextHandler: Stopped o.s.j.s.ServletContextHandler@4f947b7e{/executors,null,UNAVAILABLE}
17/06/26 04:02:00 INFO handler.ContextHandler: Stopped o.s.j.s.ServletContextHandler@4b5de9a1{/environment/json,null,UNAVAILABLE}
17/06/26 04:02:00 INFO handler.ContextHandler: Stopped o.s.j.s.ServletContextHandler@21fe5aae{/environment,null,UNAVAILABLE}
17/06/26 04:02:00 INFO handler.ContextHandler: Stopped o.s.j.s.ServletContextHandler@178e8773{/storage/rdd/json,null,UNAVAILABLE}
17/06/26 04:02:00 INFO handler.ContextHandler: Stopped o.s.j.s.ServletContextHandler@727ec662{/storage/rdd,null,UNAVAILABLE}
17/06/26 04:02:00 INFO handler.ContextHandler: Stopped o.s.j.s.ServletContextHandler@12bf1ede{/storage/json,null,UNAVAILABLE}
17/06/26 04:02:00 INFO handler.ContextHandler: Stopped o.s.j.s.ServletContextHandler@6b4ba1a5{/storage,null,UNAVAILABLE}
17/06/26 04:02:00 INFO handler.ContextHandler: Stopped o.s.j.s.ServletContextHandler@4ec57a04{/stages/pool/json,null,UNAVAILABLE}
17/06/26 04:02:00 INFO handler.ContextHandler: Stopped o.s.j.s.ServletContextHandler@f7dfb90{/stages/pool,null,UNAVAILABLE}
17/06/26 04:02:00 INFO handler.ContextHandler: Stopped o.s.j.s.ServletContextHandler@5b34572d{/stages/stage/json,null,UNAVAILABLE}
17/06/26 04:02:00 INFO handler.ContextHandler: Stopped o.s.j.s.ServletContextHandler@1e676990{/stages/stage,null,UNAVAILABLE}
17/06/26 04:02:00 INFO handler.ContextHandler: Stopped o.s.j.s.ServletContextHandler@4e31f912{/stages/json,null,UNAVAILABLE}
17/06/26 04:02:00 INFO handler.ContextHandler: Stopped o.s.j.s.ServletContextHandler@250e2271{/stages,null,UNAVAILABLE}
17/06/26 04:02:00 INFO handler.ContextHandler: Stopped o.s.j.s.ServletContextHandler@264c6b4a{/jobs/job/json,null,UNAVAILABLE}
17/06/26 04:02:00 INFO handler.ContextHandler: Stopped o.s.j.s.ServletContextHandler@16b8d7cb{/jobs/job,null,UNAVAILABLE}
17/06/26 04:02:00 INFO handler.ContextHandler: Stopped o.s.j.s.ServletContextHandler@39ca43c9{/jobs/json,null,UNAVAILABLE}
17/06/26 04:02:00 INFO handler.ContextHandler: Stopped o.s.j.s.ServletContextHandler@34a6fcfe{/jobs,null,UNAVAILABLE}
17/06/26 04:02:00 INFO ui.SparkUI: Stopped Spark web UI at http://169.54.146.43:4040
17/06/26 04:02:00 INFO spark.MapOutputTrackerMasterEndpoint: MapOutputTrackerMasterEndpoint
stopped!
17/06/26 04:02:00 INFO memory.MemoryStore: MemoryStore cleared
17/06/26 04:02:00 INFO storage.BlockManager: BlockManager stopped
17/06/26 04:02:00 INFO storage.BlockManagerMaster: BlockManagerMaster stopped
17/06/26 04:02:00 INFO scheduler.OutputCommitCoordinator$OutputCommitCoordinatorEndpoint:
OutputCommitCoordinator stopped!
17/06/26 04:02:00 INFO spark.SparkContext: Successfully stopped SparkContext
Running org.apache.sysml.test.integration.scripts.nn.NNTest
Tests run: 1, Failures: 0, Errors: 0, Skipped: 0, Time elapsed: 659.98 sec - in org.apache.sysml.test.integration.scripts.nn.NNTest
17/06/26 04:02:00 INFO util.ShutdownHookManager: Shutdown hook called
17/06/26 04:02:00 INFO util.ShutdownHookManager: Deleting directory /tmp/spark-e13658bc-17f4-44cb-a5c4-16f428432bcd
Running org.apache.sysml.test.integration.functions.quaternary.WeightedDivMatrixMultTest
Tests run: 90, Failures: 0, Errors: 0, Skipped: 0, Time elapsed: 1,478.658 sec - in org.apache.sysml.test.integration.functions.quaternary.WeightedDivMatrixMultTest
17/06/26 04:02:19 INFO util.ShutdownHookManager: Shutdown hook called
17/06/26 04:02:19 INFO util.ShutdownHookManager: Deleting directory /tmp/spark-c1d5a0ff-179e-44c6-a5fa-bafe1e75df5b
Running org.apache.sysml.test.integration.applications.descriptivestats.UnivariateWeightedScaleDenseTest
Tests run: 24, Failures: 0, Errors: 0, Skipped: 0, Time elapsed: 356.804 sec - in org.apache.sysml.test.integration.applications.descriptivestats.UnivariateWeightedScaleDenseTest
Running org.apache.sysml.test.integration.functions.append.AppendChainTest
Tests run: 12, Failures: 0, Errors: 0, Skipped: 0, Time elapsed: 1,073.768 sec - in org.apache.sysml.test.integration.functions.append.AppendChainTest
Running org.apache.sysml.test.integration.applications.parfor.ParForNaiveBayesTest
Tests run: 10, Failures: 0, Errors: 0, Skipped: 0, Time elapsed: 532.828 sec - in org.apache.sysml.test.integration.applications.parfor.ParForNaiveBayesTest
Running org.apache.sysml.test.integration.applications.parfor.ParForSampleTest
Tests run: 6, Failures: 0, Errors: 0, Skipped: 0, Time elapsed: 104.66 sec - in org.apache.sysml.test.integration.applications.parfor.ParForSampleTest
Running org.apache.sysml.test.integration.applications.descriptivestats.UnivariateUnweightedScaleSparseTest
Running org.apache.sysml.test.integration.applications.parfor.ParForUnivariateStatsTest
Tests run: 24, Failures: 0, Errors: 0, Skipped: 0, Time elapsed: 274.184 sec - in org.apache.sysml.test.integration.applications.descriptivestats.UnivariateUnweightedScaleSparseTest
Tests run: 3, Failures: 0, Errors: 0, Skipped: 0, Time elapsed: 7.782 sec - in org.apache.sysml.test.integration.applications.parfor.ParForUnivariateStatsTest
Running org.apache.sysml.test.integration.applications.dml.HITSDMLTest
Tests run: 1, Failures: 0, Errors: 0, Skipped: 0, Time elapsed: 89.143 sec - in org.apache.sysml.test.integration.applications.dml.HITSDMLTest
Running org.apache.sysml.test.integration.functions.append.AppendMatrixTest
Tests run: 22, Failures: 0, Errors: 0, Skipped: 0, Time elapsed: 1,424.506 sec - in org.apache.sysml.test.integration.functions.append.AppendMatrixTest
Running org.apache.sysml.test.integration.applications.descriptivestats.UnivariateWeightedScaleSparseTest
Tests run: 24, Failures: 0, Errors: 0, Skipped: 0, Time elapsed: 340.042 sec - in org.apache.sysml.test.integration.applications.descriptivestats.UnivariateWeightedScaleSparseTest
Running org.apache.sysml.test.integration.applications.pydml.ArimaPyDMLTest
Tests run: 1, Failures: 0, Errors: 0, Skipped: 0, Time elapsed: 48.202 sec - in org.apache.sysml.test.integration.applications.pydml.ArimaPyDMLTest
Running org.apache.sysml.test.integration.applications.pydml.HITSPyDMLTest
Tests run: 1, Failures: 0, Errors: 0, Skipped: 0, Time elapsed: 78.446 sec - in org.apache.sysml.test.integration.applications.pydml.HITSPyDMLTest
Running org.apache.sysml.test.integration.applications.dml.LinearRegressionDMLTest
Tests run: 7, Failures: 0, Errors: 0, Skipped: 0, Time elapsed: 51.074 sec - in org.apache.sysml.test.integration.applications.dml.LinearRegressionDMLTest
Running org.apache.sysml.test.integration.applications.pydml.CsplineDSPyDMLTest
Tests run: 3, Failures: 0, Errors: 0, Skipped: 0, Time elapsed: 6.659 sec - in org.apache.sysml.test.integration.applications.pydml.CsplineDSPyDMLTest
Running org.apache.sysml.test.integration.applications.pydml.LinearLogRegPyDMLTest
Tests run: 7, Failures: 0, Errors: 0, Skipped: 0, Time elapsed: 89.523 sec - in org.apache.sysml.test.integration.applications.pydml.LinearLogRegPyDMLTest
Running org.apache.sysml.test.integration.applications.pydml.NaiveBayesPyDMLTest
Tests run: 6, Failures: 0, Errors: 0, Skipped: 0, Time elapsed: 80.731 sec - in org.apache.sysml.test.integration.applications.pydml.NaiveBayesPyDMLTest
Running org.apache.sysml.test.integration.applications.dml.CsplineCGDMLTest
Tests run: 3, Failures: 0, Errors: 0, Skipped: 0, Time elapsed: 13.813 sec - in org.apache.sysml.test.integration.applications.dml.CsplineCGDMLTest
Running org.apache.sysml.test.integration.applications.dml.L2SVMDMLTest
Tests run: 9, Failures: 0, Errors: 0, Skipped: 0, Time elapsed: 64.786 sec - in org.apache.sysml.test.integration.applications.dml.L2SVMDMLTest
Running org.apache.sysml.test.integration.applications.pydml.MDABivariateStatsPyDMLTest
Tests run: 4, Failures: 0, Errors: 0, Skipped: 0, Time elapsed: 293.771 sec - in org.apache.sysml.test.integration.applications.pydml.MDABivariateStatsPyDMLTest
Running org.apache.sysml.test.integration.applications.pydml.PageRankPyDMLTest
Tests run: 3, Failures: 0, Errors: 0, Skipped: 0, Time elapsed: 6.32 sec - in org.apache.sysml.test.integration.applications.pydml.PageRankPyDMLTest
Running org.apache.sysml.test.integration.applications.pydml.NaiveBayesParforPyDMLTest
Tests run: 6, Failures: 0, Errors: 0, Skipped: 0, Time elapsed: 80.773 sec - in org.apache.sysml.test.integration.applications.pydml.NaiveBayesParforPyDMLTest
Running org.apache.sysml.test.integration.applications.dml.NaiveBayesDMLTest
Tests run: 6, Failures: 0, Errors: 0, Skipped: 0, Time elapsed: 81.128 sec - in org.apache.sysml.test.integration.applications.dml.NaiveBayesDMLTest
Running org.apache.sysml.test.integration.applications.dml.MDABivariateStatsDMLTest
Tests run: 4, Failures: 0, Errors: 0, Skipped: 0, Time elapsed: 293.088 sec - in org.apache.sysml.test.integration.applications.dml.MDABivariateStatsDMLTest
Running org.apache.sysml.test.integration.applications.dml.PageRankDMLTest
Tests run: 3, Failures: 0, Errors: 0, Skipped: 0, Time elapsed: 6.101 sec - in org.apache.sysml.test.integration.applications.dml.PageRankDMLTest
Running org.apache.sysml.test.integration.applications.pydml.GLMPyDMLTest
Tests run: 30, Failures: 0, Errors: 0, Skipped: 0, Time elapsed: 584.102 sec - in org.apache.sysml.test.integration.applications.pydml.GLMPyDMLTest
Running org.apache.sysml.test.integration.applications.pydml.MultiClassSVMPyDMLTest
Tests run: 9, Failures: 0, Errors: 0, Skipped: 0, Time elapsed: 88.666 sec - in org.apache.sysml.test.integration.applications.pydml.MultiClassSVMPyDMLTest
Running org.apache.sysml.test.integration.applications.dml.ID3DMLTest
Tests run: 2, Failures: 0, Errors: 0, Skipped: 0, Time elapsed: 401.295 sec - in org.apache.sysml.test.integration.applications.dml.ID3DMLTest
Running org.apache.sysml.test.integration.applications.dml.GLMDMLTest
Tests run: 30, Failures: 0, Errors: 0, Skipped: 0, Time elapsed: 848.889 sec - in org.apache.sysml.test.integration.applications.dml.GLMDMLTest
Running org.apache.sysml.test.integration.applications.pydml.CsplineCGPyDMLTest
Tests run: 3, Failures: 0, Errors: 0, Skipped: 0, Time elapsed: 6.082 sec - in org.apache.sysml.test.integration.applications.pydml.CsplineCGPyDMLTest
Running org.apache.sysml.test.integration.applications.pydml.WelchTPyDMLTest
Tests run: 3, Failures: 0, Errors: 0, Skipped: 0, Time elapsed: 6.383 sec - in org.apache.sysml.test.integration.applications.pydml.WelchTPyDMLTest
Running org.apache.sysml.test.integration.applications.dml.MultiClassSVMDMLTest
Tests run: 9, Failures: 0, Errors: 0, Skipped: 0, Time elapsed: 88.177 sec - in org.apache.sysml.test.integration.applications.dml.MultiClassSVMDMLTest
Running org.apache.sysml.test.integration.applications.dml.CsplineDSDMLTest
Tests run: 3, Failures: 0, Errors: 0, Skipped: 0, Time elapsed: 14.48 sec - in org.apache.sysml.test.integration.applications.dml.CsplineDSDMLTest
Running org.apache.sysml.test.integration.applications.pydml.ApplyTransformPyDMLTest
Tests run: 7, Failures: 0, Errors: 0, Skipped: 0, Time elapsed: 0.848 sec - in org.apache.sysml.test.integration.applications.pydml.ApplyTransformPyDMLTest
Running org.apache.sysml.test.integration.applications.dml.NaiveBayesParforDMLTest
Tests run: 6, Failures: 0, Errors: 0, Skipped: 0, Time elapsed: 80.832 sec - in org.apache.sysml.test.integration.applications.dml.NaiveBayesParforDMLTest
Running org.apache.sysml.test.integration.applications.pydml.L2SVMPyDMLTest
Tests run: 9, Failures: 0, Errors: 0, Skipped: 0, Time elapsed: 64.072 sec - in org.apache.sysml.test.integration.applications.pydml.L2SVMPyDMLTest
Running org.apache.sysml.test.integration.applications.pydml.LinearRegressionPyDMLTest
Tests run: 7, Failures: 0, Errors: 0, Skipped: 0, Time elapsed: 51.145 sec - in org.apache.sysml.test.integration.applications.pydml.LinearRegressionPyDMLTest
Running org.apache.sysml.test.integration.applications.dml.LinearLogRegDMLTest
Tests run: 7, Failures: 0, Errors: 0, Skipped: 0, Time elapsed: 61.235 sec - in org.apache.sysml.test.integration.applications.dml.LinearLogRegDMLTest
Running org.apache.sysml.test.integration.applications.dml.GNMFDMLTest
Tests run: 3, Failures: 0, Errors: 0, Skipped: 0, Time elapsed: 62.386 sec - in org.apache.sysml.test.integration.applications.dml.GNMFDMLTest
Running org.apache.sysml.test.integration.applications.dml.WelchTDMLTest
Tests run: 3, Failures: 0, Errors: 0, Skipped: 0, Time elapsed: 6.404 sec - in org.apache.sysml.test.integration.applications.dml.WelchTDMLTest
Running org.apache.sysml.test.integration.applications.dml.ApplyTransformDMLTest
Tests run: 7, Failures: 0, Errors: 0, Skipped: 0, Time elapsed: 17.449 sec - in org.apache.sysml.test.integration.applications.dml.ApplyTransformDMLTest
Running org.apache.sysml.test.integration.applications.pydml.ID3PyDMLTest
Tests run: 2, Failures: 0, Errors: 0, Skipped: 0, Time elapsed: 388.204 sec - in org.apache.sysml.test.integration.applications.pydml.ID3PyDMLTest
Running org.apache.sysml.test.integration.applications.pydml.GNMFPyDMLTest
Tests run: 3, Failures: 0, Errors: 0, Skipped: 0, Time elapsed: 57.32 sec - in org.apache.sysml.test.integration.applications.pydml.GNMFPyDMLTest

Results :

Failed tests: 
  FullReblockTest.testCSVSingeMSparseMR:382->runReblockTest:479 34 values are not in equal

Tests run: 7066, Failures: 1, Errors: 0, Skipped: 0

[INFO] 
[INFO] --- maven-failsafe-plugin:2.17:verify (default) @ systemml ---
[INFO] Failsafe report directory: <https://sparktc.ibmcloud.com/jenkins/job/SystemML-DailyTest/ws/target/failsafe-reports>
[INFO] ------------------------------------------------------------------------
[INFO] BUILD FAILURE
[INFO] ------------------------------------------------------------------------
[INFO] Total time: 02:28 h
[INFO] Finished at: 2017-06-26T05:00:32-05:00
[INFO] Final Memory: 63M/2640M
[INFO] ------------------------------------------------------------------------
[ERROR] Failed to execute goal org.apache.maven.plugins:maven-failsafe-plugin:2.17:verify
(default) on project systemml: There are test failures.
[ERROR] 
[ERROR] Please refer to <https://sparktc.ibmcloud.com/jenkins/job/SystemML-DailyTest/ws/target/failsafe-reports>
for the individual test results.
[ERROR] -> [Help 1]
[ERROR] 
[ERROR] To see the full stack trace of the errors, re-run Maven with the -e switch.
[ERROR] Re-run Maven using the -X switch to enable full debug logging.
[ERROR] 
[ERROR] For more information about the errors and possible solutions, please read the following
articles:
[ERROR] [Help 1] http://cwiki.apache.org/confluence/display/MAVEN/MojoFailureException
Build step 'Execute shell' marked build as failure
Run condition [Always] enabling perform for step [[]]

Mime
View raw message