systemml-dev mailing list archives

Site index · List index
Message view « Date » · « Thread »
Top « Date » · « Thread »
From jenk...@spark.tc
Subject Build failed in Jenkins: SystemML-DailyTest #1069
Date Fri, 23 Jun 2017 22:50:51 GMT
See <https://sparktc.ibmcloud.com/jenkins/job/SystemML-DailyTest/1069/>

------------------------------------------
[...truncated 28763 lines...]
17/06/23 16:39:05 INFO executor.Executor: Finished task 0.0 in stage 3.0 (TID 3). 1253 bytes
result sent to driver
17/06/23 16:39:05 INFO spark.SparkContext: Created broadcast 4 from broadcast at DAGScheduler.scala:996
17/06/23 16:39:05 INFO scheduler.DAGScheduler: Submitting 1 missing tasks from ShuffleMapStage
4 (ParallelCollectionRDD[6] at parallelizePairs at SparkExecutionContext.java:699)
17/06/23 16:39:05 INFO scheduler.TaskSchedulerImpl: Adding task set 4.0 with 1 tasks
17/06/23 16:39:05 INFO scheduler.FairSchedulableBuilder: Added task set TaskSet_4.0 tasks
to pool default
17/06/23 16:39:05 INFO storage.BlockManagerInfo: Removed broadcast_1_piece0 on 169.54.146.43:49009
in memory (size: 1302.0 B, free: 1033.8 MB)
17/06/23 16:39:05 INFO scheduler.TaskSetManager: Starting task 0.0 in stage 4.0 (TID 4, localhost,
executor driver, partition 0, PROCESS_LOCAL, 6445 bytes)
17/06/23 16:39:05 INFO executor.Executor: Running task 0.0 in stage 4.0 (TID 4)
17/06/23 16:39:05 INFO storage.BlockManagerInfo: Removed broadcast_0_piece0 on 169.54.146.43:49009
in memory (size: 1305.0 B, free: 1033.8 MB)
17/06/23 16:39:05 INFO scheduler.TaskSetManager: Finished task 0.0 in stage 3.0 (TID 3) in
78 ms on localhost (executor driver) (1/1)
17/06/23 16:39:05 INFO scheduler.TaskSchedulerImpl: Removed TaskSet 3.0, whose tasks have
all completed, from pool default
17/06/23 16:39:05 INFO spark.ContextCleaner: Cleaned shuffle 0
17/06/23 16:39:05 INFO scheduler.DAGScheduler: ShuffleMapStage 3 (parallelizePairs at SparkExecutionContext.java:699)
finished in 0.079 s
17/06/23 16:39:05 INFO scheduler.DAGScheduler: looking for newly runnable stages
17/06/23 16:39:05 INFO spark.ContextCleaner: Cleaned shuffle 1
17/06/23 16:39:05 INFO scheduler.DAGScheduler: running: Set(ShuffleMapStage 4)
17/06/23 16:39:05 INFO scheduler.DAGScheduler: waiting: Set(ResultStage 5)
17/06/23 16:39:05 INFO scheduler.DAGScheduler: failed: Set()
17/06/23 16:39:05 INFO executor.Executor: Finished task 0.0 in stage 4.0 (TID 4). 1253 bytes
result sent to driver
17/06/23 16:39:05 INFO scheduler.TaskSetManager: Finished task 0.0 in stage 4.0 (TID 4) in
16 ms on localhost (executor driver) (1/1)
17/06/23 16:39:05 INFO scheduler.TaskSchedulerImpl: Removed TaskSet 4.0, whose tasks have
all completed, from pool default
17/06/23 16:39:05 INFO scheduler.DAGScheduler: ShuffleMapStage 4 (parallelizePairs at SparkExecutionContext.java:699)
finished in 0.017 s
17/06/23 16:39:05 INFO scheduler.DAGScheduler: looking for newly runnable stages
17/06/23 16:39:05 INFO scheduler.DAGScheduler: running: Set()
17/06/23 16:39:05 INFO scheduler.DAGScheduler: waiting: Set(ResultStage 5)
17/06/23 16:39:05 INFO scheduler.DAGScheduler: failed: Set()
17/06/23 16:39:05 INFO scheduler.DAGScheduler: Submitting ResultStage 5 (MapPartitionsRDD[11]
at mapValues at BinarySPInstruction.java:117), which has no missing parents
17/06/23 16:39:05 INFO memory.MemoryStore: Block broadcast_5 stored as values in memory (estimated
size 4.2 KB, free 1033.8 MB)
17/06/23 16:39:05 INFO memory.MemoryStore: Block broadcast_5_piece0 stored as bytes in memory
(estimated size 2.3 KB, free 1033.8 MB)
17/06/23 16:39:06 INFO storage.BlockManagerInfo: Added broadcast_5_piece0 in memory on 169.54.146.43:49009
(size: 2.3 KB, free: 1033.8 MB)
17/06/23 16:39:06 INFO spark.SparkContext: Created broadcast 5 from broadcast at DAGScheduler.scala:996
17/06/23 16:39:06 INFO scheduler.DAGScheduler: Submitting 1 missing tasks from ResultStage
5 (MapPartitionsRDD[11] at mapValues at BinarySPInstruction.java:117)
17/06/23 16:39:06 INFO scheduler.TaskSchedulerImpl: Adding task set 5.0 with 1 tasks
17/06/23 16:39:06 INFO scheduler.FairSchedulableBuilder: Added task set TaskSet_5.0 tasks
to pool default
17/06/23 16:39:06 INFO scheduler.TaskSetManager: Starting task 0.0 in stage 5.0 (TID 5, localhost,
executor driver, partition 0, PROCESS_LOCAL, 5814 bytes)
17/06/23 16:39:06 INFO executor.Executor: Running task 0.0 in stage 5.0 (TID 5)
17/06/23 16:39:06 INFO storage.ShuffleBlockFetcherIterator: Getting 1 non-empty blocks out
of 1 blocks
17/06/23 16:39:06 INFO storage.ShuffleBlockFetcherIterator: Started 0 remote fetches in 0
ms
17/06/23 16:39:06 INFO storage.ShuffleBlockFetcherIterator: Getting 1 non-empty blocks out
of 1 blocks
17/06/23 16:39:06 INFO storage.ShuffleBlockFetcherIterator: Started 0 remote fetches in 1
ms
17/06/23 16:39:06 INFO executor.Executor: Finished task 0.0 in stage 5.0 (TID 5). 2327 bytes
result sent to driver
17/06/23 16:39:06 INFO scheduler.TaskSetManager: Finished task 0.0 in stage 5.0 (TID 5) in
15 ms on localhost (executor driver) (1/1)
17/06/23 16:39:06 INFO scheduler.TaskSchedulerImpl: Removed TaskSet 5.0, whose tasks have
all completed, from pool default
17/06/23 16:39:06 INFO scheduler.DAGScheduler: ResultStage 5 (collect at SparkExecutionContext.java:789)
finished in 0.016 s
17/06/23 16:39:07 INFO storage.BlockManagerInfo: Removed broadcast_5_piece0 on 169.54.146.43:49009
in memory (size: 2.3 KB, free: 1033.8 MB)
17/06/23 16:39:07 INFO storage.BlockManagerInfo: Removed broadcast_4_piece0 on 169.54.146.43:49009
in memory (size: 1305.0 B, free: 1033.8 MB)
17/06/23 16:39:07 INFO spark.ContextCleaner: Cleaned shuffle 2
17/06/23 16:39:07 INFO spark.ContextCleaner: Cleaned shuffle 3
17/06/23 16:39:07 INFO storage.BlockManagerInfo: Removed broadcast_3_piece0 on 169.54.146.43:49009
in memory (size: 1305.0 B, free: 1033.8 MB)
Running org.apache.sysml.test.integration.applications.parfor.ParForSampleTest
Tests run: 6, Failures: 0, Errors: 0, Skipped: 0, Time elapsed: 186.085 sec - in org.apache.sysml.test.integration.applications.parfor.ParForSampleTest
Running org.apache.sysml.test.integration.applications.parfor.ParForUnivariateStatsTest
Tests run: 3, Failures: 0, Errors: 0, Skipped: 0, Time elapsed: 17.334 sec - in org.apache.sysml.test.integration.applications.parfor.ParForUnivariateStatsTest
17/06/23 16:42:56 INFO server.ServerConnector: Stopped ServerConnector@546659ae{HTTP/1.1}{0.0.0.0:4040}
17/06/23 16:42:56 INFO handler.ContextHandler: Stopped o.s.j.s.ServletContextHandler@564be3dd{/stages/stage/kill,null,UNAVAILABLE}
17/06/23 16:42:56 INFO handler.ContextHandler: Stopped o.s.j.s.ServletContextHandler@ed0a4cd{/jobs/job/kill,null,UNAVAILABLE}
17/06/23 16:42:56 INFO handler.ContextHandler: Stopped o.s.j.s.ServletContextHandler@24e65670{/api,null,UNAVAILABLE}
17/06/23 16:42:56 INFO handler.ContextHandler: Stopped o.s.j.s.ServletContextHandler@d92b612{/,null,UNAVAILABLE}
17/06/23 16:42:56 INFO handler.ContextHandler: Stopped o.s.j.s.ServletContextHandler@372deddf{/static,null,UNAVAILABLE}
17/06/23 16:42:56 INFO handler.ContextHandler: Stopped o.s.j.s.ServletContextHandler@5b0e324b{/executors/threadDump/json,null,UNAVAILABLE}
17/06/23 16:42:56 INFO handler.ContextHandler: Stopped o.s.j.s.ServletContextHandler@7fbaccfc{/executors/threadDump,null,UNAVAILABLE}
17/06/23 16:42:56 INFO handler.ContextHandler: Stopped o.s.j.s.ServletContextHandler@2cc2c8e0{/executors/json,null,UNAVAILABLE}
17/06/23 16:42:56 INFO handler.ContextHandler: Stopped o.s.j.s.ServletContextHandler@4f947b7e{/executors,null,UNAVAILABLE}
17/06/23 16:42:56 INFO handler.ContextHandler: Stopped o.s.j.s.ServletContextHandler@4b5de9a1{/environment/json,null,UNAVAILABLE}
17/06/23 16:42:56 INFO handler.ContextHandler: Stopped o.s.j.s.ServletContextHandler@21fe5aae{/environment,null,UNAVAILABLE}
17/06/23 16:42:56 INFO handler.ContextHandler: Stopped o.s.j.s.ServletContextHandler@178e8773{/storage/rdd/json,null,UNAVAILABLE}
17/06/23 16:42:56 INFO handler.ContextHandler: Stopped o.s.j.s.ServletContextHandler@727ec662{/storage/rdd,null,UNAVAILABLE}
17/06/23 16:42:56 INFO handler.ContextHandler: Stopped o.s.j.s.ServletContextHandler@12bf1ede{/storage/json,null,UNAVAILABLE}
17/06/23 16:42:56 INFO handler.ContextHandler: Stopped o.s.j.s.ServletContextHandler@6b4ba1a5{/storage,null,UNAVAILABLE}
17/06/23 16:42:56 INFO handler.ContextHandler: Stopped o.s.j.s.ServletContextHandler@4ec57a04{/stages/pool/json,null,UNAVAILABLE}
17/06/23 16:42:56 INFO handler.ContextHandler: Stopped o.s.j.s.ServletContextHandler@f7dfb90{/stages/pool,null,UNAVAILABLE}
17/06/23 16:42:56 INFO handler.ContextHandler: Stopped o.s.j.s.ServletContextHandler@5b34572d{/stages/stage/json,null,UNAVAILABLE}
17/06/23 16:42:56 INFO handler.ContextHandler: Stopped o.s.j.s.ServletContextHandler@1e676990{/stages/stage,null,UNAVAILABLE}
17/06/23 16:42:56 INFO handler.ContextHandler: Stopped o.s.j.s.ServletContextHandler@4e31f912{/stages/json,null,UNAVAILABLE}
17/06/23 16:42:56 INFO handler.ContextHandler: Stopped o.s.j.s.ServletContextHandler@250e2271{/stages,null,UNAVAILABLE}
17/06/23 16:42:56 INFO handler.ContextHandler: Stopped o.s.j.s.ServletContextHandler@264c6b4a{/jobs/job/json,null,UNAVAILABLE}
17/06/23 16:42:56 INFO handler.ContextHandler: Stopped o.s.j.s.ServletContextHandler@16b8d7cb{/jobs/job,null,UNAVAILABLE}
17/06/23 16:42:56 INFO handler.ContextHandler: Stopped o.s.j.s.ServletContextHandler@39ca43c9{/jobs/json,null,UNAVAILABLE}
17/06/23 16:42:56 INFO handler.ContextHandler: Stopped o.s.j.s.ServletContextHandler@34a6fcfe{/jobs,null,UNAVAILABLE}
17/06/23 16:42:56 INFO ui.SparkUI: Stopped Spark web UI at http://169.54.146.43:4040
17/06/23 16:42:56 INFO spark.MapOutputTrackerMasterEndpoint: MapOutputTrackerMasterEndpoint
stopped!
17/06/23 16:42:57 INFO memory.MemoryStore: MemoryStore cleared
17/06/23 16:42:57 INFO storage.BlockManager: BlockManager stopped
17/06/23 16:42:57 INFO storage.BlockManagerMaster: BlockManagerMaster stopped
17/06/23 16:42:57 INFO scheduler.OutputCommitCoordinator$OutputCommitCoordinatorEndpoint:
OutputCommitCoordinator stopped!
17/06/23 16:42:57 INFO spark.SparkContext: Successfully stopped SparkContext
Running org.apache.sysml.test.integration.scripts.nn.NNTest
Tests run: 1, Failures: 0, Errors: 0, Skipped: 0, Time elapsed: 1,800.606 sec - in org.apache.sysml.test.integration.scripts.nn.NNTest
17/06/23 16:42:57 INFO util.ShutdownHookManager: Shutdown hook called
17/06/23 16:42:57 INFO util.ShutdownHookManager: Deleting directory /tmp/spark-35474e64-56d9-4c65-ac83-674112d08115
Running org.apache.sysml.test.integration.applications.descriptivestats.UnivariateWeightedScaleSparseTest
Tests run: 24, Failures: 0, Errors: 0, Skipped: 0, Time elapsed: 452.601 sec - in org.apache.sysml.test.integration.applications.descriptivestats.UnivariateWeightedScaleSparseTest
Running org.apache.sysml.test.integration.functions.append.AppendMatrixTest
Tests run: 22, Failures: 0, Errors: 0, Skipped: 0, Time elapsed: 2,099.471 sec - in org.apache.sysml.test.integration.functions.append.AppendMatrixTest
Running org.apache.sysml.test.integration.applications.dml.HITSDMLTest
Tests run: 1, Failures: 0, Errors: 0, Skipped: 0, Time elapsed: 188.017 sec - in org.apache.sysml.test.integration.applications.dml.HITSDMLTest
Running org.apache.sysml.test.integration.applications.pydml.ArimaPyDMLTest
Tests run: 1, Failures: 0, Errors: 0, Skipped: 0, Time elapsed: 51.638 sec - in org.apache.sysml.test.integration.applications.pydml.ArimaPyDMLTest
Running org.apache.sysml.test.integration.applications.pydml.HITSPyDMLTest
Tests run: 1, Failures: 0, Errors: 0, Skipped: 0, Time elapsed: 77.222 sec - in org.apache.sysml.test.integration.applications.pydml.HITSPyDMLTest
Running org.apache.sysml.test.integration.applications.dml.LinearRegressionDMLTest
Tests run: 7, Failures: 0, Errors: 0, Skipped: 0, Time elapsed: 79.501 sec - in org.apache.sysml.test.integration.applications.dml.LinearRegressionDMLTest
Running org.apache.sysml.test.integration.applications.pydml.CsplineDSPyDMLTest
Tests run: 3, Failures: 0, Errors: 0, Skipped: 0, Time elapsed: 9.086 sec - in org.apache.sysml.test.integration.applications.pydml.CsplineDSPyDMLTest
Running org.apache.sysml.test.integration.applications.pydml.LinearLogRegPyDMLTest
Tests run: 7, Failures: 0, Errors: 0, Skipped: 0, Time elapsed: 84.305 sec - in org.apache.sysml.test.integration.applications.pydml.LinearLogRegPyDMLTest
Running org.apache.sysml.test.integration.applications.pydml.NaiveBayesPyDMLTest
Tests run: 6, Failures: 0, Errors: 0, Skipped: 0, Time elapsed: 81.608 sec - in org.apache.sysml.test.integration.applications.pydml.NaiveBayesPyDMLTest
Running org.apache.sysml.test.integration.applications.dml.CsplineCGDMLTest
Tests run: 3, Failures: 0, Errors: 0, Skipped: 0, Time elapsed: 25.198 sec - in org.apache.sysml.test.integration.applications.dml.CsplineCGDMLTest
Running org.apache.sysml.test.integration.applications.dml.L2SVMDMLTest
Tests run: 9, Failures: 0, Errors: 0, Skipped: 0, Time elapsed: 123.571 sec - in org.apache.sysml.test.integration.applications.dml.L2SVMDMLTest
Running org.apache.sysml.test.integration.applications.pydml.MDABivariateStatsPyDMLTest
Tests run: 4, Failures: 0, Errors: 0, Skipped: 0, Time elapsed: 291.966 sec - in org.apache.sysml.test.integration.applications.pydml.MDABivariateStatsPyDMLTest
Running org.apache.sysml.test.integration.applications.pydml.PageRankPyDMLTest
Tests run: 3, Failures: 0, Errors: 0, Skipped: 0, Time elapsed: 6.258 sec - in org.apache.sysml.test.integration.applications.pydml.PageRankPyDMLTest
Running org.apache.sysml.test.integration.applications.pydml.NaiveBayesParforPyDMLTest
Tests run: 6, Failures: 0, Errors: 0, Skipped: 0, Time elapsed: 81.099 sec - in org.apache.sysml.test.integration.applications.pydml.NaiveBayesParforPyDMLTest
Running org.apache.sysml.test.integration.applications.dml.NaiveBayesDMLTest
Tests run: 6, Failures: 0, Errors: 0, Skipped: 0, Time elapsed: 118.32 sec - in org.apache.sysml.test.integration.applications.dml.NaiveBayesDMLTest
Running org.apache.sysml.test.integration.applications.dml.MDABivariateStatsDMLTest
Tests run: 4, Failures: 0, Errors: 0, Skipped: 0, Time elapsed: 407.06 sec - in org.apache.sysml.test.integration.applications.dml.MDABivariateStatsDMLTest
Running org.apache.sysml.test.integration.applications.dml.PageRankDMLTest
Tests run: 3, Failures: 0, Errors: 0, Skipped: 0, Time elapsed: 6.101 sec - in org.apache.sysml.test.integration.applications.dml.PageRankDMLTest
Running org.apache.sysml.test.integration.applications.pydml.GLMPyDMLTest
Tests run: 30, Failures: 0, Errors: 0, Skipped: 0, Time elapsed: 624.091 sec - in org.apache.sysml.test.integration.applications.pydml.GLMPyDMLTest
Running org.apache.sysml.test.integration.applications.pydml.MultiClassSVMPyDMLTest
Tests run: 9, Failures: 0, Errors: 0, Skipped: 0, Time elapsed: 87.26 sec - in org.apache.sysml.test.integration.applications.pydml.MultiClassSVMPyDMLTest
Running org.apache.sysml.test.integration.applications.dml.ID3DMLTest
Tests run: 2, Failures: 0, Errors: 0, Skipped: 0, Time elapsed: 789.478 sec - in org.apache.sysml.test.integration.applications.dml.ID3DMLTest
Running org.apache.sysml.test.integration.applications.dml.GLMDMLTest
Tests run: 30, Failures: 0, Errors: 0, Skipped: 0, Time elapsed: 1,664.292 sec - in org.apache.sysml.test.integration.applications.dml.GLMDMLTest
Running org.apache.sysml.test.integration.applications.pydml.CsplineCGPyDMLTest
Tests run: 3, Failures: 0, Errors: 0, Skipped: 0, Time elapsed: 6.644 sec - in org.apache.sysml.test.integration.applications.pydml.CsplineCGPyDMLTest
Running org.apache.sysml.test.integration.applications.pydml.WelchTPyDMLTest
Tests run: 3, Failures: 0, Errors: 0, Skipped: 0, Time elapsed: 6.261 sec - in org.apache.sysml.test.integration.applications.pydml.WelchTPyDMLTest
Running org.apache.sysml.test.integration.applications.dml.MultiClassSVMDMLTest
Tests run: 9, Failures: 0, Errors: 0, Skipped: 0, Time elapsed: 113.748 sec - in org.apache.sysml.test.integration.applications.dml.MultiClassSVMDMLTest
Running org.apache.sysml.test.integration.applications.dml.CsplineDSDMLTest
Tests run: 3, Failures: 0, Errors: 0, Skipped: 0, Time elapsed: 23.176 sec - in org.apache.sysml.test.integration.applications.dml.CsplineDSDMLTest
Running org.apache.sysml.test.integration.applications.pydml.ApplyTransformPyDMLTest
Tests run: 7, Failures: 0, Errors: 0, Skipped: 0, Time elapsed: 0.974 sec - in org.apache.sysml.test.integration.applications.pydml.ApplyTransformPyDMLTest
Running org.apache.sysml.test.integration.applications.dml.NaiveBayesParforDMLTest
Tests run: 6, Failures: 0, Errors: 0, Skipped: 0, Time elapsed: 94.656 sec - in org.apache.sysml.test.integration.applications.dml.NaiveBayesParforDMLTest
Running org.apache.sysml.test.integration.applications.pydml.L2SVMPyDMLTest
Tests run: 9, Failures: 0, Errors: 0, Skipped: 0, Time elapsed: 63.649 sec - in org.apache.sysml.test.integration.applications.pydml.L2SVMPyDMLTest
Running org.apache.sysml.test.integration.applications.pydml.LinearRegressionPyDMLTest
Tests run: 7, Failures: 0, Errors: 0, Skipped: 0, Time elapsed: 50.876 sec - in org.apache.sysml.test.integration.applications.pydml.LinearRegressionPyDMLTest
Running org.apache.sysml.test.integration.applications.dml.LinearLogRegDMLTest
Tests run: 7, Failures: 0, Errors: 0, Skipped: 0, Time elapsed: 100.213 sec - in org.apache.sysml.test.integration.applications.dml.LinearLogRegDMLTest
Running org.apache.sysml.test.integration.applications.dml.GNMFDMLTest
Tests run: 3, Failures: 0, Errors: 0, Skipped: 0, Time elapsed: 131.649 sec - in org.apache.sysml.test.integration.applications.dml.GNMFDMLTest
Running org.apache.sysml.test.integration.applications.dml.WelchTDMLTest
Tests run: 3, Failures: 0, Errors: 0, Skipped: 0, Time elapsed: 8.533 sec - in org.apache.sysml.test.integration.applications.dml.WelchTDMLTest
Running org.apache.sysml.test.integration.applications.dml.ApplyTransformDMLTest
Tests run: 7, Failures: 0, Errors: 0, Skipped: 0, Time elapsed: 25.386 sec - in org.apache.sysml.test.integration.applications.dml.ApplyTransformDMLTest
Running org.apache.sysml.test.integration.applications.pydml.ID3PyDMLTest
Tests run: 2, Failures: 0, Errors: 0, Skipped: 0, Time elapsed: 388.646 sec - in org.apache.sysml.test.integration.applications.pydml.ID3PyDMLTest
Running org.apache.sysml.test.integration.applications.pydml.GNMFPyDMLTest
Tests run: 3, Failures: 0, Errors: 0, Skipped: 0, Time elapsed: 55.898 sec - in org.apache.sysml.test.integration.applications.pydml.GNMFPyDMLTest

Results :

Failed tests: 
  ParForBlockwiseDataPartitioningTest.testParForColBlockPartitioningRemoteLocalSparseNegative:173->runParForDataPartitioningTest:214->AutomatedTestBase.runTest:1243
failed to run script ./src/test/scripts/functions/parfor/parfor_bcdatapartitioning_neg.dml
exception: org.apache.sysml.api.DMLException: org.apache.sysml.runtime.DMLRuntimeException:
org.apache.sysml.runtime.DMLRuntimeException: PARFOR: Failed to execute loop in parallel.
message: org.apache.sysml.runtime.DMLRuntimeException: org.apache.sysml.runtime.DMLRuntimeException:
PARFOR: Failed to execute loop in parallel.
stack trace:
>org.apache.sysml.api.DMLScript.executeScript(DMLScript.java:533)
>org.apache.sysml.api.DMLScript.main(DMLScript.java:233)
>org.apache.sysml.test.integration.AutomatedTestBase.runTest(AutomatedTestBase.java:1223)
>org.apache.sysml.test.integration.functions.parfor.ParForBlockwiseDataPartitioningTest.runParForDataPartitioningTest(ParForBlockwiseDataPartitioningTest.java:214)
>org.apache.sysml.test.integration.functions.parfor.ParForBlockwiseDataPartitioningTest.testParForColBlockPartitioningRemoteLocalSparseNegative(ParForBlockwiseDataPartitioningTest.java:173)
>sun.reflect.NativeMethodAccessorImpl.invoke0(Native Method)
>sun.reflect.NativeMethodAccessorImpl.invoke(NativeMethodAccessorImpl.java:62)
>sun.reflect.DelegatingMethodAccessorImpl.invoke(DelegatingMethodAccessorImpl.java:43)
>java.lang.reflect.Method.invoke(Method.java:497)
>org.junit.runners.model.FrameworkMethod$1.runReflectiveCall(FrameworkMethod.java:47)
>org.junit.internal.runners.model.ReflectiveCallable.run(ReflectiveCallable.java:12)
>org.junit.runners.model.FrameworkMethod.invokeExplosively(FrameworkMethod.java:44)
>org.junit.internal.runners.statements.InvokeMethod.evaluate(InvokeMethod.java:17)
>org.junit.internal.runners.statements.RunBefores.evaluate(RunBefores.java:26)
>org.junit.internal.runners.statements.RunAfters.evaluate(RunAfters.java:27)
>org.junit.runners.ParentRunner.runLeaf(ParentRunner.java:271)
>org.junit.runners.BlockJUnit4ClassRunner.runChild(BlockJUnit4ClassRunner.java:70)
>org.junit.runners.BlockJUnit4ClassRunner.runChild(BlockJUnit4ClassRunner.java:50)
>org.junit.runners.ParentRunner$3.run(ParentRunner.java:238)
>org.apache.maven.surefire.junitcore.pc.Scheduler$1.run(Scheduler.java:318)
>org.apache.maven.surefire.junitcore.pc.InvokerStrategy.schedule(InvokerStrategy.java:41)
>org.apache.maven.surefire.junitcore.pc.Scheduler.schedule(Scheduler.java:274)
>org.junit.runners.ParentRunner.runChildren(ParentRunner.java:236)
>org.junit.runners.ParentRunner.access$000(ParentRunner.java:53)
>org.junit.runners.ParentRunner$2.evaluate(ParentRunner.java:229)
>org.junit.runners.ParentRunner.run(ParentRunner.java:309)
>org.junit.runners.Suite.runChild(Suite.java:127)
>org.junit.runners.Suite.runChild(Suite.java:26)
>org.junit.runners.ParentRunner$3.run(ParentRunner.java:238)
>org.apache.maven.surefire.junitcore.pc.Scheduler$1.run(Scheduler.java:318)
>org.apache.maven.surefire.junitcore.pc.InvokerStrategy.schedule(InvokerStrategy.java:41)
>org.apache.maven.surefire.junitcore.pc.Scheduler.schedule(Scheduler.java:274)
>org.junit.runners.ParentRunner.runChildren(ParentRunner.java:236)
>org.junit.runners.ParentRunner.access$000(ParentRunner.java:53)
>org.junit.runners.ParentRunner$2.evaluate(ParentRunner.java:229)
>org.junit.runners.ParentRunner.run(ParentRunner.java:309)
>org.junit.runners.Suite.runChild(Suite.java:127)
>org.junit.runners.Suite.runChild(Suite.java:26)
>org.junit.runners.ParentRunner$3.run(ParentRunner.java:238)
>org.apache.maven.surefire.junitcore.pc.Scheduler$1.run(Scheduler.java:318)
>org.apache.maven.surefire.junitcore.pc.InvokerStrategy.schedule(InvokerStrategy.java:41)
>org.apache.maven.surefire.junitcore.pc.Scheduler.schedule(Scheduler.java:274)
>org.junit.runners.ParentRunner.runChildren(ParentRunner.java:236)
>org.junit.runners.ParentRunner.access$000(ParentRunner.java:53)
>org.junit.runners.ParentRunner$2.evaluate(ParentRunner.java:229)
>org.junit.runners.ParentRunner.run(ParentRunner.java:309)
>org.apache.maven.surefire.junitcore.pc.ParallelComputerBuilder$PC$2.run(ParallelComputerBuilder.java:491)
>org.junit.runner.JUnitCore.run(JUnitCore.java:160)
>org.junit.runner.JUnitCore.run(JUnitCore.java:138)
>org.apache.maven.surefire.junitcore.JUnitCoreWrapper.createRequestAndRun(JUnitCoreWrapper.java:113)
>org.apache.maven.surefire.junitcore.JUnitCoreWrapper.executeEager(JUnitCoreWrapper.java:85)
>org.apache.maven.surefire.junitcore.JUnitCoreWrapper.execute(JUnitCoreWrapper.java:54)
>org.apache.maven.surefire.junitcore.JUnitCoreProvider.invoke(JUnitCoreProvider.java:134)
>org.apache.maven.surefire.booter.ForkedBooter.invokeProviderInSameClassLoader(ForkedBooter.java:200)
>org.apache.maven.surefire.booter.ForkedBooter.runSuitesInProcess(ForkedBooter.java:153)
>org.apache.maven.surefire.booter.ForkedBooter.main(ForkedBooter.java:103)

Tests run: 7063, Failures: 1, Errors: 0, Skipped: 0

[INFO] 
[INFO] --- maven-failsafe-plugin:2.17:verify (default) @ systemml ---
[INFO] Failsafe report directory: <https://sparktc.ibmcloud.com/jenkins/job/SystemML-DailyTest/ws/target/failsafe-reports>
[INFO] ------------------------------------------------------------------------
[INFO] BUILD FAILURE
[INFO] ------------------------------------------------------------------------
[INFO] Total time: 03:14 h
[INFO] Finished at: 2017-06-23T17:50:51-05:00
[INFO] Final Memory: 63M/2675M
[INFO] ------------------------------------------------------------------------
[ERROR] Failed to execute goal org.apache.maven.plugins:maven-failsafe-plugin:2.17:verify
(default) on project systemml: There are test failures.
[ERROR] 
[ERROR] Please refer to <https://sparktc.ibmcloud.com/jenkins/job/SystemML-DailyTest/ws/target/failsafe-reports>
for the individual test results.
[ERROR] -> [Help 1]
[ERROR] 
[ERROR] To see the full stack trace of the errors, re-run Maven with the -e switch.
[ERROR] Re-run Maven using the -X switch to enable full debug logging.
[ERROR] 
[ERROR] For more information about the errors and possible solutions, please read the following
articles:
[ERROR] [Help 1] http://cwiki.apache.org/confluence/display/MAVEN/MojoFailureException
Build step 'Execute shell' marked build as failure
Run condition [Always] enabling perform for step [[]]

Mime
View raw message