systemml-dev mailing list archives

Site index · List index
Message view « Date » · « Thread »
Top « Date » · « Thread »
From jenk...@spark.tc
Subject Build failed in Jenkins: SystemML-DailyTest #1067
Date Thu, 22 Jun 2017 22:35:22 GMT
See <https://sparktc.ibmcloud.com/jenkins/job/SystemML-DailyTest/1067/changes>

Changes:

[Glenn Weidner] [SYSTEMML-1728] Reshape util to convert tensors in NCHW to CNHW format

------------------------------------------
[...truncated 28633 lines...]
17/06/22 16:25:26 INFO scheduler.DAGScheduler: running: Set(ShuffleMapStage 1)
17/06/22 16:25:26 INFO scheduler.DAGScheduler: waiting: Set(ResultStage 2)
17/06/22 16:25:26 INFO scheduler.DAGScheduler: failed: Set()
17/06/22 16:25:26 INFO scheduler.DAGScheduler: ShuffleMapStage 1 (parallelizePairs at SparkExecutionContext.java:699)
finished in 0.423 s
17/06/22 16:25:26 INFO scheduler.DAGScheduler: looking for newly runnable stages
17/06/22 16:25:26 INFO scheduler.DAGScheduler: running: Set()
17/06/22 16:25:26 INFO scheduler.DAGScheduler: waiting: Set(ResultStage 2)
17/06/22 16:25:26 INFO scheduler.DAGScheduler: failed: Set()
17/06/22 16:25:26 INFO scheduler.DAGScheduler: Submitting ResultStage 2 (MapPartitionsRDD[5]
at mapValues at BinarySPInstruction.java:117), which has no missing parents
17/06/22 16:25:26 INFO memory.MemoryStore: Block broadcast_2 stored as values in memory (estimated
size 4.2 KB, free 1033.8 MB)
17/06/22 16:25:26 INFO memory.MemoryStore: Block broadcast_2_piece0 stored as bytes in memory
(estimated size 2.3 KB, free 1033.8 MB)
17/06/22 16:25:26 INFO storage.BlockManagerInfo: Added broadcast_2_piece0 in memory on 169.54.146.43:49513
(size: 2.3 KB, free: 1033.8 MB)
17/06/22 16:25:26 INFO spark.SparkContext: Created broadcast 2 from broadcast at DAGScheduler.scala:996
17/06/22 16:25:26 INFO scheduler.DAGScheduler: Submitting 1 missing tasks from ResultStage
2 (MapPartitionsRDD[5] at mapValues at BinarySPInstruction.java:117)
17/06/22 16:25:26 INFO scheduler.TaskSchedulerImpl: Adding task set 2.0 with 1 tasks
17/06/22 16:25:26 INFO scheduler.FairSchedulableBuilder: Added task set TaskSet_2.0 tasks
to pool default
17/06/22 16:25:26 INFO scheduler.TaskSetManager: Starting task 0.0 in stage 2.0 (TID 2, localhost,
executor driver, partition 0, PROCESS_LOCAL, 5813 bytes)
17/06/22 16:25:26 INFO executor.Executor: Running task 0.0 in stage 2.0 (TID 2)
17/06/22 16:25:26 INFO storage.ShuffleBlockFetcherIterator: Getting 1 non-empty blocks out
of 1 blocks
17/06/22 16:25:26 INFO storage.ShuffleBlockFetcherIterator: Started 0 remote fetches in 18
ms
17/06/22 16:25:26 INFO storage.ShuffleBlockFetcherIterator: Getting 1 non-empty blocks out
of 1 blocks
17/06/22 16:25:26 INFO storage.ShuffleBlockFetcherIterator: Started 0 remote fetches in 14
ms
17/06/22 16:25:26 INFO executor.Executor: Finished task 0.0 in stage 2.0 (TID 2). 2077 bytes
result sent to driver
17/06/22 16:25:26 INFO scheduler.DAGScheduler: ResultStage 2 (collect at SparkExecutionContext.java:789)
finished in 0.180 s
17/06/22 16:25:26 INFO scheduler.TaskSetManager: Finished task 0.0 in stage 2.0 (TID 2) in
195 ms on localhost (executor driver) (1/1)
17/06/22 16:25:26 INFO scheduler.TaskSchedulerImpl: Removed TaskSet 2.0, whose tasks have
all completed, from pool default
17/06/22 16:25:28 INFO scheduler.DAGScheduler: Registering RDD 7 (parallelizePairs at SparkExecutionContext.java:699)
17/06/22 16:25:28 INFO scheduler.DAGScheduler: Registering RDD 6 (parallelizePairs at SparkExecutionContext.java:699)
17/06/22 16:25:28 INFO scheduler.DAGScheduler: Got job 1 (collect at SparkExecutionContext.java:789)
with 1 output partitions
17/06/22 16:25:28 INFO scheduler.DAGScheduler: Final stage: ResultStage 5 (collect at SparkExecutionContext.java:789)
17/06/22 16:25:28 INFO scheduler.DAGScheduler: Parents of final stage: List(ShuffleMapStage
3, ShuffleMapStage 4)
17/06/22 16:25:28 INFO scheduler.DAGScheduler: Missing parents: List(ShuffleMapStage 3, ShuffleMapStage
4)
17/06/22 16:25:28 INFO scheduler.DAGScheduler: Submitting ShuffleMapStage 3 (ParallelCollectionRDD[7]
at parallelizePairs at SparkExecutionContext.java:699), which has no missing parents
17/06/22 16:25:28 INFO memory.MemoryStore: Block broadcast_3 stored as values in memory (estimated
size 2032.0 B, free 1033.8 MB)
17/06/22 16:25:28 INFO memory.MemoryStore: Block broadcast_3_piece0 stored as bytes in memory
(estimated size 1305.0 B, free 1033.8 MB)
17/06/22 16:25:28 INFO storage.BlockManagerInfo: Added broadcast_3_piece0 in memory on 169.54.146.43:49513
(size: 1305.0 B, free: 1033.8 MB)
17/06/22 16:25:28 INFO spark.SparkContext: Created broadcast 3 from broadcast at DAGScheduler.scala:996
17/06/22 16:25:28 INFO scheduler.DAGScheduler: Submitting 1 missing tasks from ShuffleMapStage
3 (ParallelCollectionRDD[7] at parallelizePairs at SparkExecutionContext.java:699)
17/06/22 16:25:28 INFO scheduler.TaskSchedulerImpl: Adding task set 3.0 with 1 tasks
17/06/22 16:25:28 INFO scheduler.FairSchedulableBuilder: Added task set TaskSet_3.0 tasks
to pool default
17/06/22 16:25:28 INFO scheduler.DAGScheduler: Submitting ShuffleMapStage 4 (ParallelCollectionRDD[6]
at parallelizePairs at SparkExecutionContext.java:699), which has no missing parents
17/06/22 16:25:28 INFO scheduler.TaskSetManager: Starting task 0.0 in stage 3.0 (TID 3, localhost,
executor driver, partition 0, PROCESS_LOCAL, 6445 bytes)
17/06/22 16:25:28 INFO memory.MemoryStore: Block broadcast_4 stored as values in memory (estimated
size 2032.0 B, free 1033.8 MB)
17/06/22 16:25:28 INFO executor.Executor: Running task 0.0 in stage 3.0 (TID 3)
17/06/22 16:25:28 INFO memory.MemoryStore: Block broadcast_4_piece0 stored as bytes in memory
(estimated size 1305.0 B, free 1033.8 MB)
17/06/22 16:25:28 INFO storage.BlockManagerInfo: Added broadcast_4_piece0 in memory on 169.54.146.43:49513
(size: 1305.0 B, free: 1033.8 MB)
17/06/22 16:25:28 INFO spark.SparkContext: Created broadcast 4 from broadcast at DAGScheduler.scala:996
17/06/22 16:25:28 INFO scheduler.DAGScheduler: Submitting 1 missing tasks from ShuffleMapStage
4 (ParallelCollectionRDD[6] at parallelizePairs at SparkExecutionContext.java:699)
17/06/22 16:25:28 INFO scheduler.TaskSchedulerImpl: Adding task set 4.0 with 1 tasks
17/06/22 16:25:28 INFO scheduler.FairSchedulableBuilder: Added task set TaskSet_4.0 tasks
to pool default
17/06/22 16:25:28 INFO executor.Executor: Finished task 0.0 in stage 3.0 (TID 3). 1326 bytes
result sent to driver
17/06/22 16:25:28 INFO spark.ContextCleaner: Cleaned shuffle 0
17/06/22 16:25:28 INFO scheduler.TaskSetManager: Starting task 0.0 in stage 4.0 (TID 4, localhost,
executor driver, partition 0, PROCESS_LOCAL, 6445 bytes)
17/06/22 16:25:28 INFO spark.ContextCleaner: Cleaned shuffle 1
17/06/22 16:25:28 INFO executor.Executor: Running task 0.0 in stage 4.0 (TID 4)
17/06/22 16:25:28 INFO scheduler.TaskSetManager: Finished task 0.0 in stage 3.0 (TID 3) in
22 ms on localhost (executor driver) (1/1)
17/06/22 16:25:28 INFO scheduler.TaskSchedulerImpl: Removed TaskSet 3.0, whose tasks have
all completed, from pool default
17/06/22 16:25:28 INFO scheduler.DAGScheduler: ShuffleMapStage 3 (parallelizePairs at SparkExecutionContext.java:699)
finished in 0.024 s
17/06/22 16:25:28 INFO scheduler.DAGScheduler: looking for newly runnable stages
17/06/22 16:25:28 INFO scheduler.DAGScheduler: running: Set(ShuffleMapStage 4)
17/06/22 16:25:28 INFO scheduler.DAGScheduler: waiting: Set(ResultStage 5)
17/06/22 16:25:28 INFO scheduler.DAGScheduler: failed: Set()
17/06/22 16:25:28 INFO executor.Executor: Finished task 0.0 in stage 4.0 (TID 4). 1253 bytes
result sent to driver
17/06/22 16:25:28 INFO scheduler.TaskSetManager: Finished task 0.0 in stage 4.0 (TID 4) in
13 ms on localhost (executor driver) (1/1)
17/06/22 16:25:28 INFO scheduler.TaskSchedulerImpl: Removed TaskSet 4.0, whose tasks have
all completed, from pool default
17/06/22 16:25:28 INFO scheduler.DAGScheduler: ShuffleMapStage 4 (parallelizePairs at SparkExecutionContext.java:699)
finished in 0.020 s
17/06/22 16:25:28 INFO scheduler.DAGScheduler: looking for newly runnable stages
17/06/22 16:25:28 INFO scheduler.DAGScheduler: running: Set()
17/06/22 16:25:28 INFO scheduler.DAGScheduler: waiting: Set(ResultStage 5)
17/06/22 16:25:28 INFO scheduler.DAGScheduler: failed: Set()
17/06/22 16:25:28 INFO storage.BlockManagerInfo: Removed broadcast_0_piece0 on 169.54.146.43:49513
in memory (size: 1305.0 B, free: 1033.8 MB)
17/06/22 16:25:28 INFO scheduler.DAGScheduler: Submitting ResultStage 5 (MapPartitionsRDD[11]
at mapValues at BinarySPInstruction.java:117), which has no missing parents
17/06/22 16:25:28 INFO storage.BlockManagerInfo: Removed broadcast_2_piece0 on 169.54.146.43:49513
in memory (size: 2.3 KB, free: 1033.8 MB)
17/06/22 16:25:28 INFO memory.MemoryStore: Block broadcast_5 stored as values in memory (estimated
size 4.2 KB, free 1033.8 MB)
17/06/22 16:25:28 INFO storage.BlockManagerInfo: Removed broadcast_1_piece0 on 169.54.146.43:49513
in memory (size: 1302.0 B, free: 1033.8 MB)
17/06/22 16:25:28 INFO memory.MemoryStore: Block broadcast_5_piece0 stored as bytes in memory
(estimated size 2.3 KB, free 1033.8 MB)
17/06/22 16:25:28 INFO storage.BlockManagerInfo: Added broadcast_5_piece0 in memory on 169.54.146.43:49513
(size: 2.3 KB, free: 1033.8 MB)
17/06/22 16:25:28 INFO spark.SparkContext: Created broadcast 5 from broadcast at DAGScheduler.scala:996
17/06/22 16:25:28 INFO scheduler.DAGScheduler: Submitting 1 missing tasks from ResultStage
5 (MapPartitionsRDD[11] at mapValues at BinarySPInstruction.java:117)
17/06/22 16:25:28 INFO scheduler.TaskSchedulerImpl: Adding task set 5.0 with 1 tasks
17/06/22 16:25:28 INFO scheduler.FairSchedulableBuilder: Added task set TaskSet_5.0 tasks
to pool default
17/06/22 16:25:28 INFO scheduler.TaskSetManager: Starting task 0.0 in stage 5.0 (TID 5, localhost,
executor driver, partition 0, PROCESS_LOCAL, 5814 bytes)
17/06/22 16:25:28 INFO executor.Executor: Running task 0.0 in stage 5.0 (TID 5)
17/06/22 16:25:28 INFO storage.ShuffleBlockFetcherIterator: Getting 1 non-empty blocks out
of 1 blocks
17/06/22 16:25:28 INFO storage.ShuffleBlockFetcherIterator: Started 0 remote fetches in 0
ms
17/06/22 16:25:28 INFO storage.ShuffleBlockFetcherIterator: Getting 1 non-empty blocks out
of 1 blocks
17/06/22 16:25:28 INFO storage.ShuffleBlockFetcherIterator: Started 0 remote fetches in 1
ms
17/06/22 16:25:28 INFO executor.Executor: Finished task 0.0 in stage 5.0 (TID 5). 2327 bytes
result sent to driver
17/06/22 16:25:28 INFO scheduler.TaskSetManager: Finished task 0.0 in stage 5.0 (TID 5) in
40 ms on localhost (executor driver) (1/1)
17/06/22 16:25:28 INFO scheduler.TaskSchedulerImpl: Removed TaskSet 5.0, whose tasks have
all completed, from pool default
17/06/22 16:25:28 INFO scheduler.DAGScheduler: ResultStage 5 (collect at SparkExecutionContext.java:789)
finished in 0.042 s
17/06/22 16:25:30 INFO storage.BlockManagerInfo: Removed broadcast_5_piece0 on 169.54.146.43:49513
in memory (size: 2.3 KB, free: 1033.8 MB)
17/06/22 16:25:30 INFO storage.BlockManagerInfo: Removed broadcast_4_piece0 on 169.54.146.43:49513
in memory (size: 1305.0 B, free: 1033.8 MB)
17/06/22 16:25:30 INFO spark.ContextCleaner: Cleaned shuffle 2
17/06/22 16:25:30 INFO spark.ContextCleaner: Cleaned shuffle 3
17/06/22 16:25:30 INFO storage.BlockManagerInfo: Removed broadcast_3_piece0 on 169.54.146.43:49513
in memory (size: 1305.0 B, free: 1033.8 MB)
17/06/22 16:27:37 INFO server.ServerConnector: Stopped ServerConnector@5f20900f{HTTP/1.1}{0.0.0.0:4040}
17/06/22 16:27:37 INFO handler.ContextHandler: Stopped o.s.j.s.ServletContextHandler@2edfea99{/stages/stage/kill,null,UNAVAILABLE}
17/06/22 16:27:37 INFO handler.ContextHandler: Stopped o.s.j.s.ServletContextHandler@1fc72185{/jobs/job/kill,null,UNAVAILABLE}
17/06/22 16:27:37 INFO handler.ContextHandler: Stopped o.s.j.s.ServletContextHandler@493f1121{/api,null,UNAVAILABLE}
17/06/22 16:27:37 INFO handler.ContextHandler: Stopped o.s.j.s.ServletContextHandler@51fe08f6{/,null,UNAVAILABLE}
17/06/22 16:27:37 INFO handler.ContextHandler: Stopped o.s.j.s.ServletContextHandler@3f61c905{/static,null,UNAVAILABLE}
17/06/22 16:27:37 INFO handler.ContextHandler: Stopped o.s.j.s.ServletContextHandler@67163714{/executors/threadDump/json,null,UNAVAILABLE}
17/06/22 16:27:37 INFO handler.ContextHandler: Stopped o.s.j.s.ServletContextHandler@5e08da22{/executors/threadDump,null,UNAVAILABLE}
17/06/22 16:27:37 INFO handler.ContextHandler: Stopped o.s.j.s.ServletContextHandler@2d487728{/executors/json,null,UNAVAILABLE}
17/06/22 16:27:37 INFO handler.ContextHandler: Stopped o.s.j.s.ServletContextHandler@4d42bdbe{/executors,null,UNAVAILABLE}
17/06/22 16:27:37 INFO handler.ContextHandler: Stopped o.s.j.s.ServletContextHandler@6e2af1b6{/environment/json,null,UNAVAILABLE}
17/06/22 16:27:37 INFO handler.ContextHandler: Stopped o.s.j.s.ServletContextHandler@21ea5b38{/environment,null,UNAVAILABLE}
17/06/22 16:27:37 INFO handler.ContextHandler: Stopped o.s.j.s.ServletContextHandler@70e20107{/storage/rdd/json,null,UNAVAILABLE}
17/06/22 16:27:37 INFO handler.ContextHandler: Stopped o.s.j.s.ServletContextHandler@4e5da2d7{/storage/rdd,null,UNAVAILABLE}
17/06/22 16:27:37 INFO handler.ContextHandler: Stopped o.s.j.s.ServletContextHandler@76873112{/storage/json,null,UNAVAILABLE}
17/06/22 16:27:37 INFO handler.ContextHandler: Stopped o.s.j.s.ServletContextHandler@72b46dbe{/storage,null,UNAVAILABLE}
17/06/22 16:27:37 INFO handler.ContextHandler: Stopped o.s.j.s.ServletContextHandler@7f583b20{/stages/pool/json,null,UNAVAILABLE}
17/06/22 16:27:37 INFO handler.ContextHandler: Stopped o.s.j.s.ServletContextHandler@7519bf7a{/stages/pool,null,UNAVAILABLE}
17/06/22 16:27:37 INFO handler.ContextHandler: Stopped o.s.j.s.ServletContextHandler@7c5f1d1f{/stages/stage/json,null,UNAVAILABLE}
17/06/22 16:27:37 INFO handler.ContextHandler: Stopped o.s.j.s.ServletContextHandler@1363c05d{/stages/stage,null,UNAVAILABLE}
17/06/22 16:27:37 INFO handler.ContextHandler: Stopped o.s.j.s.ServletContextHandler@1ec29128{/stages/json,null,UNAVAILABLE}
17/06/22 16:27:37 INFO handler.ContextHandler: Stopped o.s.j.s.ServletContextHandler@51db028c{/stages,null,UNAVAILABLE}
17/06/22 16:27:37 INFO handler.ContextHandler: Stopped o.s.j.s.ServletContextHandler@7bb28c32{/jobs/job/json,null,UNAVAILABLE}
17/06/22 16:27:37 INFO handler.ContextHandler: Stopped o.s.j.s.ServletContextHandler@5a1ae6d3{/jobs/job,null,UNAVAILABLE}
17/06/22 16:27:37 INFO handler.ContextHandler: Stopped o.s.j.s.ServletContextHandler@2d2c4f50{/jobs/json,null,UNAVAILABLE}
17/06/22 16:27:37 INFO handler.ContextHandler: Stopped o.s.j.s.ServletContextHandler@36d3920a{/jobs,null,UNAVAILABLE}
17/06/22 16:27:37 INFO ui.SparkUI: Stopped Spark web UI at http://169.54.146.43:4040
17/06/22 16:27:37 INFO spark.MapOutputTrackerMasterEndpoint: MapOutputTrackerMasterEndpoint
stopped!
17/06/22 16:27:37 INFO memory.MemoryStore: MemoryStore cleared
17/06/22 16:27:37 INFO storage.BlockManager: BlockManager stopped
17/06/22 16:27:37 INFO storage.BlockManagerMaster: BlockManagerMaster stopped
17/06/22 16:27:37 INFO scheduler.OutputCommitCoordinator$OutputCommitCoordinatorEndpoint:
OutputCommitCoordinator stopped!
17/06/22 16:27:37 INFO spark.SparkContext: Successfully stopped SparkContext
Running org.apache.sysml.test.integration.scripts.nn.NNTest
Tests run: 1, Failures: 0, Errors: 0, Skipped: 0, Time elapsed: 652.03 sec - in org.apache.sysml.test.integration.scripts.nn.NNTest
17/06/22 16:27:37 INFO util.ShutdownHookManager: Shutdown hook called
17/06/22 16:27:37 INFO util.ShutdownHookManager: Deleting directory /tmp/spark-be80419c-6480-4da7-be6c-8d17840df838
Running org.apache.sysml.test.integration.functions.quaternary.WeightedDivMatrixMultTest
Tests run: 90, Failures: 0, Errors: 0, Skipped: 0, Time elapsed: 1,489.686 sec - in org.apache.sysml.test.integration.functions.quaternary.WeightedDivMatrixMultTest
17/06/22 16:27:52 INFO util.ShutdownHookManager: Shutdown hook called
17/06/22 16:27:52 INFO util.ShutdownHookManager: Deleting directory /tmp/spark-9fdbf6be-270f-4547-940f-f1f69fde762f
Running org.apache.sysml.test.integration.applications.descriptivestats.UnivariateWeightedScaleDenseTest
Tests run: 24, Failures: 0, Errors: 0, Skipped: 0, Time elapsed: 356.896 sec - in org.apache.sysml.test.integration.applications.descriptivestats.UnivariateWeightedScaleDenseTest
Running org.apache.sysml.test.integration.functions.append.AppendChainTest
Tests run: 12, Failures: 0, Errors: 0, Skipped: 0, Time elapsed: 1,076.24 sec - in org.apache.sysml.test.integration.functions.append.AppendChainTest
Running org.apache.sysml.test.integration.applications.parfor.ParForNaiveBayesTest
Tests run: 10, Failures: 0, Errors: 0, Skipped: 0, Time elapsed: 531.859 sec - in org.apache.sysml.test.integration.applications.parfor.ParForNaiveBayesTest
Running org.apache.sysml.test.integration.applications.descriptivestats.UnivariateUnweightedScaleSparseTest
Tests run: 24, Failures: 0, Errors: 0, Skipped: 0, Time elapsed: 277.564 sec - in org.apache.sysml.test.integration.applications.descriptivestats.UnivariateUnweightedScaleSparseTest
Running org.apache.sysml.test.integration.applications.parfor.ParForSampleTest
Tests run: 6, Failures: 0, Errors: 0, Skipped: 0, Time elapsed: 106.358 sec - in org.apache.sysml.test.integration.applications.parfor.ParForSampleTest
Running org.apache.sysml.test.integration.applications.parfor.ParForUnivariateStatsTest
Tests run: 3, Failures: 0, Errors: 0, Skipped: 0, Time elapsed: 7.895 sec - in org.apache.sysml.test.integration.applications.parfor.ParForUnivariateStatsTest
Running org.apache.sysml.test.integration.applications.dml.HITSDMLTest
Tests run: 1, Failures: 0, Errors: 0, Skipped: 0, Time elapsed: 95.122 sec - in org.apache.sysml.test.integration.applications.dml.HITSDMLTest
Running org.apache.sysml.test.integration.functions.append.AppendMatrixTest
Tests run: 22, Failures: 0, Errors: 0, Skipped: 0, Time elapsed: 1,382.443 sec - in org.apache.sysml.test.integration.functions.append.AppendMatrixTest
Running org.apache.sysml.test.integration.applications.descriptivestats.UnivariateWeightedScaleSparseTest
Tests run: 24, Failures: 0, Errors: 0, Skipped: 0, Time elapsed: 360.468 sec - in org.apache.sysml.test.integration.applications.descriptivestats.UnivariateWeightedScaleSparseTest
Running org.apache.sysml.test.integration.applications.pydml.ArimaPyDMLTest
Tests run: 1, Failures: 0, Errors: 0, Skipped: 0, Time elapsed: 48.127 sec - in org.apache.sysml.test.integration.applications.pydml.ArimaPyDMLTest
Running org.apache.sysml.test.integration.applications.pydml.HITSPyDMLTest
Tests run: 1, Failures: 0, Errors: 0, Skipped: 0, Time elapsed: 77.943 sec - in org.apache.sysml.test.integration.applications.pydml.HITSPyDMLTest
Running org.apache.sysml.test.integration.applications.dml.LinearRegressionDMLTest
Tests run: 7, Failures: 0, Errors: 0, Skipped: 0, Time elapsed: 51.281 sec - in org.apache.sysml.test.integration.applications.dml.LinearRegressionDMLTest
Running org.apache.sysml.test.integration.applications.pydml.CsplineDSPyDMLTest
Tests run: 3, Failures: 0, Errors: 0, Skipped: 0, Time elapsed: 6.735 sec - in org.apache.sysml.test.integration.applications.pydml.CsplineDSPyDMLTest
Running org.apache.sysml.test.integration.applications.pydml.LinearLogRegPyDMLTest
Tests run: 7, Failures: 0, Errors: 0, Skipped: 0, Time elapsed: 93.507 sec - in org.apache.sysml.test.integration.applications.pydml.LinearLogRegPyDMLTest
Running org.apache.sysml.test.integration.applications.pydml.NaiveBayesPyDMLTest
Tests run: 6, Failures: 0, Errors: 0, Skipped: 0, Time elapsed: 178.985 sec - in org.apache.sysml.test.integration.applications.pydml.NaiveBayesPyDMLTest
Running org.apache.sysml.test.integration.applications.dml.CsplineCGDMLTest
Tests run: 3, Failures: 0, Errors: 0, Skipped: 0, Time elapsed: 16.442 sec - in org.apache.sysml.test.integration.applications.dml.CsplineCGDMLTest
Running org.apache.sysml.test.integration.applications.dml.L2SVMDMLTest
Tests run: 9, Failures: 0, Errors: 0, Skipped: 0, Time elapsed: 64.171 sec - in org.apache.sysml.test.integration.applications.dml.L2SVMDMLTest
Running org.apache.sysml.test.integration.applications.pydml.MDABivariateStatsPyDMLTest
Tests run: 4, Failures: 0, Errors: 0, Skipped: 0, Time elapsed: 510.983 sec - in org.apache.sysml.test.integration.applications.pydml.MDABivariateStatsPyDMLTest
Running org.apache.sysml.test.integration.applications.pydml.PageRankPyDMLTest
Tests run: 3, Failures: 0, Errors: 0, Skipped: 0, Time elapsed: 14.308 sec - in org.apache.sysml.test.integration.applications.pydml.PageRankPyDMLTest
Running org.apache.sysml.test.integration.applications.pydml.NaiveBayesParforPyDMLTest
Tests run: 6, Failures: 0, Errors: 0, Skipped: 0, Time elapsed: 193.903 sec - in org.apache.sysml.test.integration.applications.pydml.NaiveBayesParforPyDMLTest
Running org.apache.sysml.test.integration.applications.dml.NaiveBayesDMLTest
Tests run: 6, Failures: 0, Errors: 0, Skipped: 0, Time elapsed: 80.642 sec - in org.apache.sysml.test.integration.applications.dml.NaiveBayesDMLTest
Running org.apache.sysml.test.integration.applications.dml.MDABivariateStatsDMLTest
Tests run: 4, Failures: 0, Errors: 0, Skipped: 0, Time elapsed: 294.72 sec - in org.apache.sysml.test.integration.applications.dml.MDABivariateStatsDMLTest
Running org.apache.sysml.test.integration.applications.dml.PageRankDMLTest
Tests run: 3, Failures: 0, Errors: 0, Skipped: 0, Time elapsed: 6.484 sec - in org.apache.sysml.test.integration.applications.dml.PageRankDMLTest
Running org.apache.sysml.test.integration.applications.pydml.GLMPyDMLTest
Tests run: 30, Failures: 0, Errors: 0, Skipped: 0, Time elapsed: 584.733 sec - in org.apache.sysml.test.integration.applications.pydml.GLMPyDMLTest
Running org.apache.sysml.test.integration.applications.pydml.MultiClassSVMPyDMLTest
Tests run: 9, Failures: 0, Errors: 0, Skipped: 0, Time elapsed: 191.688 sec - in org.apache.sysml.test.integration.applications.pydml.MultiClassSVMPyDMLTest
Running org.apache.sysml.test.integration.applications.dml.ID3DMLTest
Tests run: 2, Failures: 0, Errors: 0, Skipped: 0, Time elapsed: 390.961 sec - in org.apache.sysml.test.integration.applications.dml.ID3DMLTest
Running org.apache.sysml.test.integration.applications.dml.GLMDMLTest
Tests run: 30, Failures: 0, Errors: 0, Skipped: 0, Time elapsed: 854.573 sec - in org.apache.sysml.test.integration.applications.dml.GLMDMLTest
Running org.apache.sysml.test.integration.applications.pydml.CsplineCGPyDMLTest
Tests run: 3, Failures: 0, Errors: 0, Skipped: 0, Time elapsed: 6.068 sec - in org.apache.sysml.test.integration.applications.pydml.CsplineCGPyDMLTest
Running org.apache.sysml.test.integration.applications.pydml.WelchTPyDMLTest
Tests run: 3, Failures: 0, Errors: 0, Skipped: 0, Time elapsed: 16.127 sec - in org.apache.sysml.test.integration.applications.pydml.WelchTPyDMLTest
Running org.apache.sysml.test.integration.applications.dml.MultiClassSVMDMLTest
Tests run: 9, Failures: 0, Errors: 0, Skipped: 0, Time elapsed: 89.01 sec - in org.apache.sysml.test.integration.applications.dml.MultiClassSVMDMLTest
Running org.apache.sysml.test.integration.applications.dml.CsplineDSDMLTest
Tests run: 3, Failures: 0, Errors: 0, Skipped: 0, Time elapsed: 13.847 sec - in org.apache.sysml.test.integration.applications.dml.CsplineDSDMLTest
Running org.apache.sysml.test.integration.applications.pydml.ApplyTransformPyDMLTest
Tests run: 7, Failures: 0, Errors: 0, Skipped: 0, Time elapsed: 0.854 sec - in org.apache.sysml.test.integration.applications.pydml.ApplyTransformPyDMLTest
Running org.apache.sysml.test.integration.applications.dml.NaiveBayesParforDMLTest
Tests run: 6, Failures: 0, Errors: 0, Skipped: 0, Time elapsed: 80.742 sec - in org.apache.sysml.test.integration.applications.dml.NaiveBayesParforDMLTest
Running org.apache.sysml.test.integration.applications.pydml.L2SVMPyDMLTest
Tests run: 9, Failures: 0, Errors: 0, Skipped: 0, Time elapsed: 63.573 sec - in org.apache.sysml.test.integration.applications.pydml.L2SVMPyDMLTest
Running org.apache.sysml.test.integration.applications.pydml.LinearRegressionPyDMLTest
Tests run: 7, Failures: 0, Errors: 0, Skipped: 0, Time elapsed: 52.331 sec - in org.apache.sysml.test.integration.applications.pydml.LinearRegressionPyDMLTest
Running org.apache.sysml.test.integration.applications.dml.LinearLogRegDMLTest
Tests run: 7, Failures: 0, Errors: 0, Skipped: 0, Time elapsed: 61.083 sec - in org.apache.sysml.test.integration.applications.dml.LinearLogRegDMLTest
Running org.apache.sysml.test.integration.applications.dml.GNMFDMLTest
Tests run: 3, Failures: 0, Errors: 0, Skipped: 0, Time elapsed: 59.799 sec - in org.apache.sysml.test.integration.applications.dml.GNMFDMLTest
Running org.apache.sysml.test.integration.applications.dml.WelchTDMLTest
Tests run: 3, Failures: 0, Errors: 0, Skipped: 0, Time elapsed: 6.424 sec - in org.apache.sysml.test.integration.applications.dml.WelchTDMLTest
Running org.apache.sysml.test.integration.applications.dml.ApplyTransformDMLTest
Tests run: 7, Failures: 0, Errors: 0, Skipped: 0, Time elapsed: 12.551 sec - in org.apache.sysml.test.integration.applications.dml.ApplyTransformDMLTest
Running org.apache.sysml.test.integration.applications.pydml.ID3PyDMLTest
Tests run: 2, Failures: 0, Errors: 0, Skipped: 0, Time elapsed: 387.266 sec - in org.apache.sysml.test.integration.applications.pydml.ID3PyDMLTest
Running org.apache.sysml.test.integration.applications.pydml.GNMFPyDMLTest
Tests run: 3, Failures: 0, Errors: 0, Skipped: 0, Time elapsed: 55.738 sec - in org.apache.sysml.test.integration.applications.pydml.GNMFPyDMLTest

Results :

Failed tests: 
  FullReblockTest.testCSVMultipleMSparseMR:407->runReblockTest:467 34 values are not in
equal

Tests run: 7063, Failures: 1, Errors: 0, Skipped: 0

[INFO] 
[INFO] --- maven-failsafe-plugin:2.17:verify (default) @ systemml ---
[INFO] Failsafe report directory: <https://sparktc.ibmcloud.com/jenkins/job/SystemML-DailyTest/ws/target/failsafe-reports>
[INFO] ------------------------------------------------------------------------
[INFO] BUILD FAILURE
[INFO] ------------------------------------------------------------------------
[INFO] Total time: 02:38 h
[INFO] Finished at: 2017-06-22T17:35:20-05:00
[INFO] Final Memory: 63M/2672M
[INFO] ------------------------------------------------------------------------
[ERROR] Failed to execute goal org.apache.maven.plugins:maven-failsafe-plugin:2.17:verify
(default) on project systemml: There are test failures.
[ERROR] 
[ERROR] Please refer to <https://sparktc.ibmcloud.com/jenkins/job/SystemML-DailyTest/ws/target/failsafe-reports>
for the individual test results.
[ERROR] -> [Help 1]
[ERROR] 
[ERROR] To see the full stack trace of the errors, re-run Maven with the -e switch.
[ERROR] Re-run Maven using the -X switch to enable full debug logging.
[ERROR] 
[ERROR] For more information about the errors and possible solutions, please read the following
articles:
[ERROR] [Help 1] http://cwiki.apache.org/confluence/display/MAVEN/MojoFailureException
Build step 'Execute shell' marked build as failure
Run condition [Always] enabling perform for step [[]]

Mime
View raw message