systemml-dev mailing list archives

Site index · List index
Message view « Date » · « Thread »
Top « Date » · « Thread »
From jenk...@spark.tc
Subject Build failed in Jenkins: SystemML-DailyTest #1075
Date Mon, 26 Jun 2017 23:02:43 GMT
See <https://sparktc.ibmcloud.com/jenkins/job/SystemML-DailyTest/1075/>

------------------------------------------
[...truncated 28672 lines...]
17/06/26 16:14:55 INFO executor.Executor: Finished task 0.0 in stage 0.0 (TID 0). 1340 bytes
result sent to driver
17/06/26 16:14:55 INFO scheduler.TaskSetManager: Starting task 0.0 in stage 1.0 (TID 1, localhost,
executor driver, partition 0, PROCESS_LOCAL, 6281 bytes)
17/06/26 16:14:55 INFO executor.Executor: Running task 0.0 in stage 1.0 (TID 1)
17/06/26 16:14:55 INFO scheduler.TaskSetManager: Finished task 0.0 in stage 0.0 (TID 0) in
872 ms on localhost (executor driver) (1/1)
17/06/26 16:14:55 INFO executor.Executor: Finished task 0.0 in stage 1.0 (TID 1). 1253 bytes
result sent to driver
17/06/26 16:14:55 INFO scheduler.TaskSchedulerImpl: Removed TaskSet 0.0, whose tasks have
all completed, from pool default
17/06/26 16:14:55 INFO scheduler.DAGScheduler: ShuffleMapStage 0 (parallelizePairs at SparkExecutionContext.java:699)
finished in 1.011 s
17/06/26 16:14:55 INFO scheduler.DAGScheduler: looking for newly runnable stages
17/06/26 16:14:55 INFO scheduler.DAGScheduler: running: Set(ShuffleMapStage 1)
17/06/26 16:14:55 INFO scheduler.DAGScheduler: waiting: Set(ResultStage 2)
17/06/26 16:14:55 INFO scheduler.DAGScheduler: failed: Set()
17/06/26 16:14:55 INFO scheduler.TaskSetManager: Finished task 0.0 in stage 1.0 (TID 1) in
109 ms on localhost (executor driver) (1/1)
17/06/26 16:14:55 INFO scheduler.TaskSchedulerImpl: Removed TaskSet 1.0, whose tasks have
all completed, from pool default
17/06/26 16:14:55 INFO scheduler.DAGScheduler: ShuffleMapStage 1 (parallelizePairs at SparkExecutionContext.java:699)
finished in 0.598 s
17/06/26 16:14:55 INFO scheduler.DAGScheduler: looking for newly runnable stages
17/06/26 16:14:55 INFO scheduler.DAGScheduler: running: Set()
17/06/26 16:14:55 INFO scheduler.DAGScheduler: waiting: Set(ResultStage 2)
17/06/26 16:14:55 INFO scheduler.DAGScheduler: failed: Set()
17/06/26 16:14:55 INFO scheduler.DAGScheduler: Submitting ResultStage 2 (MapPartitionsRDD[5]
at mapValues at BinarySPInstruction.java:117), which has no missing parents
17/06/26 16:14:55 INFO memory.MemoryStore: Block broadcast_2 stored as values in memory (estimated
size 4.2 KB, free 1033.8 MB)
17/06/26 16:14:55 INFO memory.MemoryStore: Block broadcast_2_piece0 stored as bytes in memory
(estimated size 2.3 KB, free 1033.8 MB)
17/06/26 16:14:55 INFO storage.BlockManagerInfo: Added broadcast_2_piece0 in memory on 169.54.146.43:58330
(size: 2.3 KB, free: 1033.8 MB)
17/06/26 16:14:55 INFO spark.SparkContext: Created broadcast 2 from broadcast at DAGScheduler.scala:996
17/06/26 16:14:55 INFO scheduler.DAGScheduler: Submitting 1 missing tasks from ResultStage
2 (MapPartitionsRDD[5] at mapValues at BinarySPInstruction.java:117)
17/06/26 16:14:55 INFO scheduler.TaskSchedulerImpl: Adding task set 2.0 with 1 tasks
17/06/26 16:14:55 INFO scheduler.FairSchedulableBuilder: Added task set TaskSet_2.0 tasks
to pool default
17/06/26 16:14:55 INFO scheduler.TaskSetManager: Starting task 0.0 in stage 2.0 (TID 2, localhost,
executor driver, partition 0, PROCESS_LOCAL, 5813 bytes)
17/06/26 16:14:55 INFO executor.Executor: Running task 0.0 in stage 2.0 (TID 2)
17/06/26 16:14:55 INFO storage.ShuffleBlockFetcherIterator: Getting 1 non-empty blocks out
of 1 blocks
17/06/26 16:14:55 INFO storage.ShuffleBlockFetcherIterator: Started 0 remote fetches in 19
ms
17/06/26 16:14:55 INFO storage.ShuffleBlockFetcherIterator: Getting 1 non-empty blocks out
of 1 blocks
17/06/26 16:14:55 INFO storage.ShuffleBlockFetcherIterator: Started 0 remote fetches in 0
ms
17/06/26 16:14:55 INFO executor.Executor: Finished task 0.0 in stage 2.0 (TID 2). 2164 bytes
result sent to driver
17/06/26 16:14:55 INFO scheduler.TaskSetManager: Finished task 0.0 in stage 2.0 (TID 2) in
177 ms on localhost (executor driver) (1/1)
17/06/26 16:14:55 INFO scheduler.TaskSchedulerImpl: Removed TaskSet 2.0, whose tasks have
all completed, from pool default
17/06/26 16:14:55 INFO scheduler.DAGScheduler: ResultStage 2 (collect at SparkExecutionContext.java:789)
finished in 0.179 s
17/06/26 16:14:56 INFO scheduler.DAGScheduler: Registering RDD 6 (parallelizePairs at SparkExecutionContext.java:699)
17/06/26 16:14:56 INFO scheduler.DAGScheduler: Registering RDD 7 (parallelizePairs at SparkExecutionContext.java:699)
17/06/26 16:14:56 INFO scheduler.DAGScheduler: Got job 1 (collect at SparkExecutionContext.java:789)
with 1 output partitions
17/06/26 16:14:56 INFO scheduler.DAGScheduler: Final stage: ResultStage 5 (collect at SparkExecutionContext.java:789)
17/06/26 16:14:56 INFO scheduler.DAGScheduler: Parents of final stage: List(ShuffleMapStage
3, ShuffleMapStage 4)
17/06/26 16:14:56 INFO scheduler.DAGScheduler: Missing parents: List(ShuffleMapStage 3, ShuffleMapStage
4)
17/06/26 16:14:56 INFO scheduler.DAGScheduler: Submitting ShuffleMapStage 3 (ParallelCollectionRDD[6]
at parallelizePairs at SparkExecutionContext.java:699), which has no missing parents
17/06/26 16:14:56 INFO memory.MemoryStore: Block broadcast_3 stored as values in memory (estimated
size 2032.0 B, free 1033.8 MB)
17/06/26 16:14:56 INFO memory.MemoryStore: Block broadcast_3_piece0 stored as bytes in memory
(estimated size 1305.0 B, free 1033.8 MB)
17/06/26 16:14:56 INFO storage.BlockManagerInfo: Added broadcast_3_piece0 in memory on 169.54.146.43:58330
(size: 1305.0 B, free: 1033.8 MB)
17/06/26 16:14:56 INFO spark.SparkContext: Created broadcast 3 from broadcast at DAGScheduler.scala:996
17/06/26 16:14:56 INFO scheduler.DAGScheduler: Submitting 1 missing tasks from ShuffleMapStage
3 (ParallelCollectionRDD[6] at parallelizePairs at SparkExecutionContext.java:699)
17/06/26 16:14:56 INFO scheduler.TaskSchedulerImpl: Adding task set 3.0 with 1 tasks
17/06/26 16:14:56 INFO scheduler.FairSchedulableBuilder: Added task set TaskSet_3.0 tasks
to pool default
17/06/26 16:14:56 INFO scheduler.TaskSetManager: Starting task 0.0 in stage 3.0 (TID 3, localhost,
executor driver, partition 0, PROCESS_LOCAL, 6445 bytes)
17/06/26 16:14:56 INFO executor.Executor: Running task 0.0 in stage 3.0 (TID 3)
17/06/26 16:14:56 INFO scheduler.DAGScheduler: Submitting ShuffleMapStage 4 (ParallelCollectionRDD[7]
at parallelizePairs at SparkExecutionContext.java:699), which has no missing parents
17/06/26 16:14:56 INFO memory.MemoryStore: Block broadcast_4 stored as values in memory (estimated
size 2032.0 B, free 1033.8 MB)
17/06/26 16:14:56 INFO executor.Executor: Finished task 0.0 in stage 3.0 (TID 3). 1253 bytes
result sent to driver
17/06/26 16:14:56 INFO scheduler.TaskSetManager: Finished task 0.0 in stage 3.0 (TID 3) in
24 ms on localhost (executor driver) (1/1)
17/06/26 16:14:56 INFO scheduler.TaskSchedulerImpl: Removed TaskSet 3.0, whose tasks have
all completed, from pool default
17/06/26 16:14:56 INFO memory.MemoryStore: Block broadcast_4_piece0 stored as bytes in memory
(estimated size 1305.0 B, free 1033.8 MB)
17/06/26 16:14:56 INFO storage.BlockManagerInfo: Added broadcast_4_piece0 in memory on 169.54.146.43:58330
(size: 1305.0 B, free: 1033.8 MB)
17/06/26 16:14:56 INFO spark.SparkContext: Created broadcast 4 from broadcast at DAGScheduler.scala:996
17/06/26 16:14:56 INFO scheduler.DAGScheduler: Submitting 1 missing tasks from ShuffleMapStage
4 (ParallelCollectionRDD[7] at parallelizePairs at SparkExecutionContext.java:699)
17/06/26 16:14:56 INFO scheduler.TaskSchedulerImpl: Adding task set 4.0 with 1 tasks
17/06/26 16:14:56 INFO scheduler.FairSchedulableBuilder: Added task set TaskSet_4.0 tasks
to pool default
17/06/26 16:14:56 INFO scheduler.TaskSetManager: Starting task 0.0 in stage 4.0 (TID 4, localhost,
executor driver, partition 0, PROCESS_LOCAL, 6445 bytes)
17/06/26 16:14:56 INFO executor.Executor: Running task 0.0 in stage 4.0 (TID 4)
17/06/26 16:14:56 INFO scheduler.DAGScheduler: ShuffleMapStage 3 (parallelizePairs at SparkExecutionContext.java:699)
finished in 0.053 s
17/06/26 16:14:56 INFO scheduler.DAGScheduler: looking for newly runnable stages
17/06/26 16:14:56 INFO scheduler.DAGScheduler: running: Set(ShuffleMapStage 4)
17/06/26 16:14:56 INFO scheduler.DAGScheduler: waiting: Set(ResultStage 5)
17/06/26 16:14:56 INFO scheduler.DAGScheduler: failed: Set()
17/06/26 16:14:56 INFO executor.Executor: Finished task 0.0 in stage 4.0 (TID 4). 1340 bytes
result sent to driver
17/06/26 16:14:56 INFO scheduler.TaskSetManager: Finished task 0.0 in stage 4.0 (TID 4) in
46 ms on localhost (executor driver) (1/1)
17/06/26 16:14:56 INFO scheduler.TaskSchedulerImpl: Removed TaskSet 4.0, whose tasks have
all completed, from pool default
17/06/26 16:14:56 INFO scheduler.DAGScheduler: ShuffleMapStage 4 (parallelizePairs at SparkExecutionContext.java:699)
finished in 0.030 s
17/06/26 16:14:56 INFO scheduler.DAGScheduler: looking for newly runnable stages
17/06/26 16:14:56 INFO scheduler.DAGScheduler: running: Set()
17/06/26 16:14:56 INFO scheduler.DAGScheduler: waiting: Set(ResultStage 5)
17/06/26 16:14:56 INFO scheduler.DAGScheduler: failed: Set()
17/06/26 16:14:56 INFO scheduler.DAGScheduler: Submitting ResultStage 5 (MapPartitionsRDD[11]
at mapValues at BinarySPInstruction.java:117), which has no missing parents
17/06/26 16:14:56 INFO memory.MemoryStore: Block broadcast_5 stored as values in memory (estimated
size 4.2 KB, free 1033.8 MB)
17/06/26 16:14:56 INFO memory.MemoryStore: Block broadcast_5_piece0 stored as bytes in memory
(estimated size 2.3 KB, free 1033.8 MB)
17/06/26 16:14:56 INFO storage.BlockManagerInfo: Added broadcast_5_piece0 in memory on 169.54.146.43:58330
(size: 2.3 KB, free: 1033.8 MB)
17/06/26 16:14:56 INFO spark.SparkContext: Created broadcast 5 from broadcast at DAGScheduler.scala:996
17/06/26 16:14:56 INFO scheduler.DAGScheduler: Submitting 1 missing tasks from ResultStage
5 (MapPartitionsRDD[11] at mapValues at BinarySPInstruction.java:117)
17/06/26 16:14:56 INFO scheduler.TaskSchedulerImpl: Adding task set 5.0 with 1 tasks
17/06/26 16:14:56 INFO scheduler.FairSchedulableBuilder: Added task set TaskSet_5.0 tasks
to pool default
17/06/26 16:14:56 INFO scheduler.TaskSetManager: Starting task 0.0 in stage 5.0 (TID 5, localhost,
executor driver, partition 0, PROCESS_LOCAL, 5814 bytes)
17/06/26 16:14:56 INFO executor.Executor: Running task 0.0 in stage 5.0 (TID 5)
17/06/26 16:14:56 INFO storage.ShuffleBlockFetcherIterator: Getting 1 non-empty blocks out
of 1 blocks
17/06/26 16:14:56 INFO storage.ShuffleBlockFetcherIterator: Started 0 remote fetches in 0
ms
17/06/26 16:14:56 INFO storage.ShuffleBlockFetcherIterator: Getting 1 non-empty blocks out
of 1 blocks
17/06/26 16:14:56 INFO storage.ShuffleBlockFetcherIterator: Started 0 remote fetches in 0
ms
17/06/26 16:14:56 INFO executor.Executor: Finished task 0.0 in stage 5.0 (TID 5). 2240 bytes
result sent to driver
17/06/26 16:14:56 INFO scheduler.TaskSetManager: Finished task 0.0 in stage 5.0 (TID 5) in
30 ms on localhost (executor driver) (1/1)
17/06/26 16:14:56 INFO scheduler.TaskSchedulerImpl: Removed TaskSet 5.0, whose tasks have
all completed, from pool default
17/06/26 16:14:56 INFO scheduler.DAGScheduler: ResultStage 5 (collect at SparkExecutionContext.java:789)
finished in 0.031 s
17/06/26 16:14:57 INFO storage.BlockManagerInfo: Removed broadcast_5_piece0 on 169.54.146.43:58330
in memory (size: 2.3 KB, free: 1033.8 MB)
17/06/26 16:14:57 INFO storage.BlockManagerInfo: Removed broadcast_4_piece0 on 169.54.146.43:58330
in memory (size: 1305.0 B, free: 1033.8 MB)
17/06/26 16:14:57 INFO storage.BlockManagerInfo: Removed broadcast_3_piece0 on 169.54.146.43:58330
in memory (size: 1305.0 B, free: 1033.8 MB)
17/06/26 16:14:57 INFO storage.BlockManagerInfo: Removed broadcast_2_piece0 on 169.54.146.43:58330
in memory (size: 2.3 KB, free: 1033.8 MB)
17/06/26 16:14:57 INFO spark.ContextCleaner: Cleaned shuffle 2
17/06/26 16:14:57 INFO spark.ContextCleaner: Cleaned shuffle 3
17/06/26 16:17:24 INFO server.ServerConnector: Stopped ServerConnector@3ba3dc5a{HTTP/1.1}{0.0.0.0:4040}
17/06/26 16:17:24 INFO handler.ContextHandler: Stopped o.s.j.s.ServletContextHandler@546bf9b0{/stages/stage/kill,null,UNAVAILABLE}
17/06/26 16:17:24 INFO handler.ContextHandler: Stopped o.s.j.s.ServletContextHandler@6a7bca1c{/jobs/job/kill,null,UNAVAILABLE}
17/06/26 16:17:24 INFO handler.ContextHandler: Stopped o.s.j.s.ServletContextHandler@4991859f{/api,null,UNAVAILABLE}
17/06/26 16:17:24 INFO handler.ContextHandler: Stopped o.s.j.s.ServletContextHandler@30ffb99e{/,null,UNAVAILABLE}
17/06/26 16:17:24 INFO handler.ContextHandler: Stopped o.s.j.s.ServletContextHandler@526d9863{/static,null,UNAVAILABLE}
17/06/26 16:17:24 INFO handler.ContextHandler: Stopped o.s.j.s.ServletContextHandler@24b0ef2e{/executors/threadDump/json,null,UNAVAILABLE}
17/06/26 16:17:24 INFO handler.ContextHandler: Stopped o.s.j.s.ServletContextHandler@83e2523{/executors/threadDump,null,UNAVAILABLE}
17/06/26 16:17:24 INFO handler.ContextHandler: Stopped o.s.j.s.ServletContextHandler@3a6b137b{/executors/json,null,UNAVAILABLE}
17/06/26 16:17:24 INFO handler.ContextHandler: Stopped o.s.j.s.ServletContextHandler@2c2b5013{/executors,null,UNAVAILABLE}
17/06/26 16:17:24 INFO handler.ContextHandler: Stopped o.s.j.s.ServletContextHandler@63a9e173{/environment/json,null,UNAVAILABLE}
17/06/26 16:17:24 INFO handler.ContextHandler: Stopped o.s.j.s.ServletContextHandler@3c91cec3{/environment,null,UNAVAILABLE}
17/06/26 16:17:24 INFO handler.ContextHandler: Stopped o.s.j.s.ServletContextHandler@1991f8fd{/storage/rdd/json,null,UNAVAILABLE}
17/06/26 16:17:24 INFO handler.ContextHandler: Stopped o.s.j.s.ServletContextHandler@3d0e5865{/storage/rdd,null,UNAVAILABLE}
17/06/26 16:17:24 INFO handler.ContextHandler: Stopped o.s.j.s.ServletContextHandler@3e5c276d{/storage/json,null,UNAVAILABLE}
17/06/26 16:17:24 INFO handler.ContextHandler: Stopped o.s.j.s.ServletContextHandler@2aa1e08c{/storage,null,UNAVAILABLE}
17/06/26 16:17:24 INFO handler.ContextHandler: Stopped o.s.j.s.ServletContextHandler@519eb4a5{/stages/pool/json,null,UNAVAILABLE}
17/06/26 16:17:24 INFO handler.ContextHandler: Stopped o.s.j.s.ServletContextHandler@509a697a{/stages/pool,null,UNAVAILABLE}
17/06/26 16:17:24 INFO handler.ContextHandler: Stopped o.s.j.s.ServletContextHandler@3eb54b8e{/stages/stage/json,null,UNAVAILABLE}
17/06/26 16:17:24 INFO handler.ContextHandler: Stopped o.s.j.s.ServletContextHandler@7f109a80{/stages/stage,null,UNAVAILABLE}
17/06/26 16:17:24 INFO handler.ContextHandler: Stopped o.s.j.s.ServletContextHandler@2815221e{/stages/json,null,UNAVAILABLE}
17/06/26 16:17:24 INFO handler.ContextHandler: Stopped o.s.j.s.ServletContextHandler@54e744d6{/stages,null,UNAVAILABLE}
17/06/26 16:17:24 INFO handler.ContextHandler: Stopped o.s.j.s.ServletContextHandler@71360a56{/jobs/job/json,null,UNAVAILABLE}
17/06/26 16:17:24 INFO handler.ContextHandler: Stopped o.s.j.s.ServletContextHandler@3ced67e3{/jobs/job,null,UNAVAILABLE}
17/06/26 16:17:24 INFO handler.ContextHandler: Stopped o.s.j.s.ServletContextHandler@229bc2a6{/jobs/json,null,UNAVAILABLE}
17/06/26 16:17:24 INFO handler.ContextHandler: Stopped o.s.j.s.ServletContextHandler@2050a492{/jobs,null,UNAVAILABLE}
17/06/26 16:17:24 INFO ui.SparkUI: Stopped Spark web UI at http://169.54.146.43:4040
17/06/26 16:17:24 INFO spark.MapOutputTrackerMasterEndpoint: MapOutputTrackerMasterEndpoint
stopped!
17/06/26 16:17:24 INFO memory.MemoryStore: MemoryStore cleared
17/06/26 16:17:24 INFO storage.BlockManager: BlockManager stopped
17/06/26 16:17:24 INFO storage.BlockManagerMaster: BlockManagerMaster stopped
17/06/26 16:17:24 INFO scheduler.OutputCommitCoordinator$OutputCommitCoordinatorEndpoint:
OutputCommitCoordinator stopped!
17/06/26 16:17:25 INFO spark.SparkContext: Successfully stopped SparkContext
Running org.apache.sysml.test.integration.scripts.nn.NNTest
Tests run: 1, Failures: 0, Errors: 0, Skipped: 0, Time elapsed: 1,099.812 sec - in org.apache.sysml.test.integration.scripts.nn.NNTest
17/06/26 16:17:25 INFO util.ShutdownHookManager: Shutdown hook called
17/06/26 16:17:25 INFO util.ShutdownHookManager: Deleting directory /tmp/spark-f0204070-e1bc-4172-bd26-b17d4646df7a
Running org.apache.sysml.test.integration.applications.parfor.ParForNaiveBayesTest
Tests run: 10, Failures: 0, Errors: 0, Skipped: 0, Time elapsed: 760.11 sec - in org.apache.sysml.test.integration.applications.parfor.ParForNaiveBayesTest
Running org.apache.sysml.test.integration.functions.append.AppendChainTest
Tests run: 12, Failures: 0, Errors: 0, Skipped: 0, Time elapsed: 1,370.06 sec - in org.apache.sysml.test.integration.functions.append.AppendChainTest
Running org.apache.sysml.test.integration.applications.descriptivestats.UnivariateUnweightedScaleSparseTest
Tests run: 24, Failures: 0, Errors: 0, Skipped: 0, Time elapsed: 310.838 sec - in org.apache.sysml.test.integration.applications.descriptivestats.UnivariateUnweightedScaleSparseTest
Running org.apache.sysml.test.integration.applications.parfor.ParForSampleTest
Tests run: 6, Failures: 0, Errors: 0, Skipped: 0, Time elapsed: 110.002 sec - in org.apache.sysml.test.integration.applications.parfor.ParForSampleTest
Running org.apache.sysml.test.integration.applications.parfor.ParForUnivariateStatsTest
Tests run: 3, Failures: 0, Errors: 0, Skipped: 0, Time elapsed: 9.42 sec - in org.apache.sysml.test.integration.applications.parfor.ParForUnivariateStatsTest
Running org.apache.sysml.test.integration.applications.dml.HITSDMLTest
Tests run: 1, Failures: 0, Errors: 0, Skipped: 0, Time elapsed: 104.259 sec - in org.apache.sysml.test.integration.applications.dml.HITSDMLTest
Running org.apache.sysml.test.integration.functions.append.AppendMatrixTest
Tests run: 22, Failures: 0, Errors: 0, Skipped: 0, Time elapsed: 1,745.556 sec - in org.apache.sysml.test.integration.functions.append.AppendMatrixTest
Running org.apache.sysml.test.integration.applications.descriptivestats.UnivariateWeightedScaleSparseTest
Tests run: 24, Failures: 0, Errors: 0, Skipped: 0, Time elapsed: 393.36 sec - in org.apache.sysml.test.integration.applications.descriptivestats.UnivariateWeightedScaleSparseTest
Running org.apache.sysml.test.integration.applications.pydml.ArimaPyDMLTest
Tests run: 1, Failures: 0, Errors: 0, Skipped: 0, Time elapsed: 80.471 sec - in org.apache.sysml.test.integration.applications.pydml.ArimaPyDMLTest
Running org.apache.sysml.test.integration.applications.pydml.HITSPyDMLTest
Tests run: 1, Failures: 0, Errors: 0, Skipped: 0, Time elapsed: 181.602 sec - in org.apache.sysml.test.integration.applications.pydml.HITSPyDMLTest
Running org.apache.sysml.test.integration.applications.dml.LinearRegressionDMLTest
Tests run: 7, Failures: 0, Errors: 0, Skipped: 0, Time elapsed: 106.491 sec - in org.apache.sysml.test.integration.applications.dml.LinearRegressionDMLTest
Running org.apache.sysml.test.integration.applications.pydml.CsplineDSPyDMLTest
Tests run: 3, Failures: 0, Errors: 0, Skipped: 0, Time elapsed: 12.017 sec - in org.apache.sysml.test.integration.applications.pydml.CsplineDSPyDMLTest
Running org.apache.sysml.test.integration.applications.pydml.LinearLogRegPyDMLTest
Tests run: 7, Failures: 0, Errors: 0, Skipped: 0, Time elapsed: 144.776 sec - in org.apache.sysml.test.integration.applications.pydml.LinearLogRegPyDMLTest
Running org.apache.sysml.test.integration.applications.pydml.NaiveBayesPyDMLTest
Tests run: 6, Failures: 0, Errors: 0, Skipped: 0, Time elapsed: 115.821 sec - in org.apache.sysml.test.integration.applications.pydml.NaiveBayesPyDMLTest
Running org.apache.sysml.test.integration.applications.dml.CsplineCGDMLTest
Tests run: 3, Failures: 0, Errors: 0, Skipped: 0, Time elapsed: 14.915 sec - in org.apache.sysml.test.integration.applications.dml.CsplineCGDMLTest
Running org.apache.sysml.test.integration.applications.dml.L2SVMDMLTest
Tests run: 9, Failures: 0, Errors: 0, Skipped: 0, Time elapsed: 143.622 sec - in org.apache.sysml.test.integration.applications.dml.L2SVMDMLTest
Running org.apache.sysml.test.integration.applications.pydml.MDABivariateStatsPyDMLTest
Tests run: 4, Failures: 0, Errors: 0, Skipped: 0, Time elapsed: 411.618 sec - in org.apache.sysml.test.integration.applications.pydml.MDABivariateStatsPyDMLTest
Running org.apache.sysml.test.integration.applications.pydml.PageRankPyDMLTest
Tests run: 3, Failures: 0, Errors: 0, Skipped: 0, Time elapsed: 5.984 sec - in org.apache.sysml.test.integration.applications.pydml.PageRankPyDMLTest
Running org.apache.sysml.test.integration.applications.pydml.NaiveBayesParforPyDMLTest
Tests run: 6, Failures: 0, Errors: 0, Skipped: 0, Time elapsed: 104.053 sec - in org.apache.sysml.test.integration.applications.pydml.NaiveBayesParforPyDMLTest
Running org.apache.sysml.test.integration.applications.dml.NaiveBayesDMLTest
Tests run: 6, Failures: 0, Errors: 0, Skipped: 0, Time elapsed: 184.589 sec - in org.apache.sysml.test.integration.applications.dml.NaiveBayesDMLTest
Running org.apache.sysml.test.integration.applications.dml.MDABivariateStatsDMLTest
Tests run: 4, Failures: 0, Errors: 0, Skipped: 0, Time elapsed: 621.012 sec - in org.apache.sysml.test.integration.applications.dml.MDABivariateStatsDMLTest
Running org.apache.sysml.test.integration.applications.dml.PageRankDMLTest
Tests run: 3, Failures: 0, Errors: 0, Skipped: 0, Time elapsed: 13.102 sec - in org.apache.sysml.test.integration.applications.dml.PageRankDMLTest
Running org.apache.sysml.test.integration.applications.pydml.GLMPyDMLTest
Tests run: 30, Failures: 0, Errors: 0, Skipped: 0, Time elapsed: 1,261.356 sec - in org.apache.sysml.test.integration.applications.pydml.GLMPyDMLTest
Running org.apache.sysml.test.integration.applications.pydml.MultiClassSVMPyDMLTest
Tests run: 9, Failures: 0, Errors: 0, Skipped: 0, Time elapsed: 117.679 sec - in org.apache.sysml.test.integration.applications.pydml.MultiClassSVMPyDMLTest
Running org.apache.sysml.test.integration.applications.dml.ID3DMLTest
Tests run: 2, Failures: 0, Errors: 0, Skipped: 0, Time elapsed: 659.23 sec - in org.apache.sysml.test.integration.applications.dml.ID3DMLTest
Running org.apache.sysml.test.integration.applications.dml.GLMDMLTest
Tests run: 30, Failures: 0, Errors: 0, Skipped: 0, Time elapsed: 1,212.312 sec - in org.apache.sysml.test.integration.applications.dml.GLMDMLTest
Running org.apache.sysml.test.integration.applications.pydml.CsplineCGPyDMLTest
Tests run: 3, Failures: 0, Errors: 0, Skipped: 0, Time elapsed: 16.286 sec - in org.apache.sysml.test.integration.applications.pydml.CsplineCGPyDMLTest
Running org.apache.sysml.test.integration.applications.pydml.WelchTPyDMLTest
Tests run: 3, Failures: 0, Errors: 0, Skipped: 0, Time elapsed: 7.704 sec - in org.apache.sysml.test.integration.applications.pydml.WelchTPyDMLTest
Running org.apache.sysml.test.integration.applications.dml.MultiClassSVMDMLTest
Tests run: 9, Failures: 0, Errors: 0, Skipped: 0, Time elapsed: 189.421 sec - in org.apache.sysml.test.integration.applications.dml.MultiClassSVMDMLTest
Running org.apache.sysml.test.integration.applications.dml.CsplineDSDMLTest
Tests run: 3, Failures: 0, Errors: 0, Skipped: 0, Time elapsed: 17.119 sec - in org.apache.sysml.test.integration.applications.dml.CsplineDSDMLTest
Running org.apache.sysml.test.integration.applications.pydml.ApplyTransformPyDMLTest
Tests run: 7, Failures: 0, Errors: 0, Skipped: 0, Time elapsed: 1.66 sec - in org.apache.sysml.test.integration.applications.pydml.ApplyTransformPyDMLTest
Running org.apache.sysml.test.integration.applications.dml.NaiveBayesParforDMLTest
Tests run: 6, Failures: 0, Errors: 0, Skipped: 0, Time elapsed: 165.478 sec - in org.apache.sysml.test.integration.applications.dml.NaiveBayesParforDMLTest
Running org.apache.sysml.test.integration.applications.pydml.L2SVMPyDMLTest
Tests run: 9, Failures: 0, Errors: 0, Skipped: 0, Time elapsed: 115.984 sec - in org.apache.sysml.test.integration.applications.pydml.L2SVMPyDMLTest
Running org.apache.sysml.test.integration.applications.pydml.LinearRegressionPyDMLTest
Tests run: 7, Failures: 0, Errors: 0, Skipped: 0, Time elapsed: 83.212 sec - in org.apache.sysml.test.integration.applications.pydml.LinearRegressionPyDMLTest
Running org.apache.sysml.test.integration.applications.dml.LinearLogRegDMLTest
Tests run: 7, Failures: 0, Errors: 0, Skipped: 0, Time elapsed: 130.807 sec - in org.apache.sysml.test.integration.applications.dml.LinearLogRegDMLTest
Running org.apache.sysml.test.integration.applications.dml.GNMFDMLTest
Tests run: 3, Failures: 0, Errors: 0, Skipped: 0, Time elapsed: 142.767 sec - in org.apache.sysml.test.integration.applications.dml.GNMFDMLTest
Running org.apache.sysml.test.integration.applications.dml.WelchTDMLTest
Tests run: 3, Failures: 0, Errors: 0, Skipped: 0, Time elapsed: 11.733 sec - in org.apache.sysml.test.integration.applications.dml.WelchTDMLTest
Running org.apache.sysml.test.integration.applications.dml.ApplyTransformDMLTest
Tests run: 7, Failures: 0, Errors: 0, Skipped: 0, Time elapsed: 15.674 sec - in org.apache.sysml.test.integration.applications.dml.ApplyTransformDMLTest
Running org.apache.sysml.test.integration.applications.pydml.ID3PyDMLTest
Tests run: 2, Failures: 0, Errors: 0, Skipped: 0, Time elapsed: 856.495 sec - in org.apache.sysml.test.integration.applications.pydml.ID3PyDMLTest
Running org.apache.sysml.test.integration.applications.pydml.GNMFPyDMLTest
Tests run: 3, Failures: 0, Errors: 0, Skipped: 0, Time elapsed: 119.025 sec - in org.apache.sysml.test.integration.applications.pydml.GNMFPyDMLTest

Results :

Failed tests: 
  FrameMatrixReblockTest.testFrameWriteMultipleSparseBinarySpark:169->runFrameReblockTest:225
31 values are not in equal

Tests run: 7066, Failures: 1, Errors: 0, Skipped: 0

[INFO] 
[INFO] --- maven-failsafe-plugin:2.17:verify (default) @ systemml ---
[INFO] Failsafe report directory: <https://sparktc.ibmcloud.com/jenkins/job/SystemML-DailyTest/ws/target/failsafe-reports>
[INFO] ------------------------------------------------------------------------
[INFO] BUILD FAILURE
[INFO] ------------------------------------------------------------------------
[INFO] Total time: 03:23 h
[INFO] Finished at: 2017-06-26T18:02:42-05:00
[INFO] Final Memory: 62M/2423M
[INFO] ------------------------------------------------------------------------
[ERROR] Failed to execute goal org.apache.maven.plugins:maven-failsafe-plugin:2.17:verify
(default) on project systemml: There are test failures.
[ERROR] 
[ERROR] Please refer to <https://sparktc.ibmcloud.com/jenkins/job/SystemML-DailyTest/ws/target/failsafe-reports>
for the individual test results.
[ERROR] -> [Help 1]
[ERROR] 
[ERROR] To see the full stack trace of the errors, re-run Maven with the -e switch.
[ERROR] Re-run Maven using the -X switch to enable full debug logging.
[ERROR] 
[ERROR] For more information about the errors and possible solutions, please read the following
articles:
[ERROR] [Help 1] http://cwiki.apache.org/confluence/display/MAVEN/MojoFailureException
Build step 'Execute shell' marked build as failure
Run condition [Always] enabling perform for step [[]]

Mime
View raw message