systemml-dev mailing list archives

Site index · List index
Message view « Date » · « Thread »
Top « Date » · « Thread »
From jenk...@spark.tc
Subject Build failed in Jenkins: SystemML-DailyTest #991
Date Mon, 15 May 2017 22:22:45 GMT
See <https://sparktc.ibmcloud.com/jenkins/job/SystemML-DailyTest/991/>

------------------------------------------
[...truncated 31922 lines...]
17/05/15 16:21:02 INFO scheduler.DAGScheduler: ShuffleMapStage 0 (parallelizePairs at SparkExecutionContext.java:706)
finished in 0.363 s
17/05/15 16:21:02 INFO scheduler.DAGScheduler: looking for newly runnable stages
17/05/15 16:21:02 INFO scheduler.DAGScheduler: running: Set(ShuffleMapStage 1)
17/05/15 16:21:02 INFO scheduler.DAGScheduler: waiting: Set(ResultStage 2)
17/05/15 16:21:02 INFO scheduler.DAGScheduler: failed: Set()
17/05/15 16:21:02 INFO scheduler.TaskSetManager: Finished task 0.0 in stage 1.0 (TID 1) in
52 ms on localhost (executor driver) (1/1)
17/05/15 16:21:02 INFO scheduler.TaskSchedulerImpl: Removed TaskSet 1.0, whose tasks have
all completed, from pool default
17/05/15 16:21:02 INFO scheduler.DAGScheduler: ShuffleMapStage 1 (parallelizePairs at SparkExecutionContext.java:706)
finished in 0.262 s
17/05/15 16:21:02 INFO scheduler.DAGScheduler: looking for newly runnable stages
17/05/15 16:21:02 INFO scheduler.DAGScheduler: running: Set()
17/05/15 16:21:02 INFO scheduler.DAGScheduler: waiting: Set(ResultStage 2)
17/05/15 16:21:02 INFO scheduler.DAGScheduler: failed: Set()
17/05/15 16:21:02 INFO scheduler.DAGScheduler: Submitting ResultStage 2 (MapPartitionsRDD[5]
at mapValues at BinarySPInstruction.java:117), which has no missing parents
17/05/15 16:21:02 INFO memory.MemoryStore: Block broadcast_2 stored as values in memory (estimated
size 4.2 KB, free 1033.8 MB)
17/05/15 16:21:02 INFO memory.MemoryStore: Block broadcast_2_piece0 stored as bytes in memory
(estimated size 2.3 KB, free 1033.8 MB)
17/05/15 16:21:02 INFO storage.BlockManagerInfo: Added broadcast_2_piece0 in memory on 169.54.146.43:45581
(size: 2.3 KB, free: 1033.8 MB)
17/05/15 16:21:02 INFO spark.SparkContext: Created broadcast 2 from broadcast at DAGScheduler.scala:996
17/05/15 16:21:02 INFO scheduler.DAGScheduler: Submitting 1 missing tasks from ResultStage
2 (MapPartitionsRDD[5] at mapValues at BinarySPInstruction.java:117)
17/05/15 16:21:02 INFO scheduler.TaskSchedulerImpl: Adding task set 2.0 with 1 tasks
17/05/15 16:21:02 INFO scheduler.FairSchedulableBuilder: Added task set TaskSet_2.0 tasks
to pool default
17/05/15 16:21:02 INFO scheduler.TaskSetManager: Starting task 0.0 in stage 2.0 (TID 2, localhost,
executor driver, partition 0, PROCESS_LOCAL, 5813 bytes)
17/05/15 16:21:02 INFO executor.Executor: Running task 0.0 in stage 2.0 (TID 2)
17/05/15 16:21:02 INFO storage.ShuffleBlockFetcherIterator: Getting 1 non-empty blocks out
of 1 blocks
17/05/15 16:21:02 INFO storage.ShuffleBlockFetcherIterator: Started 0 remote fetches in 8
ms
17/05/15 16:21:02 INFO storage.ShuffleBlockFetcherIterator: Getting 1 non-empty blocks out
of 1 blocks
17/05/15 16:21:02 INFO storage.ShuffleBlockFetcherIterator: Started 0 remote fetches in 1
ms
17/05/15 16:21:02 INFO executor.Executor: Finished task 0.0 in stage 2.0 (TID 2). 2077 bytes
result sent to driver
17/05/15 16:21:02 INFO scheduler.TaskSetManager: Finished task 0.0 in stage 2.0 (TID 2) in
99 ms on localhost (executor driver) (1/1)
17/05/15 16:21:02 INFO scheduler.TaskSchedulerImpl: Removed TaskSet 2.0, whose tasks have
all completed, from pool default
17/05/15 16:21:02 INFO scheduler.DAGScheduler: ResultStage 2 (collect at SparkExecutionContext.java:796)
finished in 0.101 s
17/05/15 16:21:02 INFO scheduler.DAGScheduler: Registering RDD 6 (parallelizePairs at SparkExecutionContext.java:706)
17/05/15 16:21:02 INFO scheduler.DAGScheduler: Registering RDD 7 (parallelizePairs at SparkExecutionContext.java:706)
17/05/15 16:21:02 INFO scheduler.DAGScheduler: Got job 1 (collect at SparkExecutionContext.java:796)
with 1 output partitions
17/05/15 16:21:02 INFO scheduler.DAGScheduler: Final stage: ResultStage 5 (collect at SparkExecutionContext.java:796)
17/05/15 16:21:02 INFO scheduler.DAGScheduler: Parents of final stage: List(ShuffleMapStage
3, ShuffleMapStage 4)
17/05/15 16:21:02 INFO scheduler.DAGScheduler: Missing parents: List(ShuffleMapStage 3, ShuffleMapStage
4)
17/05/15 16:21:02 INFO scheduler.DAGScheduler: Submitting ShuffleMapStage 3 (ParallelCollectionRDD[6]
at parallelizePairs at SparkExecutionContext.java:706), which has no missing parents
17/05/15 16:21:02 INFO memory.MemoryStore: Block broadcast_3 stored as values in memory (estimated
size 2032.0 B, free 1033.8 MB)
17/05/15 16:21:02 INFO memory.MemoryStore: Block broadcast_3_piece0 stored as bytes in memory
(estimated size 1305.0 B, free 1033.8 MB)
17/05/15 16:21:02 INFO storage.BlockManagerInfo: Added broadcast_3_piece0 in memory on 169.54.146.43:45581
(size: 1305.0 B, free: 1033.8 MB)
17/05/15 16:21:02 INFO spark.SparkContext: Created broadcast 3 from broadcast at DAGScheduler.scala:996
17/05/15 16:21:02 INFO scheduler.DAGScheduler: Submitting 1 missing tasks from ShuffleMapStage
3 (ParallelCollectionRDD[6] at parallelizePairs at SparkExecutionContext.java:706)
17/05/15 16:21:02 INFO scheduler.TaskSchedulerImpl: Adding task set 3.0 with 1 tasks
17/05/15 16:21:02 INFO scheduler.FairSchedulableBuilder: Added task set TaskSet_3.0 tasks
to pool default
17/05/15 16:21:02 INFO scheduler.DAGScheduler: Submitting ShuffleMapStage 4 (ParallelCollectionRDD[7]
at parallelizePairs at SparkExecutionContext.java:706), which has no missing parents
17/05/15 16:21:02 INFO scheduler.TaskSetManager: Starting task 0.0 in stage 3.0 (TID 3, localhost,
executor driver, partition 0, PROCESS_LOCAL, 6445 bytes)
17/05/15 16:21:02 INFO memory.MemoryStore: Block broadcast_4 stored as values in memory (estimated
size 2032.0 B, free 1033.8 MB)
17/05/15 16:21:02 INFO executor.Executor: Running task 0.0 in stage 3.0 (TID 3)
17/05/15 16:21:02 INFO memory.MemoryStore: Block broadcast_4_piece0 stored as bytes in memory
(estimated size 1305.0 B, free 1033.8 MB)
17/05/15 16:21:02 INFO storage.BlockManagerInfo: Added broadcast_4_piece0 in memory on 169.54.146.43:45581
(size: 1305.0 B, free: 1033.8 MB)
17/05/15 16:21:02 INFO spark.SparkContext: Created broadcast 4 from broadcast at DAGScheduler.scala:996
17/05/15 16:21:02 INFO scheduler.DAGScheduler: Submitting 1 missing tasks from ShuffleMapStage
4 (ParallelCollectionRDD[7] at parallelizePairs at SparkExecutionContext.java:706)
17/05/15 16:21:02 INFO scheduler.TaskSchedulerImpl: Adding task set 4.0 with 1 tasks
17/05/15 16:21:02 INFO scheduler.FairSchedulableBuilder: Added task set TaskSet_4.0 tasks
to pool default
17/05/15 16:21:02 INFO executor.Executor: Finished task 0.0 in stage 3.0 (TID 3). 1253 bytes
result sent to driver
17/05/15 16:21:02 INFO scheduler.TaskSetManager: Starting task 0.0 in stage 4.0 (TID 4, localhost,
executor driver, partition 0, PROCESS_LOCAL, 6445 bytes)
17/05/15 16:21:02 INFO executor.Executor: Running task 0.0 in stage 4.0 (TID 4)
17/05/15 16:21:02 INFO scheduler.TaskSetManager: Finished task 0.0 in stage 3.0 (TID 3) in
16 ms on localhost (executor driver) (1/1)
17/05/15 16:21:02 INFO scheduler.TaskSchedulerImpl: Removed TaskSet 3.0, whose tasks have
all completed, from pool default
17/05/15 16:21:02 INFO scheduler.DAGScheduler: ShuffleMapStage 3 (parallelizePairs at SparkExecutionContext.java:706)
finished in 0.017 s
17/05/15 16:21:02 INFO scheduler.DAGScheduler: looking for newly runnable stages
17/05/15 16:21:02 INFO scheduler.DAGScheduler: running: Set(ShuffleMapStage 4)
17/05/15 16:21:02 INFO scheduler.DAGScheduler: waiting: Set(ResultStage 5)
17/05/15 16:21:02 INFO scheduler.DAGScheduler: failed: Set()
17/05/15 16:21:02 INFO executor.Executor: Finished task 0.0 in stage 4.0 (TID 4). 1253 bytes
result sent to driver
17/05/15 16:21:02 INFO scheduler.TaskSetManager: Finished task 0.0 in stage 4.0 (TID 4) in
12 ms on localhost (executor driver) (1/1)
17/05/15 16:21:02 INFO scheduler.TaskSchedulerImpl: Removed TaskSet 4.0, whose tasks have
all completed, from pool default
17/05/15 16:21:02 INFO scheduler.DAGScheduler: ShuffleMapStage 4 (parallelizePairs at SparkExecutionContext.java:706)
finished in 0.020 s
17/05/15 16:21:02 INFO scheduler.DAGScheduler: looking for newly runnable stages
17/05/15 16:21:02 INFO scheduler.DAGScheduler: running: Set()
17/05/15 16:21:02 INFO scheduler.DAGScheduler: waiting: Set(ResultStage 5)
17/05/15 16:21:02 INFO scheduler.DAGScheduler: failed: Set()
17/05/15 16:21:02 INFO scheduler.DAGScheduler: Submitting ResultStage 5 (MapPartitionsRDD[11]
at mapValues at BinarySPInstruction.java:117), which has no missing parents
17/05/15 16:21:02 INFO memory.MemoryStore: Block broadcast_5 stored as values in memory (estimated
size 4.2 KB, free 1033.8 MB)
17/05/15 16:21:02 INFO memory.MemoryStore: Block broadcast_5_piece0 stored as bytes in memory
(estimated size 2.3 KB, free 1033.8 MB)
17/05/15 16:21:02 INFO storage.BlockManagerInfo: Added broadcast_5_piece0 in memory on 169.54.146.43:45581
(size: 2.3 KB, free: 1033.8 MB)
17/05/15 16:21:02 INFO spark.SparkContext: Created broadcast 5 from broadcast at DAGScheduler.scala:996
17/05/15 16:21:02 INFO scheduler.DAGScheduler: Submitting 1 missing tasks from ResultStage
5 (MapPartitionsRDD[11] at mapValues at BinarySPInstruction.java:117)
17/05/15 16:21:02 INFO scheduler.TaskSchedulerImpl: Adding task set 5.0 with 1 tasks
17/05/15 16:21:02 INFO scheduler.FairSchedulableBuilder: Added task set TaskSet_5.0 tasks
to pool default
17/05/15 16:21:02 INFO scheduler.TaskSetManager: Starting task 0.0 in stage 5.0 (TID 5, localhost,
executor driver, partition 0, PROCESS_LOCAL, 5814 bytes)
17/05/15 16:21:02 INFO executor.Executor: Running task 0.0 in stage 5.0 (TID 5)
17/05/15 16:21:02 INFO storage.ShuffleBlockFetcherIterator: Getting 1 non-empty blocks out
of 1 blocks
17/05/15 16:21:02 INFO storage.ShuffleBlockFetcherIterator: Started 0 remote fetches in 1
ms
17/05/15 16:21:02 INFO storage.ShuffleBlockFetcherIterator: Getting 1 non-empty blocks out
of 1 blocks
17/05/15 16:21:02 INFO storage.ShuffleBlockFetcherIterator: Started 0 remote fetches in 0
ms
17/05/15 16:21:02 INFO executor.Executor: Finished task 0.0 in stage 5.0 (TID 5). 2327 bytes
result sent to driver
17/05/15 16:21:02 INFO scheduler.TaskSetManager: Finished task 0.0 in stage 5.0 (TID 5) in
16 ms on localhost (executor driver) (1/1)
17/05/15 16:21:02 INFO scheduler.TaskSchedulerImpl: Removed TaskSet 5.0, whose tasks have
all completed, from pool default
17/05/15 16:21:02 INFO scheduler.DAGScheduler: ResultStage 5 (collect at SparkExecutionContext.java:796)
finished in 0.018 s
17/05/15 16:21:02 INFO storage.BlockManagerInfo: Removed broadcast_5_piece0 on 169.54.146.43:45581
in memory (size: 2.3 KB, free: 1033.8 MB)
17/05/15 16:21:02 INFO storage.BlockManagerInfo: Removed broadcast_4_piece0 on 169.54.146.43:45581
in memory (size: 1305.0 B, free: 1033.8 MB)
17/05/15 16:21:02 INFO storage.BlockManagerInfo: Removed broadcast_3_piece0 on 169.54.146.43:45581
in memory (size: 1305.0 B, free: 1033.8 MB)
17/05/15 16:21:02 INFO storage.BlockManagerInfo: Removed broadcast_2_piece0 on 169.54.146.43:45581
in memory (size: 2.3 KB, free: 1033.8 MB)
17/05/15 16:21:02 INFO spark.ContextCleaner: Cleaned shuffle 2
17/05/15 16:21:02 INFO spark.ContextCleaner: Cleaned shuffle 3
Running org.apache.sysml.test.integration.functions.quaternary.WeightedDivMatrixMultTest
Tests run: 90, Failures: 0, Errors: 0, Skipped: 0, Time elapsed: 1,531.089 sec - in org.apache.sysml.test.integration.functions.quaternary.WeightedDivMatrixMultTest
17/05/15 16:22:48 INFO util.ShutdownHookManager: Shutdown hook called
17/05/15 16:22:48 INFO util.ShutdownHookManager: Deleting directory /tmp/spark-1255f000-008b-4811-8e6e-e69c9eccbf9c
17/05/15 16:22:55 INFO spark.ContextCleaner: Cleaned shuffle 1
17/05/15 16:22:55 INFO spark.ContextCleaner: Cleaned shuffle 0
17/05/15 16:22:55 INFO storage.BlockManagerInfo: Removed broadcast_0_piece0 on 169.54.146.43:45581
in memory (size: 1305.0 B, free: 1033.8 MB)
17/05/15 16:22:55 INFO storage.BlockManagerInfo: Removed broadcast_1_piece0 on 169.54.146.43:45581
in memory (size: 1302.0 B, free: 1033.8 MB)
17/05/15 16:22:56 INFO server.ServerConnector: Stopped ServerConnector@14de89c6{HTTP/1.1}{0.0.0.0:4040}
17/05/15 16:22:56 INFO handler.ContextHandler: Stopped o.s.j.s.ServletContextHandler@6c496ead{/stages/stage/kill,null,UNAVAILABLE}
17/05/15 16:22:56 INFO handler.ContextHandler: Stopped o.s.j.s.ServletContextHandler@6acbab2c{/jobs/job/kill,null,UNAVAILABLE}
17/05/15 16:22:56 INFO handler.ContextHandler: Stopped o.s.j.s.ServletContextHandler@65f5ae4{/api,null,UNAVAILABLE}
17/05/15 16:22:56 INFO handler.ContextHandler: Stopped o.s.j.s.ServletContextHandler@3b889cc4{/,null,UNAVAILABLE}
17/05/15 16:22:56 INFO handler.ContextHandler: Stopped o.s.j.s.ServletContextHandler@25646c14{/static,null,UNAVAILABLE}
17/05/15 16:22:56 INFO handler.ContextHandler: Stopped o.s.j.s.ServletContextHandler@6e30590a{/executors/threadDump/json,null,UNAVAILABLE}
17/05/15 16:22:56 INFO handler.ContextHandler: Stopped o.s.j.s.ServletContextHandler@3231fb7a{/executors/threadDump,null,UNAVAILABLE}
17/05/15 16:22:56 INFO handler.ContextHandler: Stopped o.s.j.s.ServletContextHandler@3045c6ea{/executors/json,null,UNAVAILABLE}
17/05/15 16:22:56 INFO handler.ContextHandler: Stopped o.s.j.s.ServletContextHandler@49604fef{/executors,null,UNAVAILABLE}
17/05/15 16:22:56 INFO handler.ContextHandler: Stopped o.s.j.s.ServletContextHandler@44d311df{/environment/json,null,UNAVAILABLE}
17/05/15 16:22:56 INFO handler.ContextHandler: Stopped o.s.j.s.ServletContextHandler@41d875c5{/environment,null,UNAVAILABLE}
17/05/15 16:22:56 INFO handler.ContextHandler: Stopped o.s.j.s.ServletContextHandler@67ff475{/storage/rdd/json,null,UNAVAILABLE}
17/05/15 16:22:56 INFO handler.ContextHandler: Stopped o.s.j.s.ServletContextHandler@4a78e8d2{/storage/rdd,null,UNAVAILABLE}
17/05/15 16:22:56 INFO handler.ContextHandler: Stopped o.s.j.s.ServletContextHandler@625cea53{/storage/json,null,UNAVAILABLE}
17/05/15 16:22:56 INFO handler.ContextHandler: Stopped o.s.j.s.ServletContextHandler@27ec119e{/storage,null,UNAVAILABLE}
17/05/15 16:22:56 INFO handler.ContextHandler: Stopped o.s.j.s.ServletContextHandler@3b3eeeb6{/stages/pool/json,null,UNAVAILABLE}
17/05/15 16:22:56 INFO handler.ContextHandler: Stopped o.s.j.s.ServletContextHandler@5a1e5258{/stages/pool,null,UNAVAILABLE}
17/05/15 16:22:56 INFO handler.ContextHandler: Stopped o.s.j.s.ServletContextHandler@67a44a2a{/stages/stage/json,null,UNAVAILABLE}
17/05/15 16:22:56 INFO handler.ContextHandler: Stopped o.s.j.s.ServletContextHandler@77bd6e69{/stages/stage,null,UNAVAILABLE}
17/05/15 16:22:56 INFO handler.ContextHandler: Stopped o.s.j.s.ServletContextHandler@5cb7aedb{/stages/json,null,UNAVAILABLE}
17/05/15 16:22:56 INFO handler.ContextHandler: Stopped o.s.j.s.ServletContextHandler@445f3b15{/stages,null,UNAVAILABLE}
17/05/15 16:22:56 INFO handler.ContextHandler: Stopped o.s.j.s.ServletContextHandler@1cd18b07{/jobs/job/json,null,UNAVAILABLE}
17/05/15 16:22:56 INFO handler.ContextHandler: Stopped o.s.j.s.ServletContextHandler@33731a4e{/jobs/job,null,UNAVAILABLE}
17/05/15 16:22:56 INFO handler.ContextHandler: Stopped o.s.j.s.ServletContextHandler@719d3db8{/jobs/json,null,UNAVAILABLE}
17/05/15 16:22:56 INFO handler.ContextHandler: Stopped o.s.j.s.ServletContextHandler@343d8d6d{/jobs,null,UNAVAILABLE}
17/05/15 16:22:56 INFO ui.SparkUI: Stopped Spark web UI at http://169.54.146.43:4040
17/05/15 16:22:56 INFO spark.MapOutputTrackerMasterEndpoint: MapOutputTrackerMasterEndpoint
stopped!
17/05/15 16:22:56 INFO memory.MemoryStore: MemoryStore cleared
17/05/15 16:22:56 INFO storage.BlockManager: BlockManager stopped
17/05/15 16:22:56 INFO storage.BlockManagerMaster: BlockManagerMaster stopped
17/05/15 16:22:56 INFO scheduler.OutputCommitCoordinator$OutputCommitCoordinatorEndpoint:
OutputCommitCoordinator stopped!
17/05/15 16:22:56 INFO spark.SparkContext: Successfully stopped SparkContext
Running org.apache.sysml.test.integration.scripts.nn.NNTest
Tests run: 1, Failures: 0, Errors: 0, Skipped: 0, Time elapsed: 562.784 sec - in org.apache.sysml.test.integration.scripts.nn.NNTest
17/05/15 16:22:56 INFO util.ShutdownHookManager: Shutdown hook called
17/05/15 16:22:56 INFO util.ShutdownHookManager: Deleting directory /tmp/spark-ea166398-4741-48f5-91c8-d2be24e34e7f
Running org.apache.sysml.test.integration.applications.descriptivestats.UnivariateWeightedScaleDenseTest
Tests run: 24, Failures: 0, Errors: 0, Skipped: 0, Time elapsed: 363.443 sec - in org.apache.sysml.test.integration.applications.descriptivestats.UnivariateWeightedScaleDenseTest
Running org.apache.sysml.test.integration.applications.parfor.ParForNaiveBayesTest
Tests run: 10, Failures: 0, Errors: 0, Skipped: 0, Time elapsed: 538.567 sec - in org.apache.sysml.test.integration.applications.parfor.ParForNaiveBayesTest
Running org.apache.sysml.test.integration.functions.append.AppendChainTest
Tests run: 12, Failures: 0, Errors: 0, Skipped: 0, Time elapsed: 1,064.279 sec - in org.apache.sysml.test.integration.functions.append.AppendChainTest
Running org.apache.sysml.test.integration.applications.descriptivestats.UnivariateUnweightedScaleSparseTest
Tests run: 24, Failures: 0, Errors: 0, Skipped: 0, Time elapsed: 275.409 sec - in org.apache.sysml.test.integration.applications.descriptivestats.UnivariateUnweightedScaleSparseTest
Running org.apache.sysml.test.integration.applications.dml.HITSDMLTest
Tests run: 1, Failures: 0, Errors: 0, Skipped: 0, Time elapsed: 93.686 sec - in org.apache.sysml.test.integration.applications.dml.HITSDMLTest
Running org.apache.sysml.test.integration.applications.descriptivestats.UnivariateWeightedScaleSparseTest
Tests run: 24, Failures: 0, Errors: 0, Skipped: 0, Time elapsed: 353.493 sec - in org.apache.sysml.test.integration.applications.descriptivestats.UnivariateWeightedScaleSparseTest
Running org.apache.sysml.test.integration.functions.append.AppendMatrixTest
Tests run: 22, Failures: 0, Errors: 0, Skipped: 0, Time elapsed: 1,493.569 sec - in org.apache.sysml.test.integration.functions.append.AppendMatrixTest
Running org.apache.sysml.test.integration.applications.pydml.ArimaPyDMLTest
Tests run: 1, Failures: 0, Errors: 0, Skipped: 0, Time elapsed: 48.944 sec - in org.apache.sysml.test.integration.applications.pydml.ArimaPyDMLTest
Running org.apache.sysml.test.integration.applications.pydml.HITSPyDMLTest
Tests run: 1, Failures: 0, Errors: 0, Skipped: 0, Time elapsed: 78.096 sec - in org.apache.sysml.test.integration.applications.pydml.HITSPyDMLTest
Running org.apache.sysml.test.integration.applications.dml.LinearRegressionDMLTest
Tests run: 7, Failures: 0, Errors: 0, Skipped: 0, Time elapsed: 50.963 sec - in org.apache.sysml.test.integration.applications.dml.LinearRegressionDMLTest
Running org.apache.sysml.test.integration.applications.pydml.CsplineDSPyDMLTest
Tests run: 3, Failures: 0, Errors: 0, Skipped: 0, Time elapsed: 6.937 sec - in org.apache.sysml.test.integration.applications.pydml.CsplineDSPyDMLTest
Running org.apache.sysml.test.integration.applications.pydml.LinearLogRegPyDMLTest
Tests run: 7, Failures: 0, Errors: 0, Skipped: 0, Time elapsed: 89.07 sec - in org.apache.sysml.test.integration.applications.pydml.LinearLogRegPyDMLTest
Running org.apache.sysml.test.integration.applications.pydml.NaiveBayesPyDMLTest
Tests run: 6, Failures: 0, Errors: 0, Skipped: 0, Time elapsed: 82.035 sec - in org.apache.sysml.test.integration.applications.pydml.NaiveBayesPyDMLTest
Running org.apache.sysml.test.integration.applications.dml.CsplineCGDMLTest
Tests run: 3, Failures: 0, Errors: 0, Skipped: 0, Time elapsed: 17.039 sec - in org.apache.sysml.test.integration.applications.dml.CsplineCGDMLTest
Running org.apache.sysml.test.integration.applications.dml.L2SVMDMLTest
Tests run: 9, Failures: 0, Errors: 0, Skipped: 0, Time elapsed: 63.43 sec - in org.apache.sysml.test.integration.applications.dml.L2SVMDMLTest
Running org.apache.sysml.test.integration.applications.pydml.MDABivariateStatsPyDMLTest
Tests run: 4, Failures: 0, Errors: 0, Skipped: 0, Time elapsed: 299.012 sec - in org.apache.sysml.test.integration.applications.pydml.MDABivariateStatsPyDMLTest
Running org.apache.sysml.test.integration.applications.pydml.PageRankPyDMLTest
Tests run: 3, Failures: 0, Errors: 0, Skipped: 0, Time elapsed: 8.509 sec - in org.apache.sysml.test.integration.applications.pydml.PageRankPyDMLTest
Running org.apache.sysml.test.integration.applications.pydml.NaiveBayesParforPyDMLTest
Tests run: 6, Failures: 0, Errors: 0, Skipped: 0, Time elapsed: 82.364 sec - in org.apache.sysml.test.integration.applications.pydml.NaiveBayesParforPyDMLTest
Running org.apache.sysml.test.integration.applications.dml.NaiveBayesDMLTest
Tests run: 6, Failures: 0, Errors: 0, Skipped: 0, Time elapsed: 81.328 sec - in org.apache.sysml.test.integration.applications.dml.NaiveBayesDMLTest
Running org.apache.sysml.test.integration.applications.dml.MDABivariateStatsDMLTest
Tests run: 4, Failures: 0, Errors: 0, Skipped: 0, Time elapsed: 298.961 sec - in org.apache.sysml.test.integration.applications.dml.MDABivariateStatsDMLTest
Running org.apache.sysml.test.integration.applications.dml.PageRankDMLTest
Tests run: 3, Failures: 0, Errors: 0, Skipped: 0, Time elapsed: 8.292 sec - in org.apache.sysml.test.integration.applications.dml.PageRankDMLTest
Running org.apache.sysml.test.integration.applications.pydml.GLMPyDMLTest
Tests run: 30, Failures: 0, Errors: 0, Skipped: 0, Time elapsed: 593.236 sec - in org.apache.sysml.test.integration.applications.pydml.GLMPyDMLTest
Running org.apache.sysml.test.integration.applications.pydml.MultiClassSVMPyDMLTest
Tests run: 9, Failures: 0, Errors: 0, Skipped: 0, Time elapsed: 90.275 sec - in org.apache.sysml.test.integration.applications.pydml.MultiClassSVMPyDMLTest
Running org.apache.sysml.test.integration.applications.dml.ID3DMLTest
Tests run: 2, Failures: 0, Errors: 0, Skipped: 0, Time elapsed: 394.289 sec - in org.apache.sysml.test.integration.applications.dml.ID3DMLTest
Running org.apache.sysml.test.integration.applications.dml.GLMDMLTest
Tests run: 30, Failures: 0, Errors: 0, Skipped: 0, Time elapsed: 890.587 sec - in org.apache.sysml.test.integration.applications.dml.GLMDMLTest
Running org.apache.sysml.test.integration.applications.pydml.CsplineCGPyDMLTest
Tests run: 3, Failures: 0, Errors: 0, Skipped: 0, Time elapsed: 6.338 sec - in org.apache.sysml.test.integration.applications.pydml.CsplineCGPyDMLTest
Running org.apache.sysml.test.integration.applications.pydml.WelchTPyDMLTest
Tests run: 3, Failures: 0, Errors: 0, Skipped: 0, Time elapsed: 6.378 sec - in org.apache.sysml.test.integration.applications.pydml.WelchTPyDMLTest
Running org.apache.sysml.test.integration.applications.dml.MultiClassSVMDMLTest
Tests run: 9, Failures: 0, Errors: 0, Skipped: 0, Time elapsed: 89.138 sec - in org.apache.sysml.test.integration.applications.dml.MultiClassSVMDMLTest
Running org.apache.sysml.test.integration.applications.dml.CsplineDSDMLTest
Tests run: 3, Failures: 0, Errors: 0, Skipped: 0, Time elapsed: 16.799 sec - in org.apache.sysml.test.integration.applications.dml.CsplineDSDMLTest
Running org.apache.sysml.test.integration.applications.pydml.ApplyTransformPyDMLTest
Tests run: 7, Failures: 0, Errors: 0, Skipped: 0, Time elapsed: 0.813 sec - in org.apache.sysml.test.integration.applications.pydml.ApplyTransformPyDMLTest
Running org.apache.sysml.test.integration.applications.dml.NaiveBayesParforDMLTest
Tests run: 6, Failures: 0, Errors: 0, Skipped: 0, Time elapsed: 80.567 sec - in org.apache.sysml.test.integration.applications.dml.NaiveBayesParforDMLTest
Running org.apache.sysml.test.integration.applications.pydml.L2SVMPyDMLTest
Tests run: 9, Failures: 0, Errors: 0, Skipped: 0, Time elapsed: 64.989 sec - in org.apache.sysml.test.integration.applications.pydml.L2SVMPyDMLTest
Running org.apache.sysml.test.integration.applications.pydml.LinearRegressionPyDMLTest
Tests run: 7, Failures: 0, Errors: 0, Skipped: 0, Time elapsed: 51.972 sec - in org.apache.sysml.test.integration.applications.pydml.LinearRegressionPyDMLTest
Running org.apache.sysml.test.integration.applications.dml.LinearLogRegDMLTest
Tests run: 7, Failures: 0, Errors: 0, Skipped: 0, Time elapsed: 60.871 sec - in org.apache.sysml.test.integration.applications.dml.LinearLogRegDMLTest
Running org.apache.sysml.test.integration.applications.dml.GNMFDMLTest
Tests run: 3, Failures: 0, Errors: 0, Skipped: 0, Time elapsed: 61.274 sec - in org.apache.sysml.test.integration.applications.dml.GNMFDMLTest
Running org.apache.sysml.test.integration.applications.dml.WelchTDMLTest
Tests run: 3, Failures: 0, Errors: 0, Skipped: 0, Time elapsed: 6.408 sec - in org.apache.sysml.test.integration.applications.dml.WelchTDMLTest
Running org.apache.sysml.test.integration.applications.dml.ApplyTransformDMLTest
Tests run: 7, Failures: 0, Errors: 0, Skipped: 0, Time elapsed: 13.066 sec - in org.apache.sysml.test.integration.applications.dml.ApplyTransformDMLTest
Running org.apache.sysml.test.integration.applications.pydml.ID3PyDMLTest
Tests run: 2, Failures: 0, Errors: 0, Skipped: 0, Time elapsed: 373.358 sec - in org.apache.sysml.test.integration.applications.pydml.ID3PyDMLTest
Running org.apache.sysml.test.integration.applications.pydml.GNMFPyDMLTest
Tests run: 3, Failures: 0, Errors: 0, Skipped: 0, Time elapsed: 57.429 sec - in org.apache.sysml.test.integration.applications.pydml.GNMFPyDMLTest

Results :

Failed tests: 
  FullReblockTest.testTextCellSingeMSparseMR:161->runReblockTest:479 34 values are not
in equal

Tests run: 6951, Failures: 1, Errors: 0, Skipped: 0

[INFO] 
[INFO] --- maven-failsafe-plugin:2.17:verify (default) @ systemml ---
[INFO] Failsafe report directory: <https://sparktc.ibmcloud.com/jenkins/job/SystemML-DailyTest/ws/target/failsafe-reports>
[INFO] ------------------------------------------------------------------------
[INFO] BUILD FAILURE
[INFO] ------------------------------------------------------------------------
[INFO] Total time: 02:43 h
[INFO] Finished at: 2017-05-15T17:22:44-05:00
[INFO] Final Memory: 62M/2120M
[INFO] ------------------------------------------------------------------------
[ERROR] Failed to execute goal org.apache.maven.plugins:maven-failsafe-plugin:2.17:verify
(default) on project systemml: There are test failures.
[ERROR] 
[ERROR] Please refer to <https://sparktc.ibmcloud.com/jenkins/job/SystemML-DailyTest/ws/target/failsafe-reports>
for the individual test results.
[ERROR] -> [Help 1]
[ERROR] 
[ERROR] To see the full stack trace of the errors, re-run Maven with the -e switch.
[ERROR] Re-run Maven using the -X switch to enable full debug logging.
[ERROR] 
[ERROR] For more information about the errors and possible solutions, please read the following
articles:
[ERROR] [Help 1] http://cwiki.apache.org/confluence/display/MAVEN/MojoFailureException
Build step 'Execute shell' marked build as failure
Run condition [Always] enabling perform for step [[]]

Mime
View raw message