systemml-dev mailing list archives

Site index · List index
Message view « Date » · « Thread »
Top « Date » · « Thread »
From jenk...@spark.tc
Subject Build failed in Jenkins: SystemML-DailyTest #1008
Date Wed, 24 May 2017 10:44:17 GMT
See <https://sparktc.ibmcloud.com/jenkins/job/SystemML-DailyTest/1008/changes>

Changes:

[Glenn Weidner] [SYSTEMML-1620] Remove incubation from python package info

[Matthias Boehm] [SYSTEMML-1623] Memory-efficiency of JMLC matrix and frame conversions

[Matthias Boehm] [SYSTEMML-1621] Fix value type inference scalar-matrix max/min/log/ppred

------------------------------------------
[...truncated 30832 lines...]
17/05/24 04:41:52 INFO scheduler.DAGScheduler: waiting: Set(ResultStage 2)
17/05/24 04:41:52 INFO scheduler.TaskSetManager: Finished task 0.0 in stage 1.0 (TID 1) in
34 ms on localhost (executor driver) (1/1)
17/05/24 04:41:52 INFO scheduler.DAGScheduler: failed: Set()
17/05/24 04:41:52 INFO scheduler.TaskSchedulerImpl: Removed TaskSet 1.0, whose tasks have
all completed, from pool default
17/05/24 04:41:52 INFO scheduler.DAGScheduler: ShuffleMapStage 1 (parallelizePairs at SparkExecutionContext.java:706)
finished in 0.326 s
17/05/24 04:41:52 INFO scheduler.DAGScheduler: looking for newly runnable stages
17/05/24 04:41:52 INFO scheduler.DAGScheduler: running: Set()
17/05/24 04:41:52 INFO scheduler.DAGScheduler: waiting: Set(ResultStage 2)
17/05/24 04:41:52 INFO scheduler.DAGScheduler: failed: Set()
17/05/24 04:41:52 INFO scheduler.DAGScheduler: Submitting ResultStage 2 (MapPartitionsRDD[5]
at mapValues at BinarySPInstruction.java:117), which has no missing parents
17/05/24 04:41:52 INFO memory.MemoryStore: Block broadcast_2 stored as values in memory (estimated
size 4.2 KB, free 1033.8 MB)
17/05/24 04:41:52 INFO memory.MemoryStore: Block broadcast_2_piece0 stored as bytes in memory
(estimated size 2.3 KB, free 1033.8 MB)
17/05/24 04:41:52 INFO storage.BlockManagerInfo: Added broadcast_2_piece0 in memory on 169.54.146.43:41537
(size: 2.3 KB, free: 1033.8 MB)
17/05/24 04:41:52 INFO spark.SparkContext: Created broadcast 2 from broadcast at DAGScheduler.scala:996
17/05/24 04:41:52 INFO scheduler.DAGScheduler: Submitting 1 missing tasks from ResultStage
2 (MapPartitionsRDD[5] at mapValues at BinarySPInstruction.java:117)
17/05/24 04:41:53 INFO scheduler.TaskSchedulerImpl: Adding task set 2.0 with 1 tasks
17/05/24 04:41:53 INFO scheduler.FairSchedulableBuilder: Added task set TaskSet_2.0 tasks
to pool default
17/05/24 04:41:53 INFO scheduler.TaskSetManager: Starting task 0.0 in stage 2.0 (TID 2, localhost,
executor driver, partition 0, PROCESS_LOCAL, 5813 bytes)
17/05/24 04:41:53 INFO executor.Executor: Running task 0.0 in stage 2.0 (TID 2)
17/05/24 04:41:53 INFO storage.ShuffleBlockFetcherIterator: Getting 1 non-empty blocks out
of 1 blocks
17/05/24 04:41:53 INFO storage.ShuffleBlockFetcherIterator: Started 0 remote fetches in 23
ms
17/05/24 04:41:53 INFO storage.ShuffleBlockFetcherIterator: Getting 1 non-empty blocks out
of 1 blocks
17/05/24 04:41:53 INFO storage.ShuffleBlockFetcherIterator: Started 0 remote fetches in 17
ms
17/05/24 04:41:53 INFO executor.Executor: Finished task 0.0 in stage 2.0 (TID 2). 2077 bytes
result sent to driver
17/05/24 04:41:53 INFO scheduler.TaskSetManager: Finished task 0.0 in stage 2.0 (TID 2) in
181 ms on localhost (executor driver) (1/1)
17/05/24 04:41:53 INFO scheduler.TaskSchedulerImpl: Removed TaskSet 2.0, whose tasks have
all completed, from pool default
17/05/24 04:41:53 INFO scheduler.DAGScheduler: ResultStage 2 (collect at SparkExecutionContext.java:796)
finished in 0.201 s
17/05/24 04:41:54 INFO storage.BlockManagerInfo: Removed broadcast_1_piece0 on 169.54.146.43:41537
in memory (size: 1305.0 B, free: 1033.8 MB)
17/05/24 04:41:54 INFO spark.ContextCleaner: Cleaned shuffle 0
17/05/24 04:41:54 INFO spark.ContextCleaner: Cleaned shuffle 1
17/05/24 04:41:54 INFO storage.BlockManagerInfo: Removed broadcast_0_piece0 on 169.54.146.43:41537
in memory (size: 1302.0 B, free: 1033.8 MB)
17/05/24 04:41:54 INFO storage.BlockManagerInfo: Removed broadcast_2_piece0 on 169.54.146.43:41537
in memory (size: 2.3 KB, free: 1033.8 MB)
17/05/24 04:41:55 INFO scheduler.DAGScheduler: Registering RDD 7 (parallelizePairs at SparkExecutionContext.java:706)
17/05/24 04:41:55 INFO scheduler.DAGScheduler: Registering RDD 6 (parallelizePairs at SparkExecutionContext.java:706)
17/05/24 04:41:55 INFO scheduler.DAGScheduler: Got job 1 (collect at SparkExecutionContext.java:796)
with 1 output partitions
17/05/24 04:41:55 INFO scheduler.DAGScheduler: Final stage: ResultStage 5 (collect at SparkExecutionContext.java:796)
17/05/24 04:41:55 INFO scheduler.DAGScheduler: Parents of final stage: List(ShuffleMapStage
3, ShuffleMapStage 4)
17/05/24 04:41:55 INFO scheduler.DAGScheduler: Missing parents: List(ShuffleMapStage 3, ShuffleMapStage
4)
17/05/24 04:41:55 INFO scheduler.DAGScheduler: Submitting ShuffleMapStage 3 (ParallelCollectionRDD[7]
at parallelizePairs at SparkExecutionContext.java:706), which has no missing parents
17/05/24 04:41:55 INFO memory.MemoryStore: Block broadcast_3 stored as values in memory (estimated
size 2032.0 B, free 1033.8 MB)
17/05/24 04:41:55 INFO memory.MemoryStore: Block broadcast_3_piece0 stored as bytes in memory
(estimated size 1305.0 B, free 1033.8 MB)
17/05/24 04:41:55 INFO storage.BlockManagerInfo: Added broadcast_3_piece0 in memory on 169.54.146.43:41537
(size: 1305.0 B, free: 1033.8 MB)
17/05/24 04:41:55 INFO spark.SparkContext: Created broadcast 3 from broadcast at DAGScheduler.scala:996
17/05/24 04:41:55 INFO scheduler.DAGScheduler: Submitting 1 missing tasks from ShuffleMapStage
3 (ParallelCollectionRDD[7] at parallelizePairs at SparkExecutionContext.java:706)
17/05/24 04:41:55 INFO scheduler.TaskSchedulerImpl: Adding task set 3.0 with 1 tasks
17/05/24 04:41:55 INFO scheduler.FairSchedulableBuilder: Added task set TaskSet_3.0 tasks
to pool default
17/05/24 04:41:55 INFO scheduler.DAGScheduler: Submitting ShuffleMapStage 4 (ParallelCollectionRDD[6]
at parallelizePairs at SparkExecutionContext.java:706), which has no missing parents
17/05/24 04:41:55 INFO scheduler.TaskSetManager: Starting task 0.0 in stage 3.0 (TID 3, localhost,
executor driver, partition 0, PROCESS_LOCAL, 6445 bytes)
17/05/24 04:41:55 INFO executor.Executor: Running task 0.0 in stage 3.0 (TID 3)
17/05/24 04:41:55 INFO memory.MemoryStore: Block broadcast_4 stored as values in memory (estimated
size 2032.0 B, free 1033.8 MB)
17/05/24 04:41:55 INFO memory.MemoryStore: Block broadcast_4_piece0 stored as bytes in memory
(estimated size 1305.0 B, free 1033.8 MB)
17/05/24 04:41:55 INFO storage.BlockManagerInfo: Added broadcast_4_piece0 in memory on 169.54.146.43:41537
(size: 1305.0 B, free: 1033.8 MB)
17/05/24 04:41:55 INFO spark.SparkContext: Created broadcast 4 from broadcast at DAGScheduler.scala:996
17/05/24 04:41:55 INFO scheduler.DAGScheduler: Submitting 1 missing tasks from ShuffleMapStage
4 (ParallelCollectionRDD[6] at parallelizePairs at SparkExecutionContext.java:706)
17/05/24 04:41:55 INFO scheduler.TaskSchedulerImpl: Adding task set 4.0 with 1 tasks
17/05/24 04:41:55 INFO scheduler.FairSchedulableBuilder: Added task set TaskSet_4.0 tasks
to pool default
17/05/24 04:41:55 INFO executor.Executor: Finished task 0.0 in stage 3.0 (TID 3). 1253 bytes
result sent to driver
17/05/24 04:41:55 INFO scheduler.TaskSetManager: Starting task 0.0 in stage 4.0 (TID 4, localhost,
executor driver, partition 0, PROCESS_LOCAL, 6445 bytes)
17/05/24 04:41:55 INFO scheduler.TaskSetManager: Finished task 0.0 in stage 3.0 (TID 3) in
32 ms on localhost (executor driver) (1/1)
17/05/24 04:41:55 INFO scheduler.TaskSchedulerImpl: Removed TaskSet 3.0, whose tasks have
all completed, from pool default
17/05/24 04:41:55 INFO executor.Executor: Running task 0.0 in stage 4.0 (TID 4)
17/05/24 04:41:55 INFO scheduler.DAGScheduler: ShuffleMapStage 3 (parallelizePairs at SparkExecutionContext.java:706)
finished in 0.033 s
17/05/24 04:41:55 INFO scheduler.DAGScheduler: looking for newly runnable stages
17/05/24 04:41:55 INFO scheduler.DAGScheduler: running: Set(ShuffleMapStage 4)
17/05/24 04:41:55 INFO scheduler.DAGScheduler: waiting: Set(ResultStage 5)
17/05/24 04:41:55 INFO scheduler.DAGScheduler: failed: Set()
17/05/24 04:41:55 INFO executor.Executor: Finished task 0.0 in stage 4.0 (TID 4). 1253 bytes
result sent to driver
17/05/24 04:41:55 INFO scheduler.TaskSetManager: Finished task 0.0 in stage 4.0 (TID 4) in
13 ms on localhost (executor driver) (1/1)
17/05/24 04:41:55 INFO scheduler.TaskSchedulerImpl: Removed TaskSet 4.0, whose tasks have
all completed, from pool default
17/05/24 04:41:55 INFO scheduler.DAGScheduler: ShuffleMapStage 4 (parallelizePairs at SparkExecutionContext.java:706)
finished in 0.035 s
17/05/24 04:41:55 INFO scheduler.DAGScheduler: looking for newly runnable stages
17/05/24 04:41:55 INFO scheduler.DAGScheduler: running: Set()
17/05/24 04:41:55 INFO scheduler.DAGScheduler: waiting: Set(ResultStage 5)
17/05/24 04:41:55 INFO scheduler.DAGScheduler: failed: Set()
17/05/24 04:41:55 INFO scheduler.DAGScheduler: Submitting ResultStage 5 (MapPartitionsRDD[11]
at mapValues at BinarySPInstruction.java:117), which has no missing parents
17/05/24 04:41:55 INFO memory.MemoryStore: Block broadcast_5 stored as values in memory (estimated
size 4.2 KB, free 1033.8 MB)
17/05/24 04:41:55 INFO memory.MemoryStore: Block broadcast_5_piece0 stored as bytes in memory
(estimated size 2.3 KB, free 1033.8 MB)
17/05/24 04:41:55 INFO storage.BlockManagerInfo: Added broadcast_5_piece0 in memory on 169.54.146.43:41537
(size: 2.3 KB, free: 1033.8 MB)
17/05/24 04:41:55 INFO spark.SparkContext: Created broadcast 5 from broadcast at DAGScheduler.scala:996
17/05/24 04:41:55 INFO scheduler.DAGScheduler: Submitting 1 missing tasks from ResultStage
5 (MapPartitionsRDD[11] at mapValues at BinarySPInstruction.java:117)
17/05/24 04:41:55 INFO scheduler.TaskSchedulerImpl: Adding task set 5.0 with 1 tasks
17/05/24 04:41:55 INFO scheduler.FairSchedulableBuilder: Added task set TaskSet_5.0 tasks
to pool default
17/05/24 04:41:55 INFO scheduler.TaskSetManager: Starting task 0.0 in stage 5.0 (TID 5, localhost,
executor driver, partition 0, PROCESS_LOCAL, 5814 bytes)
17/05/24 04:41:55 INFO executor.Executor: Running task 0.0 in stage 5.0 (TID 5)
17/05/24 04:41:55 INFO storage.ShuffleBlockFetcherIterator: Getting 1 non-empty blocks out
of 1 blocks
17/05/24 04:41:55 INFO storage.ShuffleBlockFetcherIterator: Started 0 remote fetches in 0
ms
17/05/24 04:41:55 INFO storage.ShuffleBlockFetcherIterator: Getting 1 non-empty blocks out
of 1 blocks
17/05/24 04:41:55 INFO storage.ShuffleBlockFetcherIterator: Started 0 remote fetches in 0
ms
17/05/24 04:41:55 INFO executor.Executor: Finished task 0.0 in stage 5.0 (TID 5). 2240 bytes
result sent to driver
17/05/24 04:41:55 INFO scheduler.TaskSetManager: Finished task 0.0 in stage 5.0 (TID 5) in
14 ms on localhost (executor driver) (1/1)
17/05/24 04:41:55 INFO scheduler.TaskSchedulerImpl: Removed TaskSet 5.0, whose tasks have
all completed, from pool default
17/05/24 04:41:55 INFO scheduler.DAGScheduler: ResultStage 5 (collect at SparkExecutionContext.java:796)
finished in 0.015 s
17/05/24 04:41:56 INFO storage.BlockManagerInfo: Removed broadcast_5_piece0 on 169.54.146.43:41537
in memory (size: 2.3 KB, free: 1033.8 MB)
17/05/24 04:41:56 INFO storage.BlockManagerInfo: Removed broadcast_4_piece0 on 169.54.146.43:41537
in memory (size: 1305.0 B, free: 1033.8 MB)
17/05/24 04:41:56 INFO storage.BlockManagerInfo: Removed broadcast_3_piece0 on 169.54.146.43:41537
in memory (size: 1305.0 B, free: 1033.8 MB)
17/05/24 04:41:56 INFO spark.ContextCleaner: Cleaned shuffle 2
17/05/24 04:41:56 INFO spark.ContextCleaner: Cleaned shuffle 3
Running org.apache.sysml.test.integration.functions.quaternary.WeightedDivMatrixMultTest
Tests run: 90, Failures: 0, Errors: 0, Skipped: 0, Time elapsed: 1,925.239 sec - in org.apache.sysml.test.integration.functions.quaternary.WeightedDivMatrixMultTest
17/05/24 04:42:00 INFO util.ShutdownHookManager: Shutdown hook called
17/05/24 04:42:00 INFO util.ShutdownHookManager: Deleting directory /tmp/spark-b6ac7bd1-ebee-45f0-b70f-c478d9efa5cc
17/05/24 04:44:41 INFO server.ServerConnector: Stopped ServerConnector@5d6a20b0{HTTP/1.1}{0.0.0.0:4040}
17/05/24 04:44:41 INFO handler.ContextHandler: Stopped o.s.j.s.ServletContextHandler@258e1666{/stages/stage/kill,null,UNAVAILABLE}
17/05/24 04:44:41 INFO handler.ContextHandler: Stopped o.s.j.s.ServletContextHandler@362d377f{/jobs/job/kill,null,UNAVAILABLE}
17/05/24 04:44:41 INFO handler.ContextHandler: Stopped o.s.j.s.ServletContextHandler@4ed525e1{/api,null,UNAVAILABLE}
17/05/24 04:44:41 INFO handler.ContextHandler: Stopped o.s.j.s.ServletContextHandler@5db2cd03{/,null,UNAVAILABLE}
17/05/24 04:44:41 INFO handler.ContextHandler: Stopped o.s.j.s.ServletContextHandler@45cacf4b{/static,null,UNAVAILABLE}
17/05/24 04:44:41 INFO handler.ContextHandler: Stopped o.s.j.s.ServletContextHandler@2b9a734f{/executors/threadDump/json,null,UNAVAILABLE}
17/05/24 04:44:41 INFO handler.ContextHandler: Stopped o.s.j.s.ServletContextHandler@638e0f43{/executors/threadDump,null,UNAVAILABLE}
17/05/24 04:44:41 INFO handler.ContextHandler: Stopped o.s.j.s.ServletContextHandler@3df4b29b{/executors/json,null,UNAVAILABLE}
17/05/24 04:44:41 INFO handler.ContextHandler: Stopped o.s.j.s.ServletContextHandler@660107f0{/executors,null,UNAVAILABLE}
17/05/24 04:44:41 INFO handler.ContextHandler: Stopped o.s.j.s.ServletContextHandler@1d7ab4c1{/environment/json,null,UNAVAILABLE}
17/05/24 04:44:41 INFO handler.ContextHandler: Stopped o.s.j.s.ServletContextHandler@4053cee8{/environment,null,UNAVAILABLE}
17/05/24 04:44:41 INFO handler.ContextHandler: Stopped o.s.j.s.ServletContextHandler@6097773c{/storage/rdd/json,null,UNAVAILABLE}
17/05/24 04:44:41 INFO handler.ContextHandler: Stopped o.s.j.s.ServletContextHandler@7501c02e{/storage/rdd,null,UNAVAILABLE}
17/05/24 04:44:41 INFO handler.ContextHandler: Stopped o.s.j.s.ServletContextHandler@54013eb5{/storage/json,null,UNAVAILABLE}
17/05/24 04:44:41 INFO handler.ContextHandler: Stopped o.s.j.s.ServletContextHandler@432c6917{/storage,null,UNAVAILABLE}
17/05/24 04:44:41 INFO handler.ContextHandler: Stopped o.s.j.s.ServletContextHandler@2e577a88{/stages/pool/json,null,UNAVAILABLE}
17/05/24 04:44:41 INFO handler.ContextHandler: Stopped o.s.j.s.ServletContextHandler@7c0bb55e{/stages/pool,null,UNAVAILABLE}
17/05/24 04:44:41 INFO handler.ContextHandler: Stopped o.s.j.s.ServletContextHandler@2817e5b2{/stages/stage/json,null,UNAVAILABLE}
17/05/24 04:44:41 INFO handler.ContextHandler: Stopped o.s.j.s.ServletContextHandler@4cd43845{/stages/stage,null,UNAVAILABLE}
17/05/24 04:44:41 INFO handler.ContextHandler: Stopped o.s.j.s.ServletContextHandler@6ba9689{/stages/json,null,UNAVAILABLE}
17/05/24 04:44:41 INFO handler.ContextHandler: Stopped o.s.j.s.ServletContextHandler@6ce715e3{/stages,null,UNAVAILABLE}
17/05/24 04:44:41 INFO handler.ContextHandler: Stopped o.s.j.s.ServletContextHandler@1c3f130e{/jobs/job/json,null,UNAVAILABLE}
17/05/24 04:44:41 INFO handler.ContextHandler: Stopped o.s.j.s.ServletContextHandler@4eb09281{/jobs/job,null,UNAVAILABLE}
17/05/24 04:44:41 INFO handler.ContextHandler: Stopped o.s.j.s.ServletContextHandler@20b941cf{/jobs/json,null,UNAVAILABLE}
17/05/24 04:44:41 INFO handler.ContextHandler: Stopped o.s.j.s.ServletContextHandler@64028557{/jobs,null,UNAVAILABLE}
17/05/24 04:44:41 INFO ui.SparkUI: Stopped Spark web UI at http://169.54.146.43:4040
17/05/24 04:44:41 INFO spark.MapOutputTrackerMasterEndpoint: MapOutputTrackerMasterEndpoint
stopped!
17/05/24 04:44:41 INFO memory.MemoryStore: MemoryStore cleared
17/05/24 04:44:41 INFO storage.BlockManager: BlockManager stopped
17/05/24 04:44:41 INFO storage.BlockManagerMaster: BlockManagerMaster stopped
17/05/24 04:44:41 INFO scheduler.OutputCommitCoordinator$OutputCommitCoordinatorEndpoint:
OutputCommitCoordinator stopped!
17/05/24 04:44:41 INFO spark.SparkContext: Successfully stopped SparkContext
Running org.apache.sysml.test.integration.scripts.nn.NNTest
Tests run: 1, Failures: 0, Errors: 0, Skipped: 0, Time elapsed: 767.201 sec - in org.apache.sysml.test.integration.scripts.nn.NNTest
17/05/24 04:44:41 INFO util.ShutdownHookManager: Shutdown hook called
17/05/24 04:44:41 INFO util.ShutdownHookManager: Deleting directory /tmp/spark-5347c6a8-383e-4c84-922a-55a152f94c42
Running org.apache.sysml.test.integration.applications.descriptivestats.UnivariateWeightedScaleDenseTest
Tests run: 24, Failures: 0, Errors: 0, Skipped: 0, Time elapsed: 412.049 sec - in org.apache.sysml.test.integration.applications.descriptivestats.UnivariateWeightedScaleDenseTest
Running org.apache.sysml.test.integration.applications.parfor.ParForNaiveBayesTest
Tests run: 10, Failures: 0, Errors: 0, Skipped: 0, Time elapsed: 591.284 sec - in org.apache.sysml.test.integration.applications.parfor.ParForNaiveBayesTest
Running org.apache.sysml.test.integration.functions.append.AppendChainTest
Tests run: 12, Failures: 0, Errors: 0, Skipped: 0, Time elapsed: 1,298.045 sec - in org.apache.sysml.test.integration.functions.append.AppendChainTest
Running org.apache.sysml.test.integration.applications.descriptivestats.UnivariateUnweightedScaleSparseTest
Tests run: 24, Failures: 0, Errors: 0, Skipped: 0, Time elapsed: 292.235 sec - in org.apache.sysml.test.integration.applications.descriptivestats.UnivariateUnweightedScaleSparseTest
Running org.apache.sysml.test.integration.applications.dml.HITSDMLTest
Tests run: 1, Failures: 0, Errors: 0, Skipped: 0, Time elapsed: 95.174 sec - in org.apache.sysml.test.integration.applications.dml.HITSDMLTest
Running org.apache.sysml.test.integration.applications.descriptivestats.UnivariateWeightedScaleSparseTest
Tests run: 24, Failures: 0, Errors: 0, Skipped: 0, Time elapsed: 332.302 sec - in org.apache.sysml.test.integration.applications.descriptivestats.UnivariateWeightedScaleSparseTest
Running org.apache.sysml.test.integration.functions.append.AppendMatrixTest
Tests run: 22, Failures: 0, Errors: 0, Skipped: 0, Time elapsed: 1,662.359 sec - in org.apache.sysml.test.integration.functions.append.AppendMatrixTest
Running org.apache.sysml.test.integration.applications.pydml.ArimaPyDMLTest
Tests run: 1, Failures: 0, Errors: 0, Skipped: 0, Time elapsed: 49.257 sec - in org.apache.sysml.test.integration.applications.pydml.ArimaPyDMLTest
Running org.apache.sysml.test.integration.applications.pydml.HITSPyDMLTest
Tests run: 1, Failures: 0, Errors: 0, Skipped: 0, Time elapsed: 76.907 sec - in org.apache.sysml.test.integration.applications.pydml.HITSPyDMLTest
Running org.apache.sysml.test.integration.applications.dml.LinearRegressionDMLTest
Tests run: 7, Failures: 0, Errors: 0, Skipped: 0, Time elapsed: 50.682 sec - in org.apache.sysml.test.integration.applications.dml.LinearRegressionDMLTest
Running org.apache.sysml.test.integration.applications.pydml.CsplineDSPyDMLTest
Tests run: 3, Failures: 0, Errors: 0, Skipped: 0, Time elapsed: 6.838 sec - in org.apache.sysml.test.integration.applications.pydml.CsplineDSPyDMLTest
Running org.apache.sysml.test.integration.applications.pydml.LinearLogRegPyDMLTest
Tests run: 7, Failures: 0, Errors: 0, Skipped: 0, Time elapsed: 81.046 sec - in org.apache.sysml.test.integration.applications.pydml.LinearLogRegPyDMLTest
Running org.apache.sysml.test.integration.applications.pydml.NaiveBayesPyDMLTest
Tests run: 6, Failures: 0, Errors: 0, Skipped: 0, Time elapsed: 80.991 sec - in org.apache.sysml.test.integration.applications.pydml.NaiveBayesPyDMLTest
Running org.apache.sysml.test.integration.applications.dml.CsplineCGDMLTest
Tests run: 3, Failures: 0, Errors: 0, Skipped: 0, Time elapsed: 19.122 sec - in org.apache.sysml.test.integration.applications.dml.CsplineCGDMLTest
Running org.apache.sysml.test.integration.applications.dml.L2SVMDMLTest
Tests run: 9, Failures: 0, Errors: 0, Skipped: 0, Time elapsed: 64.652 sec - in org.apache.sysml.test.integration.applications.dml.L2SVMDMLTest
Running org.apache.sysml.test.integration.applications.pydml.MDABivariateStatsPyDMLTest
Tests run: 4, Failures: 0, Errors: 0, Skipped: 0, Time elapsed: 291.807 sec - in org.apache.sysml.test.integration.applications.pydml.MDABivariateStatsPyDMLTest
Running org.apache.sysml.test.integration.applications.pydml.PageRankPyDMLTest
Tests run: 3, Failures: 0, Errors: 0, Skipped: 0, Time elapsed: 8.355 sec - in org.apache.sysml.test.integration.applications.pydml.PageRankPyDMLTest
Running org.apache.sysml.test.integration.applications.pydml.NaiveBayesParforPyDMLTest
Tests run: 6, Failures: 0, Errors: 0, Skipped: 0, Time elapsed: 81.244 sec - in org.apache.sysml.test.integration.applications.pydml.NaiveBayesParforPyDMLTest
Running org.apache.sysml.test.integration.applications.dml.NaiveBayesDMLTest
Tests run: 6, Failures: 0, Errors: 0, Skipped: 0, Time elapsed: 82.108 sec - in org.apache.sysml.test.integration.applications.dml.NaiveBayesDMLTest
Running org.apache.sysml.test.integration.applications.dml.MDABivariateStatsDMLTest
Tests run: 4, Failures: 0, Errors: 0, Skipped: 0, Time elapsed: 294.078 sec - in org.apache.sysml.test.integration.applications.dml.MDABivariateStatsDMLTest
Running org.apache.sysml.test.integration.applications.dml.PageRankDMLTest
Tests run: 3, Failures: 0, Errors: 0, Skipped: 0, Time elapsed: 8.221 sec - in org.apache.sysml.test.integration.applications.dml.PageRankDMLTest
Running org.apache.sysml.test.integration.applications.pydml.GLMPyDMLTest
Tests run: 30, Failures: 0, Errors: 0, Skipped: 0, Time elapsed: 587.958 sec - in org.apache.sysml.test.integration.applications.pydml.GLMPyDMLTest
Running org.apache.sysml.test.integration.applications.pydml.MultiClassSVMPyDMLTest
Tests run: 9, Failures: 0, Errors: 0, Skipped: 0, Time elapsed: 90.254 sec - in org.apache.sysml.test.integration.applications.pydml.MultiClassSVMPyDMLTest
Running org.apache.sysml.test.integration.applications.dml.ID3DMLTest
Tests run: 2, Failures: 0, Errors: 0, Skipped: 0, Time elapsed: 382.979 sec - in org.apache.sysml.test.integration.applications.dml.ID3DMLTest
Running org.apache.sysml.test.integration.applications.dml.GLMDMLTest
Tests run: 30, Failures: 0, Errors: 0, Skipped: 0, Time elapsed: 1,075.246 sec - in org.apache.sysml.test.integration.applications.dml.GLMDMLTest
Running org.apache.sysml.test.integration.applications.pydml.CsplineCGPyDMLTest
Tests run: 3, Failures: 0, Errors: 0, Skipped: 0, Time elapsed: 5.964 sec - in org.apache.sysml.test.integration.applications.pydml.CsplineCGPyDMLTest
Running org.apache.sysml.test.integration.applications.pydml.WelchTPyDMLTest
Tests run: 3, Failures: 0, Errors: 0, Skipped: 0, Time elapsed: 6.385 sec - in org.apache.sysml.test.integration.applications.pydml.WelchTPyDMLTest
Running org.apache.sysml.test.integration.applications.dml.MultiClassSVMDMLTest
Tests run: 9, Failures: 0, Errors: 0, Skipped: 0, Time elapsed: 89.553 sec - in org.apache.sysml.test.integration.applications.dml.MultiClassSVMDMLTest
Running org.apache.sysml.test.integration.applications.dml.CsplineDSDMLTest
Tests run: 3, Failures: 0, Errors: 0, Skipped: 0, Time elapsed: 18.634 sec - in org.apache.sysml.test.integration.applications.dml.CsplineDSDMLTest
Running org.apache.sysml.test.integration.applications.pydml.ApplyTransformPyDMLTest
Tests run: 7, Failures: 0, Errors: 0, Skipped: 0, Time elapsed: 0.88 sec - in org.apache.sysml.test.integration.applications.pydml.ApplyTransformPyDMLTest
Running org.apache.sysml.test.integration.applications.dml.NaiveBayesParforDMLTest
Tests run: 6, Failures: 0, Errors: 0, Skipped: 0, Time elapsed: 81.86 sec - in org.apache.sysml.test.integration.applications.dml.NaiveBayesParforDMLTest
Running org.apache.sysml.test.integration.applications.pydml.L2SVMPyDMLTest
Tests run: 9, Failures: 0, Errors: 0, Skipped: 0, Time elapsed: 63.259 sec - in org.apache.sysml.test.integration.applications.pydml.L2SVMPyDMLTest
Running org.apache.sysml.test.integration.applications.pydml.LinearRegressionPyDMLTest
Tests run: 7, Failures: 0, Errors: 0, Skipped: 0, Time elapsed: 51.157 sec - in org.apache.sysml.test.integration.applications.pydml.LinearRegressionPyDMLTest
Running org.apache.sysml.test.integration.applications.dml.LinearLogRegDMLTest
Tests run: 7, Failures: 0, Errors: 0, Skipped: 0, Time elapsed: 60.728 sec - in org.apache.sysml.test.integration.applications.dml.LinearLogRegDMLTest
Running org.apache.sysml.test.integration.applications.dml.GNMFDMLTest
Tests run: 3, Failures: 0, Errors: 0, Skipped: 0, Time elapsed: 73.151 sec - in org.apache.sysml.test.integration.applications.dml.GNMFDMLTest
Running org.apache.sysml.test.integration.applications.dml.WelchTDMLTest
Tests run: 3, Failures: 0, Errors: 0, Skipped: 0, Time elapsed: 6.36 sec - in org.apache.sysml.test.integration.applications.dml.WelchTDMLTest
Running org.apache.sysml.test.integration.applications.dml.ApplyTransformDMLTest
Tests run: 7, Failures: 0, Errors: 0, Skipped: 0, Time elapsed: 18.041 sec - in org.apache.sysml.test.integration.applications.dml.ApplyTransformDMLTest
Running org.apache.sysml.test.integration.applications.pydml.ID3PyDMLTest
Tests run: 2, Failures: 0, Errors: 0, Skipped: 0, Time elapsed: 384.458 sec - in org.apache.sysml.test.integration.applications.pydml.ID3PyDMLTest
Running org.apache.sysml.test.integration.applications.pydml.GNMFPyDMLTest
Tests run: 3, Failures: 0, Errors: 0, Skipped: 0, Time elapsed: 55.163 sec - in org.apache.sysml.test.integration.applications.pydml.GNMFPyDMLTest

Results :

Failed tests: 
  LogarithmTest.testConstConst:87->AutomatedTestBase.compareResults:1374 for file target/testTemp/functions/binary/scalar/LogarithmTest/out/int_int
2 values are not equal
  LogarithmTest.testVarConst:130->AutomatedTestBase.compareResults:1374 for file target/testTemp/functions/binary/scalar/LogarithmTest/out/int_int
2 values are not equal
  LogarithmTest.testConstVar:173->AutomatedTestBase.compareResults:1374 for file target/testTemp/functions/binary/scalar/LogarithmTest/out/int_int
2 values are not equal
  LogarithmTest.testVarVar:220->AutomatedTestBase.compareResults:1374 for file target/testTemp/functions/binary/scalar/LogarithmTest/out/int_int
2 values are not equal

Tests run: 6967, Failures: 4, Errors: 0, Skipped: 0

[INFO] 
[INFO] --- maven-failsafe-plugin:2.17:verify (default) @ systemml ---
[INFO] Failsafe report directory: <https://sparktc.ibmcloud.com/jenkins/job/SystemML-DailyTest/ws/target/failsafe-reports>
[INFO] ------------------------------------------------------------------------
[INFO] BUILD FAILURE
[INFO] ------------------------------------------------------------------------
[INFO] Total time: 03:08 h
[INFO] Finished at: 2017-05-24T05:44:17-05:00
[INFO] Final Memory: 63M/2549M
[INFO] ------------------------------------------------------------------------
[ERROR] Failed to execute goal org.apache.maven.plugins:maven-failsafe-plugin:2.17:verify
(default) on project systemml: There are test failures.
[ERROR] 
[ERROR] Please refer to <https://sparktc.ibmcloud.com/jenkins/job/SystemML-DailyTest/ws/target/failsafe-reports>
for the individual test results.
[ERROR] -> [Help 1]
[ERROR] 
[ERROR] To see the full stack trace of the errors, re-run Maven with the -e switch.
[ERROR] Re-run Maven using the -X switch to enable full debug logging.
[ERROR] 
[ERROR] For more information about the errors and possible solutions, please read the following
articles:
[ERROR] [Help 1] http://cwiki.apache.org/confluence/display/MAVEN/MojoFailureException
Build step 'Execute shell' marked build as failure
Run condition [Always] enabling perform for step [[]]

Mime
View raw message