systemml-dev mailing list archives

Site index · List index
Message view « Date » · « Thread »
Top « Date » · « Thread »
From jenk...@spark.tc
Subject Build failed in Jenkins: SystemML-DailyTest #965
Date Tue, 02 May 2017 22:02:12 GMT
See <https://sparktc.ibmcloud.com/jenkins/job/SystemML-DailyTest/965/changes>

Changes:

[npansar] [HOTFIX] Allows multiple MLContext to set the configuration property

------------------------------------------
[...truncated 28823 lines...]
17/05/02 16:00:39 INFO scheduler.DAGScheduler: failed: Set()
17/05/02 16:00:39 INFO executor.Executor: Finished task 0.0 in stage 4.0 (TID 4). 1253 bytes
result sent to driver
17/05/02 16:00:39 INFO scheduler.TaskSetManager: Finished task 0.0 in stage 4.0 (TID 4) in
16 ms on localhost (executor driver) (1/1)
17/05/02 16:00:39 INFO scheduler.TaskSchedulerImpl: Removed TaskSet 4.0, whose tasks have
all completed, from pool default
17/05/02 16:00:39 INFO scheduler.DAGScheduler: ShuffleMapStage 4 (parallelizePairs at SparkExecutionContext.java:706)
finished in 0.010 s
17/05/02 16:00:39 INFO scheduler.DAGScheduler: looking for newly runnable stages
17/05/02 16:00:39 INFO scheduler.DAGScheduler: running: Set()
17/05/02 16:00:39 INFO scheduler.DAGScheduler: waiting: Set(ResultStage 5)
17/05/02 16:00:39 INFO scheduler.DAGScheduler: failed: Set()
17/05/02 16:00:39 INFO scheduler.DAGScheduler: Submitting ResultStage 5 (MapPartitionsRDD[11]
at mapValues at BinarySPInstruction.java:117), which has no missing parents
17/05/02 16:00:39 INFO memory.MemoryStore: Block broadcast_5 stored as values in memory (estimated
size 4.2 KB, free 1033.8 MB)
17/05/02 16:00:39 INFO memory.MemoryStore: Block broadcast_5_piece0 stored as bytes in memory
(estimated size 2.3 KB, free 1033.8 MB)
17/05/02 16:00:39 INFO storage.BlockManagerInfo: Added broadcast_5_piece0 in memory on 169.54.146.43:42229
(size: 2.3 KB, free: 1033.8 MB)
17/05/02 16:00:39 INFO spark.SparkContext: Created broadcast 5 from broadcast at DAGScheduler.scala:996
17/05/02 16:00:39 INFO scheduler.DAGScheduler: Submitting 1 missing tasks from ResultStage
5 (MapPartitionsRDD[11] at mapValues at BinarySPInstruction.java:117)
17/05/02 16:00:39 INFO scheduler.TaskSchedulerImpl: Adding task set 5.0 with 1 tasks
17/05/02 16:00:39 INFO scheduler.FairSchedulableBuilder: Added task set TaskSet_5.0 tasks
to pool default
17/05/02 16:00:39 INFO scheduler.TaskSetManager: Starting task 0.0 in stage 5.0 (TID 5, localhost,
executor driver, partition 0, PROCESS_LOCAL, 5814 bytes)
17/05/02 16:00:39 INFO executor.Executor: Running task 0.0 in stage 5.0 (TID 5)
17/05/02 16:00:39 INFO storage.ShuffleBlockFetcherIterator: Getting 1 non-empty blocks out
of 1 blocks
17/05/02 16:00:39 INFO storage.ShuffleBlockFetcherIterator: Started 0 remote fetches in 0
ms
17/05/02 16:00:39 INFO storage.ShuffleBlockFetcherIterator: Getting 1 non-empty blocks out
of 1 blocks
17/05/02 16:00:39 INFO storage.ShuffleBlockFetcherIterator: Started 0 remote fetches in 0
ms
17/05/02 16:00:39 INFO executor.Executor: Finished task 0.0 in stage 5.0 (TID 5). 2240 bytes
result sent to driver
17/05/02 16:00:39 INFO scheduler.TaskSetManager: Finished task 0.0 in stage 5.0 (TID 5) in
15 ms on localhost (executor driver) (1/1)
17/05/02 16:00:39 INFO scheduler.TaskSchedulerImpl: Removed TaskSet 5.0, whose tasks have
all completed, from pool default
17/05/02 16:00:39 INFO scheduler.DAGScheduler: ResultStage 5 (collect at SparkExecutionContext.java:796)
finished in 0.015 s
17/05/02 16:00:40 INFO storage.BlockManagerInfo: Removed broadcast_5_piece0 on 169.54.146.43:42229
in memory (size: 2.3 KB, free: 1033.8 MB)
17/05/02 16:00:40 INFO storage.BlockManagerInfo: Removed broadcast_4_piece0 on 169.54.146.43:42229
in memory (size: 1305.0 B, free: 1033.8 MB)
17/05/02 16:00:40 INFO storage.BlockManagerInfo: Removed broadcast_3_piece0 on 169.54.146.43:42229
in memory (size: 1305.0 B, free: 1033.8 MB)
17/05/02 16:00:40 INFO spark.ContextCleaner: Cleaned shuffle 2
17/05/02 16:00:40 INFO spark.ContextCleaner: Cleaned shuffle 3
17/05/02 16:02:37 INFO server.ServerConnector: Stopped ServerConnector@43f94b1b{HTTP/1.1}{0.0.0.0:4040}
17/05/02 16:02:37 INFO handler.ContextHandler: Stopped o.s.j.s.ServletContextHandler@3bad72e0{/stages/stage/kill,null,UNAVAILABLE}
17/05/02 16:02:37 INFO handler.ContextHandler: Stopped o.s.j.s.ServletContextHandler@34c35596{/jobs/job/kill,null,UNAVAILABLE}
17/05/02 16:02:37 INFO handler.ContextHandler: Stopped o.s.j.s.ServletContextHandler@7ef4115d{/api,null,UNAVAILABLE}
17/05/02 16:02:37 INFO handler.ContextHandler: Stopped o.s.j.s.ServletContextHandler@58e38fc9{/,null,UNAVAILABLE}
17/05/02 16:02:37 INFO handler.ContextHandler: Stopped o.s.j.s.ServletContextHandler@2ee430ae{/static,null,UNAVAILABLE}
17/05/02 16:02:37 INFO handler.ContextHandler: Stopped o.s.j.s.ServletContextHandler@2b0c2e23{/executors/threadDump/json,null,UNAVAILABLE}
17/05/02 16:02:37 INFO handler.ContextHandler: Stopped o.s.j.s.ServletContextHandler@14d4bc{/executors/threadDump,null,UNAVAILABLE}
17/05/02 16:02:37 INFO handler.ContextHandler: Stopped o.s.j.s.ServletContextHandler@aecbf0{/executors/json,null,UNAVAILABLE}
17/05/02 16:02:37 INFO handler.ContextHandler: Stopped o.s.j.s.ServletContextHandler@6cdd261a{/executors,null,UNAVAILABLE}
17/05/02 16:02:37 INFO handler.ContextHandler: Stopped o.s.j.s.ServletContextHandler@60796954{/environment/json,null,UNAVAILABLE}
17/05/02 16:02:37 INFO handler.ContextHandler: Stopped o.s.j.s.ServletContextHandler@a91556c{/environment,null,UNAVAILABLE}
17/05/02 16:02:37 INFO handler.ContextHandler: Stopped o.s.j.s.ServletContextHandler@74e31f9e{/storage/rdd/json,null,UNAVAILABLE}
17/05/02 16:02:37 INFO handler.ContextHandler: Stopped o.s.j.s.ServletContextHandler@25f52bba{/storage/rdd,null,UNAVAILABLE}
17/05/02 16:02:37 INFO handler.ContextHandler: Stopped o.s.j.s.ServletContextHandler@2eb89755{/storage/json,null,UNAVAILABLE}
17/05/02 16:02:37 INFO handler.ContextHandler: Stopped o.s.j.s.ServletContextHandler@15cd7826{/storage,null,UNAVAILABLE}
17/05/02 16:02:37 INFO handler.ContextHandler: Stopped o.s.j.s.ServletContextHandler@31bc0f7d{/stages/pool/json,null,UNAVAILABLE}
17/05/02 16:02:37 INFO handler.ContextHandler: Stopped o.s.j.s.ServletContextHandler@69fc4747{/stages/pool,null,UNAVAILABLE}
17/05/02 16:02:37 INFO handler.ContextHandler: Stopped o.s.j.s.ServletContextHandler@1415eb69{/stages/stage/json,null,UNAVAILABLE}
17/05/02 16:02:37 INFO handler.ContextHandler: Stopped o.s.j.s.ServletContextHandler@1f776448{/stages/stage,null,UNAVAILABLE}
17/05/02 16:02:37 INFO handler.ContextHandler: Stopped o.s.j.s.ServletContextHandler@4cf29d58{/stages/json,null,UNAVAILABLE}
17/05/02 16:02:37 INFO handler.ContextHandler: Stopped o.s.j.s.ServletContextHandler@59c49a06{/stages,null,UNAVAILABLE}
17/05/02 16:02:37 INFO handler.ContextHandler: Stopped o.s.j.s.ServletContextHandler@a40253a{/jobs/job/json,null,UNAVAILABLE}
17/05/02 16:02:37 INFO handler.ContextHandler: Stopped o.s.j.s.ServletContextHandler@4c63f6b8{/jobs/job,null,UNAVAILABLE}
17/05/02 16:02:37 INFO handler.ContextHandler: Stopped o.s.j.s.ServletContextHandler@5a99f759{/jobs/json,null,UNAVAILABLE}
17/05/02 16:02:37 INFO handler.ContextHandler: Stopped o.s.j.s.ServletContextHandler@b5b019d{/jobs,null,UNAVAILABLE}
17/05/02 16:02:37 INFO ui.SparkUI: Stopped Spark web UI at http://169.54.146.43:4040
17/05/02 16:02:37 INFO spark.MapOutputTrackerMasterEndpoint: MapOutputTrackerMasterEndpoint
stopped!
17/05/02 16:02:37 INFO memory.MemoryStore: MemoryStore cleared
17/05/02 16:02:37 INFO storage.BlockManager: BlockManager stopped
17/05/02 16:02:37 INFO storage.BlockManagerMaster: BlockManagerMaster stopped
17/05/02 16:02:37 INFO scheduler.OutputCommitCoordinator$OutputCommitCoordinatorEndpoint:
OutputCommitCoordinator stopped!
17/05/02 16:02:37 INFO spark.SparkContext: Successfully stopped SparkContext
Running org.apache.sysml.test.integration.scripts.nn.NNTest
Tests run: 1, Failures: 0, Errors: 0, Skipped: 0, Time elapsed: 538.815 sec - in org.apache.sysml.test.integration.scripts.nn.NNTest
17/05/02 16:02:37 INFO util.ShutdownHookManager: Shutdown hook called
17/05/02 16:02:37 INFO util.ShutdownHookManager: Deleting directory /tmp/spark-616290ad-e14b-407d-80e8-c8da038022cc
Running org.apache.sysml.test.integration.functions.quaternary.WeightedDivMatrixMultTest
Tests run: 90, Failures: 0, Errors: 0, Skipped: 0, Time elapsed: 1,512.218 sec - in org.apache.sysml.test.integration.functions.quaternary.WeightedDivMatrixMultTest
17/05/02 16:02:59 INFO util.ShutdownHookManager: Shutdown hook called
17/05/02 16:02:59 INFO util.ShutdownHookManager: Deleting directory /tmp/spark-ce97a310-2cd2-431a-b370-0f5da376903f
Running org.apache.sysml.test.integration.applications.descriptivestats.UnivariateWeightedScaleDenseTest
Tests run: 24, Failures: 0, Errors: 0, Skipped: 0, Time elapsed: 356.687 sec - in org.apache.sysml.test.integration.applications.descriptivestats.UnivariateWeightedScaleDenseTest
Running org.apache.sysml.test.integration.applications.parfor.ParForNaiveBayesTest
Tests run: 10, Failures: 0, Errors: 0, Skipped: 0, Time elapsed: 519.758 sec - in org.apache.sysml.test.integration.applications.parfor.ParForNaiveBayesTest
Running org.apache.sysml.test.integration.functions.append.AppendChainTest
Tests run: 12, Failures: 0, Errors: 0, Skipped: 0, Time elapsed: 1,034.78 sec - in org.apache.sysml.test.integration.functions.append.AppendChainTest
Running org.apache.sysml.test.integration.applications.descriptivestats.UnivariateUnweightedScaleSparseTest
Tests run: 24, Failures: 0, Errors: 0, Skipped: 0, Time elapsed: 290.92 sec - in org.apache.sysml.test.integration.applications.descriptivestats.UnivariateUnweightedScaleSparseTest
Running org.apache.sysml.test.integration.applications.dml.HITSDMLTest
Tests run: 1, Failures: 0, Errors: 0, Skipped: 0, Time elapsed: 88.177 sec - in org.apache.sysml.test.integration.applications.dml.HITSDMLTest
Running org.apache.sysml.test.integration.functions.append.AppendMatrixTest
Tests run: 22, Failures: 0, Errors: 0, Skipped: 0, Time elapsed: 1,211.459 sec - in org.apache.sysml.test.integration.functions.append.AppendMatrixTest
Running org.apache.sysml.test.integration.applications.descriptivestats.UnivariateWeightedScaleSparseTest
Tests run: 24, Failures: 0, Errors: 0, Skipped: 0, Time elapsed: 357.484 sec - in org.apache.sysml.test.integration.applications.descriptivestats.UnivariateWeightedScaleSparseTest
Running org.apache.sysml.test.integration.applications.pydml.ArimaPyDMLTest
Tests run: 1, Failures: 0, Errors: 0, Skipped: 0, Time elapsed: 49.001 sec - in org.apache.sysml.test.integration.applications.pydml.ArimaPyDMLTest
Running org.apache.sysml.test.integration.applications.pydml.HITSPyDMLTest
Tests run: 1, Failures: 0, Errors: 0, Skipped: 0, Time elapsed: 78.226 sec - in org.apache.sysml.test.integration.applications.pydml.HITSPyDMLTest
Running org.apache.sysml.test.integration.applications.dml.LinearRegressionDMLTest
Tests run: 7, Failures: 0, Errors: 0, Skipped: 0, Time elapsed: 50.667 sec - in org.apache.sysml.test.integration.applications.dml.LinearRegressionDMLTest
Running org.apache.sysml.test.integration.applications.pydml.CsplineDSPyDMLTest
Tests run: 3, Failures: 0, Errors: 0, Skipped: 0, Time elapsed: 6.762 sec - in org.apache.sysml.test.integration.applications.pydml.CsplineDSPyDMLTest
Running org.apache.sysml.test.integration.applications.pydml.LinearLogRegPyDMLTest
Tests run: 7, Failures: 1, Errors: 0, Skipped: 0, Time elapsed: 86.122 sec <<< FAILURE!
- in org.apache.sysml.test.integration.applications.pydml.LinearLogRegPyDMLTest
testLinearLogRegPyDml[3](org.apache.sysml.test.integration.applications.pydml.LinearLogRegPyDMLTest)
 Time elapsed: 38.85 sec  <<< FAILURE!
java.lang.AssertionError: Detailed matrices characteristics:
!  wR<->wSYSTEMML # stored values in wSYSTEMML: 1000
!  wR<->wSYSTEMML # stored values in wR: 1000
!  wR<->wSYSTEMML identical values(z=0): 0
!  wR<->wSYSTEMML wrong values(z=1.0E-14): 1000
!  wR<->wSYSTEMML min error: 8.5835158425418E-12
!  wR<->wSYSTEMML max error: 8.322413894557013E-5

	at org.junit.Assert.fail(Assert.java:88)
	at org.junit.Assert.assertTrue(Assert.java:41)
	at org.apache.sysml.test.utils.TestUtils.displayAssertionBuffer(TestUtils.java:974)
	at org.apache.sysml.test.integration.AutomatedTestBase.tearDown(AutomatedTestBase.java:1475)
	at sun.reflect.GeneratedMethodAccessor3.invoke(Unknown Source)
	at sun.reflect.DelegatingMethodAccessorImpl.invoke(DelegatingMethodAccessorImpl.java:43)
	at java.lang.reflect.Method.invoke(Method.java:497)
	at org.junit.runners.model.FrameworkMethod$1.runReflectiveCall(FrameworkMethod.java:47)
	at org.junit.internal.runners.model.ReflectiveCallable.run(ReflectiveCallable.java:12)
	at org.junit.runners.model.FrameworkMethod.invokeExplosively(FrameworkMethod.java:44)
	at org.junit.internal.runners.statements.RunAfters.evaluate(RunAfters.java:33)
	at org.junit.runners.ParentRunner.runLeaf(ParentRunner.java:271)
	at org.junit.runners.BlockJUnit4ClassRunner.runChild(BlockJUnit4ClassRunner.java:70)
	at org.junit.runners.BlockJUnit4ClassRunner.runChild(BlockJUnit4ClassRunner.java:50)
	at org.junit.runners.ParentRunner$3.run(ParentRunner.java:238)
	at org.apache.maven.surefire.junitcore.pc.Scheduler$1.run(Scheduler.java:318)
	at org.apache.maven.surefire.junitcore.pc.InvokerStrategy.schedule(InvokerStrategy.java:41)
	at org.apache.maven.surefire.junitcore.pc.Scheduler.schedule(Scheduler.java:274)
	at org.junit.runners.ParentRunner.runChildren(ParentRunner.java:236)
	at org.junit.runners.ParentRunner.access$000(ParentRunner.java:53)
	at org.junit.runners.ParentRunner$2.evaluate(ParentRunner.java:229)
	at org.junit.runners.ParentRunner.run(ParentRunner.java:309)
	at org.junit.runners.Suite.runChild(Suite.java:127)
	at org.junit.runners.Suite.runChild(Suite.java:26)
	at org.junit.runners.ParentRunner$3.run(ParentRunner.java:238)
	at org.apache.maven.surefire.junitcore.pc.Scheduler$1.run(Scheduler.java:318)
	at org.apache.maven.surefire.junitcore.pc.InvokerStrategy.schedule(InvokerStrategy.java:41)
	at org.apache.maven.surefire.junitcore.pc.Scheduler.schedule(Scheduler.java:274)
	at org.junit.runners.ParentRunner.runChildren(ParentRunner.java:236)
	at org.junit.runners.ParentRunner.access$000(ParentRunner.java:53)
	at org.junit.runners.ParentRunner$2.evaluate(ParentRunner.java:229)
	at org.junit.runners.ParentRunner.run(ParentRunner.java:309)
	at org.junit.runners.Suite.runChild(Suite.java:127)
	at org.junit.runners.Suite.runChild(Suite.java:26)
	at org.junit.runners.ParentRunner$3.run(ParentRunner.java:238)
	at org.apache.maven.surefire.junitcore.pc.Scheduler$1.run(Scheduler.java:318)
	at org.apache.maven.surefire.junitcore.pc.InvokerStrategy.schedule(InvokerStrategy.java:41)
	at org.apache.maven.surefire.junitcore.pc.Scheduler.schedule(Scheduler.java:274)
	at org.junit.runners.ParentRunner.runChildren(ParentRunner.java:236)
	at org.junit.runners.ParentRunner.access$000(ParentRunner.java:53)
	at org.junit.runners.ParentRunner$2.evaluate(ParentRunner.java:229)
	at org.junit.runners.ParentRunner.run(ParentRunner.java:309)
	at org.junit.runners.Suite.runChild(Suite.java:127)
	at org.junit.runners.Suite.runChild(Suite.java:26)
	at org.junit.runners.ParentRunner$3.run(ParentRunner.java:238)
	at org.apache.maven.surefire.junitcore.pc.Scheduler$1.run(Scheduler.java:318)
	at java.util.concurrent.Executors$RunnableAdapter.call(Executors.java:511)
	at java.util.concurrent.FutureTask.run(FutureTask.java:266)
	at java.util.concurrent.ThreadPoolExecutor.runWorker(ThreadPoolExecutor.java:1142)
	at java.util.concurrent.ThreadPoolExecutor$Worker.run(ThreadPoolExecutor.java:617)
	at java.lang.Thread.run(Thread.java:745)

Running org.apache.sysml.test.integration.applications.pydml.NaiveBayesPyDMLTest
Tests run: 6, Failures: 0, Errors: 0, Skipped: 0, Time elapsed: 81.163 sec - in org.apache.sysml.test.integration.applications.pydml.NaiveBayesPyDMLTest
Running org.apache.sysml.test.integration.applications.dml.CsplineCGDMLTest
Tests run: 3, Failures: 0, Errors: 0, Skipped: 0, Time elapsed: 14.737 sec - in org.apache.sysml.test.integration.applications.dml.CsplineCGDMLTest
Running org.apache.sysml.test.integration.applications.dml.L2SVMDMLTest
Tests run: 9, Failures: 0, Errors: 0, Skipped: 0, Time elapsed: 63.559 sec - in org.apache.sysml.test.integration.applications.dml.L2SVMDMLTest
Running org.apache.sysml.test.integration.applications.pydml.MDABivariateStatsPyDMLTest
Tests run: 4, Failures: 0, Errors: 0, Skipped: 0, Time elapsed: 294.675 sec - in org.apache.sysml.test.integration.applications.pydml.MDABivariateStatsPyDMLTest
Running org.apache.sysml.test.integration.applications.pydml.PageRankPyDMLTest
Tests run: 3, Failures: 0, Errors: 0, Skipped: 0, Time elapsed: 8.47 sec - in org.apache.sysml.test.integration.applications.pydml.PageRankPyDMLTest
Running org.apache.sysml.test.integration.applications.pydml.NaiveBayesParforPyDMLTest
Tests run: 6, Failures: 0, Errors: 0, Skipped: 0, Time elapsed: 80.772 sec - in org.apache.sysml.test.integration.applications.pydml.NaiveBayesParforPyDMLTest
Running org.apache.sysml.test.integration.applications.dml.NaiveBayesDMLTest
Tests run: 6, Failures: 0, Errors: 0, Skipped: 0, Time elapsed: 81.023 sec - in org.apache.sysml.test.integration.applications.dml.NaiveBayesDMLTest
Running org.apache.sysml.test.integration.applications.dml.MDABivariateStatsDMLTest
Tests run: 4, Failures: 0, Errors: 0, Skipped: 0, Time elapsed: 296.219 sec - in org.apache.sysml.test.integration.applications.dml.MDABivariateStatsDMLTest
Running org.apache.sysml.test.integration.applications.dml.PageRankDMLTest
Tests run: 3, Failures: 0, Errors: 0, Skipped: 0, Time elapsed: 8.456 sec - in org.apache.sysml.test.integration.applications.dml.PageRankDMLTest
Running org.apache.sysml.test.integration.applications.pydml.GLMPyDMLTest
Tests run: 30, Failures: 0, Errors: 0, Skipped: 0, Time elapsed: 588.795 sec - in org.apache.sysml.test.integration.applications.pydml.GLMPyDMLTest
Running org.apache.sysml.test.integration.applications.pydml.MultiClassSVMPyDMLTest
Tests run: 9, Failures: 0, Errors: 0, Skipped: 0, Time elapsed: 88.173 sec - in org.apache.sysml.test.integration.applications.pydml.MultiClassSVMPyDMLTest
Running org.apache.sysml.test.integration.applications.dml.ID3DMLTest
Tests run: 2, Failures: 0, Errors: 0, Skipped: 0, Time elapsed: 389.11 sec - in org.apache.sysml.test.integration.applications.dml.ID3DMLTest
Running org.apache.sysml.test.integration.applications.dml.GLMDMLTest
Tests run: 30, Failures: 0, Errors: 0, Skipped: 0, Time elapsed: 867.343 sec - in org.apache.sysml.test.integration.applications.dml.GLMDMLTest
Running org.apache.sysml.test.integration.applications.pydml.CsplineCGPyDMLTest
Tests run: 3, Failures: 0, Errors: 0, Skipped: 0, Time elapsed: 6.131 sec - in org.apache.sysml.test.integration.applications.pydml.CsplineCGPyDMLTest
Running org.apache.sysml.test.integration.applications.pydml.WelchTPyDMLTest
Tests run: 3, Failures: 0, Errors: 0, Skipped: 0, Time elapsed: 6.406 sec - in org.apache.sysml.test.integration.applications.pydml.WelchTPyDMLTest
Running org.apache.sysml.test.integration.applications.dml.MultiClassSVMDMLTest
Tests run: 9, Failures: 0, Errors: 0, Skipped: 0, Time elapsed: 87.585 sec - in org.apache.sysml.test.integration.applications.dml.MultiClassSVMDMLTest
Running org.apache.sysml.test.integration.applications.dml.CsplineDSDMLTest
Tests run: 3, Failures: 0, Errors: 0, Skipped: 0, Time elapsed: 15.732 sec - in org.apache.sysml.test.integration.applications.dml.CsplineDSDMLTest
Running org.apache.sysml.test.integration.applications.pydml.ApplyTransformPyDMLTest
Tests run: 7, Failures: 0, Errors: 0, Skipped: 0, Time elapsed: 0.844 sec - in org.apache.sysml.test.integration.applications.pydml.ApplyTransformPyDMLTest
Running org.apache.sysml.test.integration.applications.dml.NaiveBayesParforDMLTest
Tests run: 6, Failures: 0, Errors: 0, Skipped: 0, Time elapsed: 81.386 sec - in org.apache.sysml.test.integration.applications.dml.NaiveBayesParforDMLTest
Running org.apache.sysml.test.integration.applications.pydml.L2SVMPyDMLTest
Tests run: 9, Failures: 0, Errors: 0, Skipped: 0, Time elapsed: 63.716 sec - in org.apache.sysml.test.integration.applications.pydml.L2SVMPyDMLTest
Running org.apache.sysml.test.integration.applications.pydml.LinearRegressionPyDMLTest
Tests run: 7, Failures: 0, Errors: 0, Skipped: 0, Time elapsed: 50.84 sec - in org.apache.sysml.test.integration.applications.pydml.LinearRegressionPyDMLTest
Running org.apache.sysml.test.integration.applications.dml.LinearLogRegDMLTest
Tests run: 7, Failures: 0, Errors: 0, Skipped: 0, Time elapsed: 60.249 sec - in org.apache.sysml.test.integration.applications.dml.LinearLogRegDMLTest
Running org.apache.sysml.test.integration.applications.dml.GNMFDMLTest
Tests run: 3, Failures: 0, Errors: 0, Skipped: 0, Time elapsed: 61.953 sec - in org.apache.sysml.test.integration.applications.dml.GNMFDMLTest
Running org.apache.sysml.test.integration.applications.dml.WelchTDMLTest
Tests run: 3, Failures: 0, Errors: 0, Skipped: 0, Time elapsed: 6.427 sec - in org.apache.sysml.test.integration.applications.dml.WelchTDMLTest
Running org.apache.sysml.test.integration.applications.dml.ApplyTransformDMLTest
Tests run: 7, Failures: 0, Errors: 0, Skipped: 0, Time elapsed: 12.727 sec - in org.apache.sysml.test.integration.applications.dml.ApplyTransformDMLTest
Running org.apache.sysml.test.integration.applications.pydml.ID3PyDMLTest
Tests run: 2, Failures: 0, Errors: 0, Skipped: 0, Time elapsed: 380.703 sec - in org.apache.sysml.test.integration.applications.pydml.ID3PyDMLTest
Running org.apache.sysml.test.integration.applications.pydml.GNMFPyDMLTest
Tests run: 3, Failures: 0, Errors: 0, Skipped: 0, Time elapsed: 55.666 sec - in org.apache.sysml.test.integration.applications.pydml.GNMFPyDMLTest

Results :

Failed tests: 
  LinearLogRegPyDMLTest>AutomatedTestBase.tearDown:1475 Detailed matrices characteristics:
!  wR<->wSYSTEMML # stored values in wSYSTEMML: 1000
!  wR<->wSYSTEMML # stored values in wR: 1000
!  wR<->wSYSTEMML identical values(z=0): 0
!  wR<->wSYSTEMML wrong values(z=1.0E-14): 1000
!  wR<->wSYSTEMML min error: 8.5835158425418E-12
!  wR<->wSYSTEMML max error: 8.322413894557013E-5


Tests run: 6940, Failures: 1, Errors: 0, Skipped: 0

[INFO] 
[INFO] --- maven-failsafe-plugin:2.17:verify (default) @ systemml ---
[INFO] Failsafe report directory: <https://sparktc.ibmcloud.com/jenkins/job/SystemML-DailyTest/ws/target/failsafe-reports>
[INFO] ------------------------------------------------------------------------
[INFO] BUILD FAILURE
[INFO] ------------------------------------------------------------------------
[INFO] Total time: 02:25 h
[INFO] Finished at: 2017-05-02T17:02:11-05:00
[INFO] Final Memory: 64M/2290M
[INFO] ------------------------------------------------------------------------
[ERROR] Failed to execute goal org.apache.maven.plugins:maven-failsafe-plugin:2.17:verify
(default) on project systemml: There are test failures.
[ERROR] 
[ERROR] Please refer to <https://sparktc.ibmcloud.com/jenkins/job/SystemML-DailyTest/ws/target/failsafe-reports>
for the individual test results.
[ERROR] -> [Help 1]
[ERROR] 
[ERROR] To see the full stack trace of the errors, re-run Maven with the -e switch.
[ERROR] Re-run Maven using the -X switch to enable full debug logging.
[ERROR] 
[ERROR] For more information about the errors and possible solutions, please read the following
articles:
[ERROR] [Help 1] http://cwiki.apache.org/confluence/display/MAVEN/MojoFailureException
Build step 'Execute shell' marked build as failure
Run condition [Always] enabling perform for step [[]]

Mime
View raw message