systemml-dev mailing list archives

Site index · List index
Message view « Date » · « Thread »
Top « Date » · « Thread »
From jenk...@spark.tc
Subject Build failed in Jenkins: SystemML-DailyTest #944
Date Sat, 22 Apr 2017 07:32:25 GMT
See <https://sparktc.ibmcloud.com/jenkins/job/SystemML-DailyTest/944/changes>

Changes:

[Nakul Jindal] Added python script to launch systemml in standalone mode

[Nakul Jindal] Use Apache Commons CLI to parse command line arguments in DMLScript

[npansar] [SYSTEMML-1552] Support GPU via Python MLContext API

[Nakul Jindal] Refactored GPU{Contex,Object} to make it friendlier for parfor

[mwdusenb] [MINOR] Code style updates for `nn`

------------------------------------------
[...truncated 1998 lines...]
[WARNING] boolean hasNumAxes();
[WARNING] ^
[WARNING] <https://sparktc.ibmcloud.com/jenkins/job/SystemML-DailyTest/ws/target/generated-sources/caffe/Caffe.java>:37899:
warning: no @return
[WARNING] int getNumAxes();
[WARNING] ^
[WARNING] <https://sparktc.ibmcloud.com/jenkins/job/SystemML-DailyTest/ws/target/generated-sources/caffe/Caffe.java>:37913:
warning: no @return
[WARNING] boolean hasFiller();
[WARNING] ^
[WARNING] <https://sparktc.ibmcloud.com/jenkins/job/SystemML-DailyTest/ws/target/generated-sources/caffe/Caffe.java>:37925:
warning: no @return
[WARNING] caffe.Caffe.FillerParameter getFiller();
[WARNING] ^
[WARNING] <https://sparktc.ibmcloud.com/jenkins/job/SystemML-DailyTest/ws/target/generated-sources/caffe/Caffe.java>:37937:
warning: no @return
[WARNING] caffe.Caffe.FillerParameterOrBuilder getFillerOrBuilder();
[WARNING] ^
[WARNING] <https://sparktc.ibmcloud.com/jenkins/job/SystemML-DailyTest/ws/target/generated-sources/caffe/Caffe.java>:38516:
warning: no @param for value
[WARNING] public Builder setAxis(int value) {
[WARNING] ^
[WARNING] <https://sparktc.ibmcloud.com/jenkins/job/SystemML-DailyTest/ws/target/generated-sources/caffe/Caffe.java>:38516:
warning: no @return
[WARNING] public Builder setAxis(int value) {
[WARNING] ^
[WARNING] <https://sparktc.ibmcloud.com/jenkins/job/SystemML-DailyTest/ws/target/generated-sources/caffe/Caffe.java>:38541:
warning: no @return
[WARNING] public Builder clearAxis() {
[WARNING] ^
[WARNING] <https://sparktc.ibmcloud.com/jenkins/job/SystemML-DailyTest/ws/target/generated-sources/caffe/Caffe.java>:38592:
warning: no @param for value
[WARNING] public Builder setNumAxes(int value) {
[WARNING] ^
[WARNING] <https://sparktc.ibmcloud.com/jenkins/job/SystemML-DailyTest/ws/target/generated-sources/caffe/Caffe.java>:38592:
warning: no @return
[WARNING] public Builder setNumAxes(int value) {
[WARNING] ^
[WARNING] <https://sparktc.ibmcloud.com/jenkins/job/SystemML-DailyTest/ws/target/generated-sources/caffe/Caffe.java>:38610:
warning: no @return
[WARNING] public Builder clearNumAxes() {
[WARNING] ^
[WARNING] <https://sparktc.ibmcloud.com/jenkins/job/SystemML-DailyTest/ws/target/generated-sources/caffe/Caffe.java>:38664:
warning: no @param for value
[WARNING] public Builder setFiller(caffe.Caffe.FillerParameter value) {
[WARNING] ^
[WARNING] <https://sparktc.ibmcloud.com/jenkins/job/SystemML-DailyTest/ws/target/generated-sources/caffe/Caffe.java>:38664:
warning: no @return
[WARNING] public Builder setFiller(caffe.Caffe.FillerParameter value) {
[WARNING] ^
[WARNING] <https://sparktc.ibmcloud.com/jenkins/job/SystemML-DailyTest/ws/target/generated-sources/caffe/Caffe.java>:38688:
warning: no @param for builderForValue
[WARNING] public Builder setFiller(
[WARNING] ^
[WARNING] <https://sparktc.ibmcloud.com/jenkins/job/SystemML-DailyTest/ws/target/generated-sources/caffe/Caffe.java>:38688:
warning: no @return
[WARNING] public Builder setFiller(
[WARNING] ^
[WARNING] <https://sparktc.ibmcloud.com/jenkins/job/SystemML-DailyTest/ws/target/generated-sources/caffe/Caffe.java>:38710:
warning: no @param for value
[WARNING] public Builder mergeFiller(caffe.Caffe.FillerParameter value) {
[WARNING] ^
[WARNING] <https://sparktc.ibmcloud.com/jenkins/job/SystemML-DailyTest/ws/target/generated-sources/caffe/Caffe.java>:38710:
warning: no @return
[WARNING] public Builder mergeFiller(caffe.Caffe.FillerParameter value) {
[WARNING] ^
[WARNING] <https://sparktc.ibmcloud.com/jenkins/job/SystemML-DailyTest/ws/target/generated-sources/caffe/Caffe.java>:38737:
warning: no @return
[WARNING] public Builder clearFiller() {
[WARNING] ^
[WARNING] <https://sparktc.ibmcloud.com/jenkins/job/SystemML-DailyTest/ws/target/generated-sources/caffe/Caffe.java>:38758:
warning: no @return
[WARNING] public caffe.Caffe.FillerParameter.Builder getFillerBuilder() {
[WARNING] ^
[WARNING] <https://sparktc.ibmcloud.com/jenkins/job/SystemML-DailyTest/ws/target/generated-sources/caffe/Caffe.java>:587:
warning: no @return
[WARNING] boolean hasShape();
[WARNING] ^
[WARNING] <https://sparktc.ibmcloud.com/jenkins/job/SystemML-DailyTest/ws/target/generated-sources/caffe/Caffe.java>:591:
warning: no @return
[WARNING] caffe.Caffe.BlobShape getShape();
[WARNING] ^
[WARNING] <https://sparktc.ibmcloud.com/jenkins/job/SystemML-DailyTest/ws/target/generated-sources/caffe/Caffe.java>:595:
warning: no @return
[WARNING] caffe.Caffe.BlobShapeOrBuilder getShapeOrBuilder();
[WARNING] ^
[WARNING] <https://sparktc.ibmcloud.com/jenkins/job/SystemML-DailyTest/ws/target/generated-sources/caffe/Caffe.java>:601:
warning: no @return
[WARNING] java.util.List<java.lang.Float> getDataList();
[WARNING] ^
[WARNING] <https://sparktc.ibmcloud.com/jenkins/job/SystemML-DailyTest/ws/target/generated-sources/caffe/Caffe.java>:605:
warning: no @return
[WARNING] int getDataCount();
[WARNING] ^
[WARNING] <https://sparktc.ibmcloud.com/jenkins/job/SystemML-DailyTest/ws/target/generated-sources/caffe/Caffe.java>:609:
warning: no @param for index
[WARNING] float getData(int index);
[WARNING] ^
[WARNING] <https://sparktc.ibmcloud.com/jenkins/job/SystemML-DailyTest/ws/target/generated-sources/caffe/Caffe.java>:609:
warning: no @return
[WARNING] float getData(int index);
[WARNING] ^
[WARNING] <https://sparktc.ibmcloud.com/jenkins/job/SystemML-DailyTest/ws/target/generated-sources/caffe/Caffe.java>:615:
warning: no @return
[WARNING] java.util.List<java.lang.Float> getDiffList();
[WARNING] ^
[WARNING] <https://sparktc.ibmcloud.com/jenkins/job/SystemML-DailyTest/ws/target/generated-sources/caffe/Caffe.java>:619:
warning: no @return
[WARNING] int getDiffCount();
[WARNING] ^
[WARNING] <https://sparktc.ibmcloud.com/jenkins/job/SystemML-DailyTest/ws/target/generated-sources/caffe/Caffe.java>:623:
warning: no @param for index
[WARNING] float getDiff(int index);
[WARNING] ^
[WARNING] <https://sparktc.ibmcloud.com/jenkins/job/SystemML-DailyTest/ws/target/generated-sources/caffe/Caffe.java>:623:
warning: no @return
[WARNING] float getDiff(int index);
[WARNING] ^
[WARNING] <https://sparktc.ibmcloud.com/jenkins/job/SystemML-DailyTest/ws/target/generated-sources/caffe/Caffe.java>:629:
warning: no @return
[WARNING] java.util.List<java.lang.Double> getDoubleDataList();
[WARNING] ^
[WARNING] <https://sparktc.ibmcloud.com/jenkins/job/SystemML-DailyTest/ws/target/generated-sources/caffe/Caffe.java>:633:
warning: no @return
[WARNING] int getDoubleDataCount();
[WARNING] ^
[WARNING] <https://sparktc.ibmcloud.com/jenkins/job/SystemML-DailyTest/ws/target/generated-sources/caffe/Caffe.java>:637:
warning: no @param for index
[WARNING] double getDoubleData(int index);
[WARNING] ^
[INFO] Building jar: <https://sparktc.ibmcloud.com/jenkins/job/SystemML-DailyTest/ws/target/systemml-1.0.0-incubating-SNAPSHOT-javadoc.jar>
[INFO] 
[INFO] --- maven-clean-plugin:3.0.0:clean (clean-original-jar) @ systemml ---
[INFO] Deleting <https://sparktc.ibmcloud.com/jenkins/job/SystemML-DailyTest/ws/target>
(includes = [original-*.jar], excludes = [])
[INFO] 
[INFO] --- maven-assembly-plugin:2.6:single (create-main-jar) @ systemml ---
[INFO] Reading assembly descriptor: src/assembly/jar.xml
[WARNING] Artifact: org.apache.systemml:systemml:jar:1.0.0-incubating-SNAPSHOT references
the same file as the assembly destination file. Moving it to a temporary location for inclusion.
[INFO] Building jar: <https://sparktc.ibmcloud.com/jenkins/job/SystemML-DailyTest/ws/target/systemml-1.0.0-incubating-SNAPSHOT.jar>
[WARNING] Configuration options: 'appendAssemblyId' is set to false, and 'classifier' is missing.
Instead of attaching the assembly file: <https://sparktc.ibmcloud.com/jenkins/job/SystemML-DailyTest/ws/target/systemml-1.0.0-incubating-SNAPSHOT.jar,>
it will become the file for main project artifact.
NOTE: If multiple descriptors or descriptor-formats are provided for this project, the value
of this file will be non-deterministic!
[WARNING] Replacing pre-existing project main-artifact file: <https://sparktc.ibmcloud.com/jenkins/job/SystemML-DailyTest/ws/target/archive-tmp/systemml-1.0.0-incubating-SNAPSHOT.jar>
with assembly file: <https://sparktc.ibmcloud.com/jenkins/job/SystemML-DailyTest/ws/target/systemml-1.0.0-incubating-SNAPSHOT.jar>
[INFO] 
[INFO] --- maven-assembly-plugin:2.6:single (create-source-distribution) @ systemml ---
[INFO] Reading assembly descriptor: src/assembly/source.xml
[INFO] Building tar: <https://sparktc.ibmcloud.com/jenkins/job/SystemML-DailyTest/ws/target/systemml-1.0.0-incubating-SNAPSHOT-src.tgz>
[INFO] Building zip: <https://sparktc.ibmcloud.com/jenkins/job/SystemML-DailyTest/ws/target/systemml-1.0.0-incubating-SNAPSHOT-src.zip>
[INFO] 
[INFO] --- maven-assembly-plugin:2.6:single (create-binary-distribution-without-libs) @ systemml
---
[INFO] Reading assembly descriptor: src/assembly/distrib.xml
[INFO] Building tar: <https://sparktc.ibmcloud.com/jenkins/job/SystemML-DailyTest/ws/target/systemml-1.0.0-incubating-SNAPSHOT.tgz>
[INFO] Building zip: <https://sparktc.ibmcloud.com/jenkins/job/SystemML-DailyTest/ws/target/systemml-1.0.0-incubating-SNAPSHOT.zip>
[INFO] 
[INFO] --- maven-assembly-plugin:2.6:single (create-binary-distribution) @ systemml ---
[INFO] Reading assembly descriptor: src/assembly/bin.xml
[INFO] Building tar: <https://sparktc.ibmcloud.com/jenkins/job/SystemML-DailyTest/ws/target/systemml-1.0.0-incubating-SNAPSHOT-bin.tgz>
[INFO] Building zip: <https://sparktc.ibmcloud.com/jenkins/job/SystemML-DailyTest/ws/target/systemml-1.0.0-incubating-SNAPSHOT-bin.zip>
[INFO] 
[INFO] --- maven-antrun-plugin:1.8:run (copy) @ systemml ---
[INFO] Executing tasks

copy and rename JAR:
     [copy] Copying 1 file to <https://sparktc.ibmcloud.com/jenkins/job/SystemML-DailyTest/ws/target>
[INFO] Executed tasks
[INFO] 
[INFO] --- exec-maven-plugin:1.5.0:exec (generate-python-package-1) @ systemml ---
[INFO] 
[INFO] --- exec-maven-plugin:1.5.0:exec (generate-python-package-2) @ systemml ---
running sdist
running egg_info
creating systemml.egg-info
writing requirements to systemml.egg-info/requires.txt
writing systemml.egg-info/PKG-INFO
writing top-level names to systemml.egg-info/top_level.txt
writing dependency_links to systemml.egg-info/dependency_links.txt
writing manifest file 'systemml.egg-info/SOURCES.txt'
reading manifest file 'systemml.egg-info/SOURCES.txt'
reading manifest template 'MANIFEST.in'
writing manifest file 'systemml.egg-info/SOURCES.txt'
warning: sdist: standard file not found: should have one of README, README.rst, README.txt

running check
creating systemml-1.0.0
creating systemml-1.0.0/systemml
creating systemml-1.0.0/systemml.egg-info
creating systemml-1.0.0/systemml/mllearn
creating systemml-1.0.0/systemml/random
creating systemml-1.0.0/systemml/systemml-java
making hard links in systemml-1.0.0...
hard linking DISCLAIMER -> systemml-1.0.0
hard linking LICENSE -> systemml-1.0.0
hard linking MANIFEST.in -> systemml-1.0.0
hard linking NOTICE -> systemml-1.0.0
hard linking setup.py -> systemml-1.0.0
hard linking systemml/__init__.py -> systemml-1.0.0/systemml
hard linking systemml/classloader.py -> systemml-1.0.0/systemml
hard linking systemml/converters.py -> systemml-1.0.0/systemml
hard linking systemml/defmatrix.py -> systemml-1.0.0/systemml
hard linking systemml/mlcontext.py -> systemml-1.0.0/systemml
hard linking systemml/project_info.py -> systemml-1.0.0/systemml
hard linking systemml.egg-info/PKG-INFO -> systemml-1.0.0/systemml.egg-info
hard linking systemml.egg-info/SOURCES.txt -> systemml-1.0.0/systemml.egg-info
hard linking systemml.egg-info/dependency_links.txt -> systemml-1.0.0/systemml.egg-info
hard linking systemml.egg-info/requires.txt -> systemml-1.0.0/systemml.egg-info
hard linking systemml.egg-info/top_level.txt -> systemml-1.0.0/systemml.egg-info
hard linking systemml/mllearn/__init__.py -> systemml-1.0.0/systemml/mllearn
hard linking systemml/mllearn/estimators.py -> systemml-1.0.0/systemml/mllearn
hard linking systemml/random/__init__.py -> systemml-1.0.0/systemml/random
hard linking systemml/random/sampling.py -> systemml-1.0.0/systemml/random
hard linking systemml/systemml-java/systemml-1.0.0-incubating-SNAPSHOT.jar -> systemml-1.0.0/systemml/systemml-java
Writing systemml-1.0.0/setup.cfg
Creating tar archive
removing 'systemml-1.0.0' (and everything under it)
[INFO] 
[INFO] --- exec-maven-plugin:1.5.0:exec (generate-python-package-3) @ systemml ---
[INFO] 
[INFO] --- apache-rat-plugin:0.11:check (default) @ systemml ---
[INFO] 51 implicit excludes (use -debug for more details).
[INFO] Exclude: .gitignore
[INFO] Exclude: .repository/
[INFO] Exclude: .idea/
[INFO] Exclude: .git
[INFO] Exclude: .settings
[INFO] Exclude: .classpath
[INFO] Exclude: .project
[INFO] Exclude: docs
[INFO] Exclude: **/docs/**
[INFO] Exclude: **/*.csv
[INFO] Exclude: **/*.ijv
[INFO] Exclude: **/*.json
[INFO] Exclude: **/*.mtx
[INFO] Exclude: **/*.mtd
[INFO] Exclude: **/part-*
[INFO] Exclude: **/*.keep
[INFO] Exclude: **/target/**
[INFO] Exclude: **/README.md
[INFO] Exclude: **/*.ipynb
[INFO] Exclude: src/main/java/*.tokens
[INFO] Exclude: src/main/python/systemml.egg-info/**
[INFO] Exclude: src/main/cpp/kernels/SystemML.ptx
[INFO] Exclude: src/test/scripts/functions/jmlc/**/*.impute
[INFO] Exclude: src/test/scripts/functions/jmlc/**/*.map
[INFO] Exclude: src/test/scripts/functions/jmlc/**/*.mode
[INFO] Exclude: src/test/scripts/functions/jmlc/**/*.ndistinct
[INFO] Exclude: src/test/scripts/functions/jmlc/**/*.node
[INFO] Exclude: src/test/scripts/functions/jmlc/tfmtd_example/Bin/saleprice.bin
[INFO] Exclude: src/test/scripts/functions/jmlc/tfmtd_example/Bin/sqft.bin
[INFO] Exclude: src/test/scripts/functions/jmlc/tfmtd_example/column.names
[INFO] Exclude: src/test/scripts/functions/jmlc/tfmtd_example/dummycoded.column.names
[INFO] Exclude: src/test/scripts/functions/jmlc/tfmtd_example2/column.names
[INFO] Exclude: src/test/scripts/functions/jmlc/tfmtd_frame_example/tfmtd_frame
[INFO] 3325 resources included (use -debug for more details)
[INFO] Rat check: Summary of files. Unapproved: 1 unknown: 1 generated: 0 approved: 3288 licence.
[INFO] ------------------------------------------------------------------------
[INFO] BUILD FAILURE
[INFO] ------------------------------------------------------------------------
[INFO] Total time: 01:53 min
[INFO] Finished at: 2017-04-22T02:32:13-05:00
[INFO] Final Memory: 109M/3177M
[INFO] ------------------------------------------------------------------------
[ERROR] Failed to execute goal org.apache.rat:apache-rat-plugin:0.11:check (default) on project
systemml: Too many files with unapproved license: 1 See RAT report in: <https://sparktc.ibmcloud.com/jenkins/job/SystemML-DailyTest/ws/target/rat.txt>
-> [Help 1]
[ERROR] 
[ERROR] To see the full stack trace of the errors, re-run Maven with the -e switch.
[ERROR] Re-run Maven using the -X switch to enable full debug logging.
[ERROR] 
[ERROR] For more information about the errors and possible solutions, please read the following
articles:
[ERROR] [Help 1] http://cwiki.apache.org/confluence/display/MAVEN/MojoFailureException
[JENKINS] Archiving <https://sparktc.ibmcloud.com/jenkins/job/SystemML-DailyTest/ws/dependency-reduced-pom.xml>
to org.apache.systemml/systemml/1.0.0-incubating-SNAPSHOT/systemml-1.0.0-incubating-SNAPSHOT.pom
[JENKINS] Archiving <https://sparktc.ibmcloud.com/jenkins/job/SystemML-DailyTest/ws/target/systemml-1.0.0-incubating-SNAPSHOT.jar>
to org.apache.systemml/systemml/1.0.0-incubating-SNAPSHOT/systemml-1.0.0-incubating-SNAPSHOT.jar
[JENKINS] Archiving <https://sparktc.ibmcloud.com/jenkins/job/SystemML-DailyTest/ws/target/systemml-1.0.0-incubating-SNAPSHOT-sources.jar>
to org.apache.systemml/systemml/1.0.0-incubating-SNAPSHOT/systemml-1.0.0-incubating-SNAPSHOT-sources.jar
[JENKINS] Archiving <https://sparktc.ibmcloud.com/jenkins/job/SystemML-DailyTest/ws/target/systemml-1.0.0-incubating-SNAPSHOT-javadoc.jar>
to org.apache.systemml/systemml/1.0.0-incubating-SNAPSHOT/systemml-1.0.0-incubating-SNAPSHOT-javadoc.jar
[JENKINS] Archiving <https://sparktc.ibmcloud.com/jenkins/job/SystemML-DailyTest/ws/target/systemml-1.0.0-incubating-SNAPSHOT-src.tgz>
to org.apache.systemml/systemml/1.0.0-incubating-SNAPSHOT/systemml-1.0.0-incubating-SNAPSHOT-src.tgz
[JENKINS] Archiving <https://sparktc.ibmcloud.com/jenkins/job/SystemML-DailyTest/ws/target/systemml-1.0.0-incubating-SNAPSHOT-src.zip>
to org.apache.systemml/systemml/1.0.0-incubating-SNAPSHOT/systemml-1.0.0-incubating-SNAPSHOT-src.zip
[JENKINS] Archiving <https://sparktc.ibmcloud.com/jenkins/job/SystemML-DailyTest/ws/target/systemml-1.0.0-incubating-SNAPSHOT.tgz>
to org.apache.systemml/systemml/1.0.0-incubating-SNAPSHOT/systemml-1.0.0-incubating-SNAPSHOT.tgz
[JENKINS] Archiving <https://sparktc.ibmcloud.com/jenkins/job/SystemML-DailyTest/ws/target/systemml-1.0.0-incubating-SNAPSHOT.zip>
to org.apache.systemml/systemml/1.0.0-incubating-SNAPSHOT/systemml-1.0.0-incubating-SNAPSHOT.zip
[JENKINS] Archiving <https://sparktc.ibmcloud.com/jenkins/job/SystemML-DailyTest/ws/target/systemml-1.0.0-incubating-SNAPSHOT-bin.tgz>
to org.apache.systemml/systemml/1.0.0-incubating-SNAPSHOT/systemml-1.0.0-incubating-SNAPSHOT-bin.tgz
[JENKINS] Archiving <https://sparktc.ibmcloud.com/jenkins/job/SystemML-DailyTest/ws/target/systemml-1.0.0-incubating-SNAPSHOT-bin.zip>
to org.apache.systemml/systemml/1.0.0-incubating-SNAPSHOT/systemml-1.0.0-incubating-SNAPSHOT-bin.zip
channel stopped
Run condition [Always] enabling perform for step [[]]

Mime
View raw message