systemml-dev mailing list archives

Site index · List index
Message view « Date » · « Thread »
Top « Date » · « Thread »
From jenk...@spark.tc
Subject Build failed in Jenkins: SystemML-DailyTest #936
Date Tue, 18 Apr 2017 09:57:42 GMT
See <https://sparktc.ibmcloud.com/jenkins/job/SystemML-DailyTest/936/changes>

Changes:

[Matthias Boehm] [SYSTEMML-1509] Extended codegen compiler integration (runtime plans)

------------------------------------------
[...truncated 27541 lines...]
17/04/18 03:50:19 INFO scheduler.TaskSchedulerImpl: Adding task set 258.0 with 1 tasks
17/04/18 03:50:19 INFO scheduler.FairSchedulableBuilder: Added task set TaskSet_258.0 tasks
to pool default
17/04/18 03:50:19 INFO scheduler.TaskSetManager: Starting task 0.0 in stage 258.0 (TID 268,
localhost, executor driver, partition 0, PROCESS_LOCAL, 6289 bytes)
17/04/18 03:50:19 INFO executor.Executor: Running task 0.0 in stage 258.0 (TID 268)
17/04/18 03:50:19 INFO executor.Executor: Finished task 0.0 in stage 258.0 (TID 268). 1804
bytes result sent to driver
17/04/18 03:50:19 INFO scheduler.TaskSetManager: Finished task 0.0 in stage 258.0 (TID 268)
in 22 ms on localhost (executor driver) (1/1)
17/04/18 03:50:19 INFO scheduler.TaskSchedulerImpl: Removed TaskSet 258.0, whose tasks have
all completed, from pool default
17/04/18 03:50:19 INFO scheduler.DAGScheduler: ShuffleMapStage 258 (mapPartitionsToPair at
RDDConverterUtils.java:262) finished in 0.022 s
17/04/18 03:50:19 INFO scheduler.DAGScheduler: looking for newly runnable stages
17/04/18 03:50:19 INFO scheduler.DAGScheduler: running: Set()
17/04/18 03:50:19 INFO scheduler.DAGScheduler: waiting: Set(ResultStage 259)
17/04/18 03:50:19 INFO scheduler.DAGScheduler: failed: Set()
17/04/18 03:50:19 INFO scheduler.DAGScheduler: Submitting ResultStage 259 (MapPartitionsRDD[723]
at mapValues at SparkUtils.java:156), which has no missing parents
17/04/18 03:50:19 INFO memory.MemoryStore: Block broadcast_259 stored as values in memory
(estimated size 3.8 KB, free 1026.9 MB)
17/04/18 03:50:19 INFO memory.MemoryStore: Block broadcast_259_piece0 stored as bytes in memory
(estimated size 2.1 KB, free 1026.9 MB)
17/04/18 03:50:19 INFO storage.BlockManagerInfo: Added broadcast_259_piece0 in memory on 169.54.146.43:57150
(size: 2.1 KB, free: 1027.4 MB)
17/04/18 03:50:19 INFO spark.SparkContext: Created broadcast 259 from broadcast at DAGScheduler.scala:996
17/04/18 03:50:19 INFO scheduler.DAGScheduler: Submitting 1 missing tasks from ResultStage
259 (MapPartitionsRDD[723] at mapValues at SparkUtils.java:156)
17/04/18 03:50:19 INFO scheduler.TaskSchedulerImpl: Adding task set 259.0 with 1 tasks
17/04/18 03:50:19 INFO scheduler.FairSchedulableBuilder: Added task set TaskSet_259.0 tasks
to pool default
17/04/18 03:50:19 INFO scheduler.TaskSetManager: Starting task 0.0 in stage 259.0 (TID 269,
localhost, executor driver, partition 0, ANY, 5753 bytes)
17/04/18 03:50:19 INFO executor.Executor: Running task 0.0 in stage 259.0 (TID 269)
17/04/18 03:50:19 INFO storage.ShuffleBlockFetcherIterator: Getting 1 non-empty blocks out
of 1 blocks
17/04/18 03:50:19 INFO storage.ShuffleBlockFetcherIterator: Started 0 remote fetches in 0
ms
17/04/18 03:50:19 INFO executor.Executor: Finished task 0.0 in stage 259.0 (TID 269). 2021
bytes result sent to driver
17/04/18 03:50:19 INFO scheduler.TaskSetManager: Finished task 0.0 in stage 259.0 (TID 269)
in 5 ms on localhost (executor driver) (1/1)
17/04/18 03:50:19 INFO scheduler.TaskSchedulerImpl: Removed TaskSet 259.0, whose tasks have
all completed, from pool default
17/04/18 03:50:19 INFO scheduler.DAGScheduler: ResultStage 259 (collect at SparkExecutionContext.java:796)
finished in 0.006 s
17/04/18 03:50:19 INFO scheduler.DAGScheduler: Registering RDD 725 (flatMapToPair at RDDConverterUtils.java:280)
17/04/18 03:50:19 INFO scheduler.DAGScheduler: Got job 193 (collectAsList at MLContextTest.java:1325)
with 1 output partitions
17/04/18 03:50:19 INFO scheduler.DAGScheduler: Final stage: ResultStage 261 (collectAsList
at MLContextTest.java:1325)
17/04/18 03:50:19 INFO scheduler.DAGScheduler: Parents of final stage: List(ShuffleMapStage
260)
17/04/18 03:50:19 INFO scheduler.DAGScheduler: Missing parents: List(ShuffleMapStage 260)
17/04/18 03:50:19 INFO scheduler.DAGScheduler: Submitting ShuffleMapStage 260 (MapPartitionsRDD[725]
at flatMapToPair at RDDConverterUtils.java:280), which has no missing parents
17/04/18 03:50:19 INFO memory.MemoryStore: Block broadcast_260 stored as values in memory
(estimated size 3.9 KB, free 1026.9 MB)
17/04/18 03:50:19 INFO memory.MemoryStore: Block broadcast_260_piece0 stored as bytes in memory
(estimated size 2.2 KB, free 1026.9 MB)
17/04/18 03:50:19 INFO storage.BlockManagerInfo: Added broadcast_260_piece0 in memory on 169.54.146.43:57150
(size: 2.2 KB, free: 1027.4 MB)
17/04/18 03:50:19 INFO spark.SparkContext: Created broadcast 260 from broadcast at DAGScheduler.scala:996
17/04/18 03:50:19 INFO scheduler.DAGScheduler: Submitting 1 missing tasks from ShuffleMapStage
260 (MapPartitionsRDD[725] at flatMapToPair at RDDConverterUtils.java:280)
17/04/18 03:50:19 INFO scheduler.TaskSchedulerImpl: Adding task set 260.0 with 1 tasks
17/04/18 03:50:19 INFO scheduler.FairSchedulableBuilder: Added task set TaskSet_260.0 tasks
to pool default
17/04/18 03:50:19 INFO scheduler.TaskSetManager: Starting task 0.0 in stage 260.0 (TID 270,
localhost, executor driver, partition 0, PROCESS_LOCAL, 6218 bytes)
17/04/18 03:50:19 INFO executor.Executor: Running task 0.0 in stage 260.0 (TID 270)
17/04/18 03:50:19 INFO executor.Executor: Finished task 0.0 in stage 260.0 (TID 270). 1253
bytes result sent to driver
17/04/18 03:50:19 INFO scheduler.TaskSetManager: Finished task 0.0 in stage 260.0 (TID 270)
in 4 ms on localhost (executor driver) (1/1)
17/04/18 03:50:19 INFO scheduler.TaskSchedulerImpl: Removed TaskSet 260.0, whose tasks have
all completed, from pool default
17/04/18 03:50:19 INFO scheduler.DAGScheduler: ShuffleMapStage 260 (flatMapToPair at RDDConverterUtils.java:280)
finished in 0.005 s
17/04/18 03:50:19 INFO scheduler.DAGScheduler: looking for newly runnable stages
17/04/18 03:50:19 INFO scheduler.DAGScheduler: running: Set()
17/04/18 03:50:19 INFO scheduler.DAGScheduler: waiting: Set(ResultStage 261)
17/04/18 03:50:19 INFO scheduler.DAGScheduler: failed: Set()
17/04/18 03:50:19 INFO scheduler.DAGScheduler: Submitting ResultStage 261 (MapPartitionsRDD[731]
at collectAsList at MLContextTest.java:1325), which has no missing parents
17/04/18 03:50:19 INFO memory.MemoryStore: Block broadcast_261 stored as values in memory
(estimated size 11.3 KB, free 1026.9 MB)
17/04/18 03:50:19 INFO memory.MemoryStore: Block broadcast_261_piece0 stored as bytes in memory
(estimated size 5.6 KB, free 1026.9 MB)
17/04/18 03:50:19 INFO storage.BlockManagerInfo: Added broadcast_261_piece0 in memory on 169.54.146.43:57150
(size: 5.6 KB, free: 1027.4 MB)
17/04/18 03:50:19 INFO spark.SparkContext: Created broadcast 261 from broadcast at DAGScheduler.scala:996
17/04/18 03:50:19 INFO scheduler.DAGScheduler: Submitting 1 missing tasks from ResultStage
261 (MapPartitionsRDD[731] at collectAsList at MLContextTest.java:1325)
17/04/18 03:50:19 INFO scheduler.TaskSchedulerImpl: Adding task set 261.0 with 1 tasks
17/04/18 03:50:19 INFO scheduler.FairSchedulableBuilder: Added task set TaskSet_261.0 tasks
to pool default
17/04/18 03:50:19 INFO scheduler.TaskSetManager: Starting task 0.0 in stage 261.0 (TID 271,
localhost, executor driver, partition 0, ANY, 5783 bytes)
17/04/18 03:50:19 INFO executor.Executor: Running task 0.0 in stage 261.0 (TID 271)
17/04/18 03:50:19 INFO storage.ShuffleBlockFetcherIterator: Getting 1 non-empty blocks out
of 1 blocks
17/04/18 03:50:19 INFO storage.ShuffleBlockFetcherIterator: Started 0 remote fetches in 0
ms
17/04/18 03:50:19 INFO executor.Executor: Finished task 0.0 in stage 261.0 (TID 271). 2024
bytes result sent to driver
17/04/18 03:50:19 INFO scheduler.TaskSetManager: Finished task 0.0 in stage 261.0 (TID 271)
in 9 ms on localhost (executor driver) (1/1)
17/04/18 03:50:19 INFO scheduler.TaskSchedulerImpl: Removed TaskSet 261.0, whose tasks have
all completed, from pool default
17/04/18 03:50:19 INFO scheduler.DAGScheduler: ResultStage 261 (collectAsList at MLContextTest.java:1325)
finished in 0.010 s
17/04/18 03:50:19 INFO server.ServerConnector: Stopped ServerConnector@351ee8ea{HTTP/1.1}{0.0.0.0:4040}
17/04/18 03:50:19 INFO handler.ContextHandler: Stopped o.s.j.s.ServletContextHandler@2f624718{/stages/stage/kill,null,UNAVAILABLE}
17/04/18 03:50:19 INFO handler.ContextHandler: Stopped o.s.j.s.ServletContextHandler@2f4de23f{/jobs/job/kill,null,UNAVAILABLE}
17/04/18 03:50:19 INFO handler.ContextHandler: Stopped o.s.j.s.ServletContextHandler@23675711{/api,null,UNAVAILABLE}
17/04/18 03:50:19 INFO handler.ContextHandler: Stopped o.s.j.s.ServletContextHandler@10cc3534{/,null,UNAVAILABLE}
17/04/18 03:50:19 INFO handler.ContextHandler: Stopped o.s.j.s.ServletContextHandler@2c158741{/static,null,UNAVAILABLE}
17/04/18 03:50:19 INFO handler.ContextHandler: Stopped o.s.j.s.ServletContextHandler@6ddc2f45{/executors/threadDump/json,null,UNAVAILABLE}
17/04/18 03:50:19 INFO handler.ContextHandler: Stopped o.s.j.s.ServletContextHandler@61da5844{/executors/threadDump,null,UNAVAILABLE}
17/04/18 03:50:19 INFO handler.ContextHandler: Stopped o.s.j.s.ServletContextHandler@1f346a35{/executors/json,null,UNAVAILABLE}
17/04/18 03:50:19 INFO handler.ContextHandler: Stopped o.s.j.s.ServletContextHandler@40e03d12{/executors,null,UNAVAILABLE}
17/04/18 03:50:19 INFO handler.ContextHandler: Stopped o.s.j.s.ServletContextHandler@d40294b{/environment/json,null,UNAVAILABLE}
17/04/18 03:50:19 INFO handler.ContextHandler: Stopped o.s.j.s.ServletContextHandler@36191136{/environment,null,UNAVAILABLE}
17/04/18 03:50:19 INFO handler.ContextHandler: Stopped o.s.j.s.ServletContextHandler@1ae8bc7f{/storage/rdd/json,null,UNAVAILABLE}
17/04/18 03:50:19 INFO handler.ContextHandler: Stopped o.s.j.s.ServletContextHandler@4e93089{/storage/rdd,null,UNAVAILABLE}
17/04/18 03:50:19 INFO handler.ContextHandler: Stopped o.s.j.s.ServletContextHandler@31015c72{/storage/json,null,UNAVAILABLE}
17/04/18 03:50:19 INFO handler.ContextHandler: Stopped o.s.j.s.ServletContextHandler@1a06db77{/storage,null,UNAVAILABLE}
17/04/18 03:50:19 INFO handler.ContextHandler: Stopped o.s.j.s.ServletContextHandler@1800c3e8{/stages/pool/json,null,UNAVAILABLE}
17/04/18 03:50:19 INFO handler.ContextHandler: Stopped o.s.j.s.ServletContextHandler@7e6477c{/stages/pool,null,UNAVAILABLE}
17/04/18 03:50:19 INFO handler.ContextHandler: Stopped o.s.j.s.ServletContextHandler@51af406d{/stages/stage/json,null,UNAVAILABLE}
17/04/18 03:50:19 INFO handler.ContextHandler: Stopped o.s.j.s.ServletContextHandler@42f81f80{/stages/stage,null,UNAVAILABLE}
17/04/18 03:50:19 INFO handler.ContextHandler: Stopped o.s.j.s.ServletContextHandler@1151d515{/stages/json,null,UNAVAILABLE}
17/04/18 03:50:19 INFO handler.ContextHandler: Stopped o.s.j.s.ServletContextHandler@30ab2a6{/stages,null,UNAVAILABLE}
17/04/18 03:50:19 INFO handler.ContextHandler: Stopped o.s.j.s.ServletContextHandler@5f198bb1{/jobs/job/json,null,UNAVAILABLE}
17/04/18 03:50:19 INFO handler.ContextHandler: Stopped o.s.j.s.ServletContextHandler@25aeca9d{/jobs/job,null,UNAVAILABLE}
17/04/18 03:50:19 INFO handler.ContextHandler: Stopped o.s.j.s.ServletContextHandler@60be5eec{/jobs/json,null,UNAVAILABLE}
17/04/18 03:50:19 INFO handler.ContextHandler: Stopped o.s.j.s.ServletContextHandler@4163a599{/jobs,null,UNAVAILABLE}
17/04/18 03:50:19 INFO ui.SparkUI: Stopped Spark web UI at http://169.54.146.43:4040
17/04/18 03:50:19 INFO spark.MapOutputTrackerMasterEndpoint: MapOutputTrackerMasterEndpoint
stopped!
17/04/18 03:50:19 INFO memory.MemoryStore: MemoryStore cleared
17/04/18 03:50:19 INFO storage.BlockManager: BlockManager stopped
17/04/18 03:50:19 INFO storage.BlockManagerMaster: BlockManagerMaster stopped
17/04/18 03:50:19 INFO scheduler.OutputCommitCoordinator$OutputCommitCoordinatorEndpoint:
OutputCommitCoordinator stopped!
17/04/18 03:50:19 INFO spark.SparkContext: Successfully stopped SparkContext
Running org.apache.sysml.test.integration.mlcontext.MLContextTest
Tests run: 175, Failures: 0, Errors: 0, Skipped: 0, Time elapsed: 13.755 sec - in org.apache.sysml.test.integration.mlcontext.MLContextTest
17/04/18 03:50:19 INFO util.ShutdownHookManager: Shutdown hook called
17/04/18 03:50:19 INFO util.ShutdownHookManager: Deleting directory /tmp/spark-8eae3c2d-645d-4747-bb6f-a9959be4a73b
Running org.apache.sysml.test.integration.functions.quaternary.WeightedSigmoidTest
Tests run: 56, Failures: 0, Errors: 0, Skipped: 0, Time elapsed: 994.962 sec - in org.apache.sysml.test.integration.functions.quaternary.WeightedSigmoidTest
17/04/18 03:51:43 INFO util.ShutdownHookManager: Shutdown hook called
17/04/18 03:51:43 INFO util.ShutdownHookManager: Deleting directory /tmp/spark-bdf62eab-a1a6-4097-8e8d-6f5cf99bd55d
Running org.apache.sysml.test.integration.functions.indexing.LeftIndexingTest
Tests run: 3, Failures: 0, Errors: 0, Skipped: 0, Time elapsed: 640.586 sec - in org.apache.sysml.test.integration.functions.indexing.LeftIndexingTest
Running org.apache.sysml.test.integration.functions.reorg.FullOrderTest
Tests run: 132, Failures: 0, Errors: 0, Skipped: 0, Time elapsed: 1,310.489 sec - in org.apache.sysml.test.integration.functions.reorg.FullOrderTest
Running org.apache.sysml.test.integration.applications.descriptivestats.UnivariateUnweightedScaleDenseTest
Tests run: 24, Failures: 0, Errors: 0, Skipped: 0, Time elapsed: 332.938 sec - in org.apache.sysml.test.integration.applications.descriptivestats.UnivariateUnweightedScaleDenseTest
Running org.apache.sysml.test.integration.applications.parfor.ParForCorrelationTest
Tests run: 12, Failures: 0, Errors: 0, Skipped: 0, Time elapsed: 281.528 sec - in org.apache.sysml.test.integration.applications.parfor.ParForCorrelationTest
Running org.apache.sysml.test.integration.applications.parfor.ParForCorrelationTestLarge
Tests run: 2, Failures: 0, Errors: 0, Skipped: 0, Time elapsed: 41.86 sec - in org.apache.sysml.test.integration.applications.parfor.ParForCorrelationTestLarge
Running org.apache.sysml.test.integration.functions.quaternary.WeightedDivMatrixMultTest
Tests run: 90, Failures: 0, Errors: 0, Skipped: 0, Time elapsed: 1,483.295 sec - in org.apache.sysml.test.integration.functions.quaternary.WeightedDivMatrixMultTest
17/04/18 03:58:09 INFO util.ShutdownHookManager: Shutdown hook called
17/04/18 03:58:09 INFO util.ShutdownHookManager: Deleting directory /tmp/spark-0c8de8e4-74d6-4f41-b3fc-81e39b0dea1f
Running org.apache.sysml.test.integration.applications.descriptivestats.UnivariateWeightedScaleDenseTest
Tests run: 24, Failures: 0, Errors: 0, Skipped: 0, Time elapsed: 345.423 sec - in org.apache.sysml.test.integration.applications.descriptivestats.UnivariateWeightedScaleDenseTest
Running org.apache.sysml.test.integration.functions.append.AppendChainTest
Tests run: 12, Failures: 0, Errors: 0, Skipped: 0, Time elapsed: 1,020.702 sec - in org.apache.sysml.test.integration.functions.append.AppendChainTest
Running org.apache.sysml.test.integration.applications.parfor.ParForNaiveBayesTest
Tests run: 10, Failures: 0, Errors: 0, Skipped: 0, Time elapsed: 539.562 sec - in org.apache.sysml.test.integration.applications.parfor.ParForNaiveBayesTest
Running org.apache.sysml.test.integration.applications.descriptivestats.UnivariateUnweightedScaleSparseTest
Tests run: 24, Failures: 0, Errors: 0, Skipped: 0, Time elapsed: 283.402 sec - in org.apache.sysml.test.integration.applications.descriptivestats.UnivariateUnweightedScaleSparseTest
Running org.apache.sysml.test.integration.applications.dml.HITSDMLTest
Tests run: 1, Failures: 0, Errors: 0, Skipped: 0, Time elapsed: 92.942 sec - in org.apache.sysml.test.integration.applications.dml.HITSDMLTest
Running org.apache.sysml.test.integration.applications.descriptivestats.UnivariateWeightedScaleSparseTest
Tests run: 24, Failures: 0, Errors: 0, Skipped: 0, Time elapsed: 340.808 sec - in org.apache.sysml.test.integration.applications.descriptivestats.UnivariateWeightedScaleSparseTest
Running org.apache.sysml.test.integration.functions.append.AppendMatrixTest
Tests run: 22, Failures: 0, Errors: 0, Skipped: 0, Time elapsed: 1,458.221 sec - in org.apache.sysml.test.integration.functions.append.AppendMatrixTest
Running org.apache.sysml.test.integration.applications.pydml.ArimaPyDMLTest
Tests run: 1, Failures: 0, Errors: 0, Skipped: 0, Time elapsed: 49.201 sec - in org.apache.sysml.test.integration.applications.pydml.ArimaPyDMLTest
Running org.apache.sysml.test.integration.applications.pydml.HITSPyDMLTest
Tests run: 1, Failures: 0, Errors: 0, Skipped: 0, Time elapsed: 77.519 sec - in org.apache.sysml.test.integration.applications.pydml.HITSPyDMLTest
Running org.apache.sysml.test.integration.applications.dml.LinearRegressionDMLTest
Tests run: 7, Failures: 0, Errors: 0, Skipped: 0, Time elapsed: 51.117 sec - in org.apache.sysml.test.integration.applications.dml.LinearRegressionDMLTest
Running org.apache.sysml.test.integration.applications.pydml.CsplineDSPyDMLTest
Tests run: 3, Failures: 0, Errors: 0, Skipped: 0, Time elapsed: 6.656 sec - in org.apache.sysml.test.integration.applications.pydml.CsplineDSPyDMLTest
Running org.apache.sysml.test.integration.applications.pydml.LinearLogRegPyDMLTest
Tests run: 7, Failures: 0, Errors: 0, Skipped: 0, Time elapsed: 86.974 sec - in org.apache.sysml.test.integration.applications.pydml.LinearLogRegPyDMLTest
Running org.apache.sysml.test.integration.applications.pydml.NaiveBayesPyDMLTest
Tests run: 6, Failures: 0, Errors: 0, Skipped: 0, Time elapsed: 80.688 sec - in org.apache.sysml.test.integration.applications.pydml.NaiveBayesPyDMLTest
Running org.apache.sysml.test.integration.applications.dml.CsplineCGDMLTest
Tests run: 3, Failures: 0, Errors: 0, Skipped: 0, Time elapsed: 12.129 sec - in org.apache.sysml.test.integration.applications.dml.CsplineCGDMLTest
Running org.apache.sysml.test.integration.applications.dml.L2SVMDMLTest
Tests run: 9, Failures: 0, Errors: 0, Skipped: 0, Time elapsed: 63.956 sec - in org.apache.sysml.test.integration.applications.dml.L2SVMDMLTest
Running org.apache.sysml.test.integration.applications.pydml.MDABivariateStatsPyDMLTest
Tests run: 4, Failures: 0, Errors: 0, Skipped: 0, Time elapsed: 294.011 sec - in org.apache.sysml.test.integration.applications.pydml.MDABivariateStatsPyDMLTest
Running org.apache.sysml.test.integration.applications.pydml.PageRankPyDMLTest
Tests run: 3, Failures: 0, Errors: 0, Skipped: 0, Time elapsed: 8.478 sec - in org.apache.sysml.test.integration.applications.pydml.PageRankPyDMLTest
Running org.apache.sysml.test.integration.applications.pydml.NaiveBayesParforPyDMLTest
Tests run: 6, Failures: 0, Errors: 0, Skipped: 0, Time elapsed: 80.993 sec - in org.apache.sysml.test.integration.applications.pydml.NaiveBayesParforPyDMLTest
Running org.apache.sysml.test.integration.applications.dml.NaiveBayesDMLTest
Tests run: 6, Failures: 0, Errors: 0, Skipped: 0, Time elapsed: 81.314 sec - in org.apache.sysml.test.integration.applications.dml.NaiveBayesDMLTest
Running org.apache.sysml.test.integration.applications.dml.MDABivariateStatsDMLTest
Tests run: 4, Failures: 0, Errors: 0, Skipped: 0, Time elapsed: 294.738 sec - in org.apache.sysml.test.integration.applications.dml.MDABivariateStatsDMLTest
Running org.apache.sysml.test.integration.applications.dml.PageRankDMLTest
Tests run: 3, Failures: 0, Errors: 0, Skipped: 0, Time elapsed: 8.404 sec - in org.apache.sysml.test.integration.applications.dml.PageRankDMLTest
Running org.apache.sysml.test.integration.applications.pydml.GLMPyDMLTest
Tests run: 30, Failures: 0, Errors: 0, Skipped: 0, Time elapsed: 587.286 sec - in org.apache.sysml.test.integration.applications.pydml.GLMPyDMLTest
Running org.apache.sysml.test.integration.applications.pydml.MultiClassSVMPyDMLTest
Tests run: 9, Failures: 0, Errors: 0, Skipped: 0, Time elapsed: 88.423 sec - in org.apache.sysml.test.integration.applications.pydml.MultiClassSVMPyDMLTest
Running org.apache.sysml.test.integration.applications.dml.ID3DMLTest
Tests run: 2, Failures: 0, Errors: 0, Skipped: 0, Time elapsed: 396.47 sec - in org.apache.sysml.test.integration.applications.dml.ID3DMLTest
Running org.apache.sysml.test.integration.applications.dml.GLMDMLTest
Tests run: 30, Failures: 0, Errors: 0, Skipped: 0, Time elapsed: 860.528 sec - in org.apache.sysml.test.integration.applications.dml.GLMDMLTest
Running org.apache.sysml.test.integration.applications.pydml.CsplineCGPyDMLTest
Tests run: 3, Failures: 0, Errors: 0, Skipped: 0, Time elapsed: 6.057 sec - in org.apache.sysml.test.integration.applications.pydml.CsplineCGPyDMLTest
Running org.apache.sysml.test.integration.applications.pydml.WelchTPyDMLTest
Tests run: 3, Failures: 0, Errors: 0, Skipped: 0, Time elapsed: 6.491 sec - in org.apache.sysml.test.integration.applications.pydml.WelchTPyDMLTest
Running org.apache.sysml.test.integration.applications.dml.MultiClassSVMDMLTest
Tests run: 9, Failures: 0, Errors: 0, Skipped: 0, Time elapsed: 88.026 sec - in org.apache.sysml.test.integration.applications.dml.MultiClassSVMDMLTest
Running org.apache.sysml.test.integration.applications.dml.CsplineDSDMLTest
Tests run: 3, Failures: 0, Errors: 0, Skipped: 0, Time elapsed: 12.344 sec - in org.apache.sysml.test.integration.applications.dml.CsplineDSDMLTest
Running org.apache.sysml.test.integration.applications.pydml.ApplyTransformPyDMLTest
Tests run: 7, Failures: 0, Errors: 0, Skipped: 0, Time elapsed: 0.816 sec - in org.apache.sysml.test.integration.applications.pydml.ApplyTransformPyDMLTest
Running org.apache.sysml.test.integration.applications.dml.NaiveBayesParforDMLTest
Tests run: 6, Failures: 0, Errors: 0, Skipped: 0, Time elapsed: 81.395 sec - in org.apache.sysml.test.integration.applications.dml.NaiveBayesParforDMLTest
Running org.apache.sysml.test.integration.applications.pydml.L2SVMPyDMLTest
Tests run: 9, Failures: 0, Errors: 0, Skipped: 0, Time elapsed: 63.707 sec - in org.apache.sysml.test.integration.applications.pydml.L2SVMPyDMLTest
Running org.apache.sysml.test.integration.applications.pydml.LinearRegressionPyDMLTest
Tests run: 7, Failures: 0, Errors: 0, Skipped: 0, Time elapsed: 50.32 sec - in org.apache.sysml.test.integration.applications.pydml.LinearRegressionPyDMLTest
Running org.apache.sysml.test.integration.applications.dml.LinearLogRegDMLTest
Tests run: 7, Failures: 0, Errors: 0, Skipped: 0, Time elapsed: 60.804 sec - in org.apache.sysml.test.integration.applications.dml.LinearLogRegDMLTest
Running org.apache.sysml.test.integration.applications.dml.GNMFDMLTest
Tests run: 3, Failures: 0, Errors: 0, Skipped: 0, Time elapsed: 60.626 sec - in org.apache.sysml.test.integration.applications.dml.GNMFDMLTest
Running org.apache.sysml.test.integration.applications.dml.WelchTDMLTest
Tests run: 3, Failures: 0, Errors: 0, Skipped: 0, Time elapsed: 6.46 sec - in org.apache.sysml.test.integration.applications.dml.WelchTDMLTest
Running org.apache.sysml.test.integration.applications.dml.ApplyTransformDMLTest
Tests run: 7, Failures: 0, Errors: 0, Skipped: 0, Time elapsed: 13.255 sec - in org.apache.sysml.test.integration.applications.dml.ApplyTransformDMLTest
Running org.apache.sysml.test.integration.applications.pydml.ID3PyDMLTest
Tests run: 2, Failures: 0, Errors: 0, Skipped: 0, Time elapsed: 381.691 sec - in org.apache.sysml.test.integration.applications.pydml.ID3PyDMLTest
Running org.apache.sysml.test.integration.applications.pydml.GNMFPyDMLTest
Tests run: 3, Failures: 0, Errors: 0, Skipped: 0, Time elapsed: 58.001 sec - in org.apache.sysml.test.integration.applications.pydml.GNMFPyDMLTest

Results :

Failed tests: 
  RightIndexingMatrixTest>AutomatedTestBase.tearDown:1481 Detailed matrices characteristics:
!  B-DML<->B-R # stored values in B-R: 3
!  B-DML<->B-R # stored values in B-DML: 3
!  B-DML<->B-R identical values(z=0): 0
!  B-DML<->B-R wrong values(z=1.0E-10): 3
!  B-DML<->B-R min error: 37.52588357365856
!  B-DML<->B-R max error: 80.18850466523388
    C-DML<->C-R # stored values in C-R: 17453
    C-DML<->C-R # stored values in C-DML: 17453
    C-DML<->C-R identical values(z=0): 17451
    C-DML<->C-R wrong values(z=1.0E-10): 0
    C-DML<->C-R min error: 0.0
    C-DML<->C-R max error: 7.105427357601002E-15
    D-DML<->D-R # stored values in D-R: 10476
    D-DML<->D-R # stored values in D-DML: 10476
    D-DML<->D-R identical values(z=0): 10474
    D-DML<->D-R wrong values(z=1.0E-10): 0
    D-DML<->D-R min error: 0.0
    D-DML<->D-R max error: 7.105427357601002E-15


Tests run: 6875, Failures: 1, Errors: 0, Skipped: 0

[INFO] 
[INFO] --- maven-failsafe-plugin:2.17:verify (default) @ systemml ---
[INFO] Failsafe report directory: <https://sparktc.ibmcloud.com/jenkins/job/SystemML-DailyTest/ws/target/failsafe-reports>
[INFO] ------------------------------------------------------------------------
[INFO] BUILD FAILURE
[INFO] ------------------------------------------------------------------------
[INFO] Total time: 02:25 h
[INFO] Finished at: 2017-04-18T04:57:42-05:00
[INFO] Final Memory: 65M/2293M
[INFO] ------------------------------------------------------------------------
[ERROR] Failed to execute goal org.apache.maven.plugins:maven-failsafe-plugin:2.17:verify
(default) on project systemml: There are test failures.
[ERROR] 
[ERROR] Please refer to <https://sparktc.ibmcloud.com/jenkins/job/SystemML-DailyTest/ws/target/failsafe-reports>
for the individual test results.
[ERROR] -> [Help 1]
[ERROR] 
[ERROR] To see the full stack trace of the errors, re-run Maven with the -e switch.
[ERROR] Re-run Maven using the -X switch to enable full debug logging.
[ERROR] 
[ERROR] For more information about the errors and possible solutions, please read the following
articles:
[ERROR] [Help 1] http://cwiki.apache.org/confluence/display/MAVEN/MojoFailureException
Build step 'Execute shell' marked build as failure
Run condition [Always] enabling perform for step [[]]

Mime
View raw message