systemml-dev mailing list archives

Site index · List index
Message view « Date » · « Thread »
Top « Date » · « Thread »
From jenk...@spark.tc
Subject Build failed in Jenkins: SystemML-DailyTest #925
Date Wed, 12 Apr 2017 22:11:45 GMT
See <https://sparktc.ibmcloud.com/jenkins/job/SystemML-DailyTest/925/>

------------------------------------------
[...truncated 27686 lines...]
17/04/12 16:03:48 INFO scheduler.TaskSetManager: Starting task 0.0 in stage 258.0 (TID 268,
localhost, executor driver, partition 0, PROCESS_LOCAL, 6289 bytes)
17/04/12 16:03:48 INFO executor.Executor: Running task 0.0 in stage 258.0 (TID 268)
17/04/12 16:03:48 INFO executor.Executor: Finished task 0.0 in stage 258.0 (TID 268). 1804
bytes result sent to driver
17/04/12 16:03:48 INFO scheduler.TaskSetManager: Finished task 0.0 in stage 258.0 (TID 268)
in 10 ms on localhost (executor driver) (1/1)
17/04/12 16:03:48 INFO scheduler.TaskSchedulerImpl: Removed TaskSet 258.0, whose tasks have
all completed, from pool default
17/04/12 16:03:48 INFO scheduler.DAGScheduler: ShuffleMapStage 258 (mapPartitionsToPair at
RDDConverterUtils.java:262) finished in 0.010 s
17/04/12 16:03:48 INFO scheduler.DAGScheduler: looking for newly runnable stages
17/04/12 16:03:48 INFO scheduler.DAGScheduler: running: Set()
17/04/12 16:03:48 INFO scheduler.DAGScheduler: waiting: Set(ResultStage 259)
17/04/12 16:03:48 INFO scheduler.DAGScheduler: failed: Set()
17/04/12 16:03:48 INFO scheduler.DAGScheduler: Submitting ResultStage 259 (MapPartitionsRDD[723]
at mapValues at SparkUtils.java:156), which has no missing parents
17/04/12 16:03:48 INFO memory.MemoryStore: Block broadcast_259 stored as values in memory
(estimated size 3.8 KB, free 1025.1 MB)
17/04/12 16:03:48 INFO memory.MemoryStore: Block broadcast_259_piece0 stored as bytes in memory
(estimated size 2.1 KB, free 1025.1 MB)
17/04/12 16:03:48 INFO storage.BlockManagerInfo: Added broadcast_259_piece0 in memory on 169.54.146.43:48913
(size: 2.1 KB, free: 1025.6 MB)
17/04/12 16:03:48 INFO spark.SparkContext: Created broadcast 259 from broadcast at DAGScheduler.scala:996
17/04/12 16:03:48 INFO scheduler.DAGScheduler: Submitting 1 missing tasks from ResultStage
259 (MapPartitionsRDD[723] at mapValues at SparkUtils.java:156)
17/04/12 16:03:48 INFO scheduler.TaskSchedulerImpl: Adding task set 259.0 with 1 tasks
17/04/12 16:03:48 INFO scheduler.FairSchedulableBuilder: Added task set TaskSet_259.0 tasks
to pool default
17/04/12 16:03:48 INFO scheduler.TaskSetManager: Starting task 0.0 in stage 259.0 (TID 269,
localhost, executor driver, partition 0, ANY, 5753 bytes)
17/04/12 16:03:48 INFO executor.Executor: Running task 0.0 in stage 259.0 (TID 269)
17/04/12 16:03:48 INFO storage.ShuffleBlockFetcherIterator: Getting 1 non-empty blocks out
of 1 blocks
17/04/12 16:03:48 INFO storage.ShuffleBlockFetcherIterator: Started 0 remote fetches in 0
ms
17/04/12 16:03:48 INFO executor.Executor: Finished task 0.0 in stage 259.0 (TID 269). 2021
bytes result sent to driver
17/04/12 16:03:48 INFO scheduler.TaskSetManager: Finished task 0.0 in stage 259.0 (TID 269)
in 5 ms on localhost (executor driver) (1/1)
17/04/12 16:03:48 INFO scheduler.TaskSchedulerImpl: Removed TaskSet 259.0, whose tasks have
all completed, from pool default
17/04/12 16:03:48 INFO scheduler.DAGScheduler: ResultStage 259 (collect at SparkExecutionContext.java:796)
finished in 0.005 s
17/04/12 16:03:48 INFO scheduler.DAGScheduler: Registering RDD 725 (flatMapToPair at RDDConverterUtils.java:280)
17/04/12 16:03:48 INFO scheduler.DAGScheduler: Got job 193 (collectAsList at MLContextTest.java:1325)
with 1 output partitions
17/04/12 16:03:48 INFO scheduler.DAGScheduler: Final stage: ResultStage 261 (collectAsList
at MLContextTest.java:1325)
17/04/12 16:03:48 INFO scheduler.DAGScheduler: Parents of final stage: List(ShuffleMapStage
260)
17/04/12 16:03:48 INFO scheduler.DAGScheduler: Missing parents: List(ShuffleMapStage 260)
17/04/12 16:03:48 INFO scheduler.DAGScheduler: Submitting ShuffleMapStage 260 (MapPartitionsRDD[725]
at flatMapToPair at RDDConverterUtils.java:280), which has no missing parents
17/04/12 16:03:48 INFO memory.MemoryStore: Block broadcast_260 stored as values in memory
(estimated size 3.9 KB, free 1025.1 MB)
17/04/12 16:03:48 INFO memory.MemoryStore: Block broadcast_260_piece0 stored as bytes in memory
(estimated size 2.2 KB, free 1025.1 MB)
17/04/12 16:03:48 INFO storage.BlockManagerInfo: Added broadcast_260_piece0 in memory on 169.54.146.43:48913
(size: 2.2 KB, free: 1025.6 MB)
17/04/12 16:03:48 INFO spark.SparkContext: Created broadcast 260 from broadcast at DAGScheduler.scala:996
17/04/12 16:03:48 INFO scheduler.DAGScheduler: Submitting 1 missing tasks from ShuffleMapStage
260 (MapPartitionsRDD[725] at flatMapToPair at RDDConverterUtils.java:280)
17/04/12 16:03:48 INFO scheduler.TaskSchedulerImpl: Adding task set 260.0 with 1 tasks
17/04/12 16:03:48 INFO scheduler.FairSchedulableBuilder: Added task set TaskSet_260.0 tasks
to pool default
17/04/12 16:03:48 INFO scheduler.TaskSetManager: Starting task 0.0 in stage 260.0 (TID 270,
localhost, executor driver, partition 0, PROCESS_LOCAL, 6218 bytes)
17/04/12 16:03:48 INFO executor.Executor: Running task 0.0 in stage 260.0 (TID 270)
17/04/12 16:03:48 INFO executor.Executor: Finished task 0.0 in stage 260.0 (TID 270). 1253
bytes result sent to driver
17/04/12 16:03:48 INFO scheduler.TaskSetManager: Finished task 0.0 in stage 260.0 (TID 270)
in 5 ms on localhost (executor driver) (1/1)
17/04/12 16:03:48 INFO scheduler.TaskSchedulerImpl: Removed TaskSet 260.0, whose tasks have
all completed, from pool default
17/04/12 16:03:48 INFO scheduler.DAGScheduler: ShuffleMapStage 260 (flatMapToPair at RDDConverterUtils.java:280)
finished in 0.005 s
17/04/12 16:03:48 INFO scheduler.DAGScheduler: looking for newly runnable stages
17/04/12 16:03:48 INFO scheduler.DAGScheduler: running: Set()
17/04/12 16:03:48 INFO scheduler.DAGScheduler: waiting: Set(ResultStage 261)
17/04/12 16:03:48 INFO scheduler.DAGScheduler: failed: Set()
17/04/12 16:03:48 INFO scheduler.DAGScheduler: Submitting ResultStage 261 (MapPartitionsRDD[731]
at collectAsList at MLContextTest.java:1325), which has no missing parents
17/04/12 16:03:48 INFO memory.MemoryStore: Block broadcast_261 stored as values in memory
(estimated size 11.3 KB, free 1025.0 MB)
17/04/12 16:03:48 INFO memory.MemoryStore: Block broadcast_261_piece0 stored as bytes in memory
(estimated size 5.6 KB, free 1025.0 MB)
17/04/12 16:03:48 INFO storage.BlockManagerInfo: Added broadcast_261_piece0 in memory on 169.54.146.43:48913
(size: 5.6 KB, free: 1025.6 MB)
17/04/12 16:03:48 INFO spark.SparkContext: Created broadcast 261 from broadcast at DAGScheduler.scala:996
17/04/12 16:03:48 INFO scheduler.DAGScheduler: Submitting 1 missing tasks from ResultStage
261 (MapPartitionsRDD[731] at collectAsList at MLContextTest.java:1325)
17/04/12 16:03:48 INFO scheduler.TaskSchedulerImpl: Adding task set 261.0 with 1 tasks
17/04/12 16:03:48 INFO scheduler.FairSchedulableBuilder: Added task set TaskSet_261.0 tasks
to pool default
17/04/12 16:03:48 INFO scheduler.TaskSetManager: Starting task 0.0 in stage 261.0 (TID 271,
localhost, executor driver, partition 0, ANY, 5783 bytes)
17/04/12 16:03:48 INFO executor.Executor: Running task 0.0 in stage 261.0 (TID 271)
17/04/12 16:03:48 INFO storage.ShuffleBlockFetcherIterator: Getting 1 non-empty blocks out
of 1 blocks
17/04/12 16:03:48 INFO storage.ShuffleBlockFetcherIterator: Started 0 remote fetches in 0
ms
17/04/12 16:03:48 INFO executor.Executor: Finished task 0.0 in stage 261.0 (TID 271). 2024
bytes result sent to driver
17/04/12 16:03:48 INFO scheduler.TaskSetManager: Finished task 0.0 in stage 261.0 (TID 271)
in 9 ms on localhost (executor driver) (1/1)
17/04/12 16:03:48 INFO scheduler.TaskSchedulerImpl: Removed TaskSet 261.0, whose tasks have
all completed, from pool default
17/04/12 16:03:49 INFO scheduler.DAGScheduler: ResultStage 261 (collectAsList at MLContextTest.java:1325)
finished in 0.010 s
17/04/12 16:03:49 INFO server.ServerConnector: Stopped ServerConnector@78e01ba4{HTTP/1.1}{0.0.0.0:4040}
17/04/12 16:03:49 INFO handler.ContextHandler: Stopped o.s.j.s.ServletContextHandler@2b5d89ce{/stages/stage/kill,null,UNAVAILABLE}
17/04/12 16:03:49 INFO handler.ContextHandler: Stopped o.s.j.s.ServletContextHandler@16880339{/jobs/job/kill,null,UNAVAILABLE}
17/04/12 16:03:49 INFO handler.ContextHandler: Stopped o.s.j.s.ServletContextHandler@4769a6c{/api,null,UNAVAILABLE}
17/04/12 16:03:49 INFO handler.ContextHandler: Stopped o.s.j.s.ServletContextHandler@6a742fb5{/,null,UNAVAILABLE}
17/04/12 16:03:49 INFO handler.ContextHandler: Stopped o.s.j.s.ServletContextHandler@4f6e40d6{/static,null,UNAVAILABLE}
17/04/12 16:03:49 INFO handler.ContextHandler: Stopped o.s.j.s.ServletContextHandler@1e4195be{/executors/threadDump/json,null,UNAVAILABLE}
17/04/12 16:03:49 INFO handler.ContextHandler: Stopped o.s.j.s.ServletContextHandler@3c8a4cc3{/executors/threadDump,null,UNAVAILABLE}
17/04/12 16:03:49 INFO handler.ContextHandler: Stopped o.s.j.s.ServletContextHandler@a35f147{/executors/json,null,UNAVAILABLE}
17/04/12 16:03:49 INFO handler.ContextHandler: Stopped o.s.j.s.ServletContextHandler@2ba6888{/executors,null,UNAVAILABLE}
17/04/12 16:03:49 INFO handler.ContextHandler: Stopped o.s.j.s.ServletContextHandler@3d93ff4b{/environment/json,null,UNAVAILABLE}
17/04/12 16:03:49 INFO handler.ContextHandler: Stopped o.s.j.s.ServletContextHandler@26620d77{/environment,null,UNAVAILABLE}
17/04/12 16:03:49 INFO handler.ContextHandler: Stopped o.s.j.s.ServletContextHandler@11f32e86{/storage/rdd/json,null,UNAVAILABLE}
17/04/12 16:03:49 INFO handler.ContextHandler: Stopped o.s.j.s.ServletContextHandler@36e13ef7{/storage/rdd,null,UNAVAILABLE}
17/04/12 16:03:49 INFO handler.ContextHandler: Stopped o.s.j.s.ServletContextHandler@50096c7c{/storage/json,null,UNAVAILABLE}
17/04/12 16:03:49 INFO handler.ContextHandler: Stopped o.s.j.s.ServletContextHandler@551c5758{/storage,null,UNAVAILABLE}
17/04/12 16:03:49 INFO handler.ContextHandler: Stopped o.s.j.s.ServletContextHandler@492dd30e{/stages/pool/json,null,UNAVAILABLE}
17/04/12 16:03:49 INFO handler.ContextHandler: Stopped o.s.j.s.ServletContextHandler@273826cc{/stages/pool,null,UNAVAILABLE}
17/04/12 16:03:49 INFO handler.ContextHandler: Stopped o.s.j.s.ServletContextHandler@691d81b6{/stages/stage/json,null,UNAVAILABLE}
17/04/12 16:03:49 INFO handler.ContextHandler: Stopped o.s.j.s.ServletContextHandler@416ba8c3{/stages/stage,null,UNAVAILABLE}
17/04/12 16:03:49 INFO handler.ContextHandler: Stopped o.s.j.s.ServletContextHandler@3d6a722f{/stages/json,null,UNAVAILABLE}
17/04/12 16:03:49 INFO handler.ContextHandler: Stopped o.s.j.s.ServletContextHandler@56631108{/stages,null,UNAVAILABLE}
17/04/12 16:03:49 INFO handler.ContextHandler: Stopped o.s.j.s.ServletContextHandler@36e3c7a7{/jobs/job/json,null,UNAVAILABLE}
17/04/12 16:03:49 INFO handler.ContextHandler: Stopped o.s.j.s.ServletContextHandler@93eb871{/jobs/job,null,UNAVAILABLE}
17/04/12 16:03:49 INFO handler.ContextHandler: Stopped o.s.j.s.ServletContextHandler@7bd9bf0{/jobs/json,null,UNAVAILABLE}
17/04/12 16:03:49 INFO handler.ContextHandler: Stopped o.s.j.s.ServletContextHandler@7522b853{/jobs,null,UNAVAILABLE}
17/04/12 16:03:49 INFO ui.SparkUI: Stopped Spark web UI at http://169.54.146.43:4040
17/04/12 16:03:49 INFO spark.MapOutputTrackerMasterEndpoint: MapOutputTrackerMasterEndpoint
stopped!
17/04/12 16:03:49 INFO memory.MemoryStore: MemoryStore cleared
17/04/12 16:03:49 INFO storage.BlockManager: BlockManager stopped
17/04/12 16:03:49 INFO storage.BlockManagerMaster: BlockManagerMaster stopped
17/04/12 16:03:49 INFO scheduler.OutputCommitCoordinator$OutputCommitCoordinatorEndpoint:
OutputCommitCoordinator stopped!
17/04/12 16:03:49 INFO spark.SparkContext: Successfully stopped SparkContext
Running org.apache.sysml.test.integration.mlcontext.MLContextTest
Tests run: 175, Failures: 0, Errors: 0, Skipped: 0, Time elapsed: 15.232 sec - in org.apache.sysml.test.integration.mlcontext.MLContextTest
17/04/12 16:03:49 INFO util.ShutdownHookManager: Shutdown hook called
17/04/12 16:03:49 INFO util.ShutdownHookManager: Deleting directory /tmp/spark-1b81d607-536d-412f-b774-92333f6ea037
Running org.apache.sysml.test.integration.functions.quaternary.WeightedSigmoidTest
Tests run: 56, Failures: 0, Errors: 0, Skipped: 0, Time elapsed: 1,024.95 sec - in org.apache.sysml.test.integration.functions.quaternary.WeightedSigmoidTest
17/04/12 16:05:38 INFO util.ShutdownHookManager: Shutdown hook called
17/04/12 16:05:38 INFO util.ShutdownHookManager: Deleting directory /tmp/spark-fcdd068c-55c4-46b5-a3f1-d1fbf52b0a71
Running org.apache.sysml.test.integration.functions.append.AppendVectorTest
Tests run: 6, Failures: 0, Errors: 0, Skipped: 0, Time elapsed: 387.815 sec - in org.apache.sysml.test.integration.functions.append.AppendVectorTest
Running org.apache.sysml.test.integration.functions.indexing.LeftIndexingTest
Tests run: 3, Failures: 0, Errors: 0, Skipped: 0, Time elapsed: 662.673 sec - in org.apache.sysml.test.integration.functions.indexing.LeftIndexingTest
Running org.apache.sysml.test.integration.applications.descriptivestats.UnivariateUnweightedScaleDenseTest
Tests run: 24, Failures: 0, Errors: 0, Skipped: 0, Time elapsed: 352.857 sec - in org.apache.sysml.test.integration.applications.descriptivestats.UnivariateUnweightedScaleDenseTest
Running org.apache.sysml.test.integration.functions.reorg.FullOrderTest
Tests run: 132, Failures: 0, Errors: 0, Skipped: 0, Time elapsed: 1,342.307 sec - in org.apache.sysml.test.integration.functions.reorg.FullOrderTest
Running org.apache.sysml.test.integration.applications.parfor.ParForCorrelationTest
Tests run: 12, Failures: 0, Errors: 0, Skipped: 0, Time elapsed: 305.437 sec - in org.apache.sysml.test.integration.applications.parfor.ParForCorrelationTest
Running org.apache.sysml.test.integration.applications.parfor.ParForCorrelationTestLarge
Tests run: 2, Failures: 0, Errors: 0, Skipped: 0, Time elapsed: 42.147 sec - in org.apache.sysml.test.integration.applications.parfor.ParForCorrelationTestLarge
Running org.apache.sysml.test.integration.functions.quaternary.WeightedDivMatrixMultTest
Tests run: 90, Failures: 0, Errors: 0, Skipped: 0, Time elapsed: 1,525.217 sec - in org.apache.sysml.test.integration.functions.quaternary.WeightedDivMatrixMultTest
17/04/12 16:12:18 INFO util.ShutdownHookManager: Shutdown hook called
17/04/12 16:12:18 INFO util.ShutdownHookManager: Deleting directory /tmp/spark-268c37d6-78cb-4093-a891-583b5bbfed3f
Running org.apache.sysml.test.integration.applications.descriptivestats.UnivariateWeightedScaleDenseTest
Tests run: 24, Failures: 0, Errors: 0, Skipped: 0, Time elapsed: 349.343 sec - in org.apache.sysml.test.integration.applications.descriptivestats.UnivariateWeightedScaleDenseTest
Running org.apache.sysml.test.integration.functions.append.AppendChainTest
Tests run: 12, Failures: 0, Errors: 0, Skipped: 0, Time elapsed: 1,055.113 sec - in org.apache.sysml.test.integration.functions.append.AppendChainTest
Running org.apache.sysml.test.integration.applications.parfor.ParForNaiveBayesTest
Tests run: 10, Failures: 0, Errors: 0, Skipped: 0, Time elapsed: 541.625 sec - in org.apache.sysml.test.integration.applications.parfor.ParForNaiveBayesTest
Running org.apache.sysml.test.integration.applications.descriptivestats.UnivariateUnweightedScaleSparseTest
Tests run: 24, Failures: 0, Errors: 0, Skipped: 0, Time elapsed: 274.072 sec - in org.apache.sysml.test.integration.applications.descriptivestats.UnivariateUnweightedScaleSparseTest
Running org.apache.sysml.test.integration.applications.dml.HITSDMLTest
Tests run: 1, Failures: 0, Errors: 0, Skipped: 0, Time elapsed: 95.352 sec - in org.apache.sysml.test.integration.applications.dml.HITSDMLTest
Running org.apache.sysml.test.integration.applications.descriptivestats.UnivariateWeightedScaleSparseTest
Tests run: 24, Failures: 0, Errors: 0, Skipped: 0, Time elapsed: 339.8 sec - in org.apache.sysml.test.integration.applications.descriptivestats.UnivariateWeightedScaleSparseTest
Running org.apache.sysml.test.integration.functions.append.AppendMatrixTest
Tests run: 22, Failures: 0, Errors: 0, Skipped: 0, Time elapsed: 1,532.605 sec - in org.apache.sysml.test.integration.functions.append.AppendMatrixTest
Running org.apache.sysml.test.integration.applications.pydml.ArimaPyDMLTest
Tests run: 1, Failures: 0, Errors: 0, Skipped: 0, Time elapsed: 50.114 sec - in org.apache.sysml.test.integration.applications.pydml.ArimaPyDMLTest
Running org.apache.sysml.test.integration.applications.pydml.HITSPyDMLTest
Tests run: 1, Failures: 0, Errors: 0, Skipped: 0, Time elapsed: 77.534 sec - in org.apache.sysml.test.integration.applications.pydml.HITSPyDMLTest
Running org.apache.sysml.test.integration.applications.dml.LinearRegressionDMLTest
Tests run: 7, Failures: 0, Errors: 0, Skipped: 0, Time elapsed: 50.478 sec - in org.apache.sysml.test.integration.applications.dml.LinearRegressionDMLTest
Running org.apache.sysml.test.integration.applications.pydml.CsplineDSPyDMLTest
Tests run: 3, Failures: 0, Errors: 0, Skipped: 0, Time elapsed: 6.648 sec - in org.apache.sysml.test.integration.applications.pydml.CsplineDSPyDMLTest
Running org.apache.sysml.test.integration.applications.pydml.LinearLogRegPyDMLTest
Tests run: 7, Failures: 0, Errors: 0, Skipped: 0, Time elapsed: 88.811 sec - in org.apache.sysml.test.integration.applications.pydml.LinearLogRegPyDMLTest
Running org.apache.sysml.test.integration.applications.pydml.NaiveBayesPyDMLTest
Tests run: 6, Failures: 0, Errors: 0, Skipped: 0, Time elapsed: 81.521 sec - in org.apache.sysml.test.integration.applications.pydml.NaiveBayesPyDMLTest
Running org.apache.sysml.test.integration.applications.dml.CsplineCGDMLTest
Tests run: 3, Failures: 0, Errors: 0, Skipped: 0, Time elapsed: 14.697 sec - in org.apache.sysml.test.integration.applications.dml.CsplineCGDMLTest
Running org.apache.sysml.test.integration.applications.dml.L2SVMDMLTest
Tests run: 9, Failures: 0, Errors: 0, Skipped: 0, Time elapsed: 64.192 sec - in org.apache.sysml.test.integration.applications.dml.L2SVMDMLTest
Running org.apache.sysml.test.integration.applications.pydml.MDABivariateStatsPyDMLTest
Tests run: 4, Failures: 0, Errors: 0, Skipped: 0, Time elapsed: 298.377 sec - in org.apache.sysml.test.integration.applications.pydml.MDABivariateStatsPyDMLTest
Running org.apache.sysml.test.integration.applications.pydml.PageRankPyDMLTest
Tests run: 3, Failures: 0, Errors: 0, Skipped: 0, Time elapsed: 8.354 sec - in org.apache.sysml.test.integration.applications.pydml.PageRankPyDMLTest
Running org.apache.sysml.test.integration.applications.pydml.NaiveBayesParforPyDMLTest
Tests run: 6, Failures: 0, Errors: 0, Skipped: 0, Time elapsed: 81.659 sec - in org.apache.sysml.test.integration.applications.pydml.NaiveBayesParforPyDMLTest
Running org.apache.sysml.test.integration.applications.dml.NaiveBayesDMLTest
Tests run: 6, Failures: 0, Errors: 0, Skipped: 0, Time elapsed: 81.113 sec - in org.apache.sysml.test.integration.applications.dml.NaiveBayesDMLTest
Running org.apache.sysml.test.integration.applications.dml.MDABivariateStatsDMLTest
Tests run: 4, Failures: 0, Errors: 0, Skipped: 0, Time elapsed: 294.595 sec - in org.apache.sysml.test.integration.applications.dml.MDABivariateStatsDMLTest
Running org.apache.sysml.test.integration.applications.dml.PageRankDMLTest
Tests run: 3, Failures: 0, Errors: 0, Skipped: 0, Time elapsed: 8.425 sec - in org.apache.sysml.test.integration.applications.dml.PageRankDMLTest
Running org.apache.sysml.test.integration.applications.pydml.GLMPyDMLTest
Tests run: 30, Failures: 0, Errors: 0, Skipped: 0, Time elapsed: 588.568 sec - in org.apache.sysml.test.integration.applications.pydml.GLMPyDMLTest
Running org.apache.sysml.test.integration.applications.pydml.MultiClassSVMPyDMLTest
Tests run: 9, Failures: 0, Errors: 0, Skipped: 0, Time elapsed: 90.913 sec - in org.apache.sysml.test.integration.applications.pydml.MultiClassSVMPyDMLTest
Running org.apache.sysml.test.integration.applications.dml.ID3DMLTest
Tests run: 2, Failures: 0, Errors: 0, Skipped: 0, Time elapsed: 403.264 sec - in org.apache.sysml.test.integration.applications.dml.ID3DMLTest
Running org.apache.sysml.test.integration.applications.dml.GLMDMLTest
Tests run: 30, Failures: 0, Errors: 0, Skipped: 0, Time elapsed: 889.336 sec - in org.apache.sysml.test.integration.applications.dml.GLMDMLTest
Running org.apache.sysml.test.integration.applications.pydml.CsplineCGPyDMLTest
Tests run: 3, Failures: 0, Errors: 0, Skipped: 0, Time elapsed: 6.079 sec - in org.apache.sysml.test.integration.applications.pydml.CsplineCGPyDMLTest
Running org.apache.sysml.test.integration.applications.pydml.WelchTPyDMLTest
Tests run: 3, Failures: 0, Errors: 0, Skipped: 0, Time elapsed: 6.514 sec - in org.apache.sysml.test.integration.applications.pydml.WelchTPyDMLTest
Running org.apache.sysml.test.integration.applications.dml.MultiClassSVMDMLTest
Tests run: 9, Failures: 0, Errors: 0, Skipped: 0, Time elapsed: 88.412 sec - in org.apache.sysml.test.integration.applications.dml.MultiClassSVMDMLTest
Running org.apache.sysml.test.integration.applications.dml.CsplineDSDMLTest
Tests run: 3, Failures: 0, Errors: 0, Skipped: 0, Time elapsed: 13.049 sec - in org.apache.sysml.test.integration.applications.dml.CsplineDSDMLTest
Running org.apache.sysml.test.integration.applications.pydml.ApplyTransformPyDMLTest
Tests run: 7, Failures: 0, Errors: 0, Skipped: 0, Time elapsed: 0.934 sec - in org.apache.sysml.test.integration.applications.pydml.ApplyTransformPyDMLTest
Running org.apache.sysml.test.integration.applications.dml.NaiveBayesParforDMLTest
Tests run: 6, Failures: 0, Errors: 0, Skipped: 0, Time elapsed: 80.846 sec - in org.apache.sysml.test.integration.applications.dml.NaiveBayesParforDMLTest
Running org.apache.sysml.test.integration.applications.pydml.L2SVMPyDMLTest
Tests run: 9, Failures: 0, Errors: 0, Skipped: 0, Time elapsed: 64.666 sec - in org.apache.sysml.test.integration.applications.pydml.L2SVMPyDMLTest
Running org.apache.sysml.test.integration.applications.pydml.LinearRegressionPyDMLTest
Tests run: 7, Failures: 0, Errors: 0, Skipped: 0, Time elapsed: 51.608 sec - in org.apache.sysml.test.integration.applications.pydml.LinearRegressionPyDMLTest
Running org.apache.sysml.test.integration.applications.dml.LinearLogRegDMLTest
Tests run: 7, Failures: 0, Errors: 0, Skipped: 0, Time elapsed: 61.313 sec - in org.apache.sysml.test.integration.applications.dml.LinearLogRegDMLTest
Running org.apache.sysml.test.integration.applications.dml.GNMFDMLTest
Tests run: 3, Failures: 0, Errors: 0, Skipped: 0, Time elapsed: 56.126 sec - in org.apache.sysml.test.integration.applications.dml.GNMFDMLTest
Running org.apache.sysml.test.integration.applications.dml.WelchTDMLTest
Tests run: 3, Failures: 0, Errors: 0, Skipped: 0, Time elapsed: 6.394 sec - in org.apache.sysml.test.integration.applications.dml.WelchTDMLTest
Running org.apache.sysml.test.integration.applications.dml.ApplyTransformDMLTest
Tests run: 7, Failures: 0, Errors: 0, Skipped: 0, Time elapsed: 14.915 sec - in org.apache.sysml.test.integration.applications.dml.ApplyTransformDMLTest
Running org.apache.sysml.test.integration.applications.pydml.ID3PyDMLTest
Tests run: 2, Failures: 0, Errors: 0, Skipped: 0, Time elapsed: 378.413 sec - in org.apache.sysml.test.integration.applications.pydml.ID3PyDMLTest
Running org.apache.sysml.test.integration.applications.pydml.GNMFPyDMLTest
Tests run: 3, Failures: 0, Errors: 0, Skipped: 0, Time elapsed: 57.255 sec - in org.apache.sysml.test.integration.applications.pydml.GNMFPyDMLTest

Results :

Failed tests: 
  RightIndexingMatrixTest>AutomatedTestBase.tearDown:1481 Detailed matrices characteristics:
!  B-DML<->B-R # stored values in B-R: 123
!  B-DML<->B-R # stored values in B-DML: 123
!  B-DML<->B-R identical values(z=0): 0
!  B-DML<->B-R wrong values(z=1.0E-10): 123
!  B-DML<->B-R min error: 0.11901944986265622
!  B-DML<->B-R max error: 99.366155910768
    C-DML<->C-R # stored values in C-R: 352432
    C-DML<->C-R # stored values in C-DML: 352432
    C-DML<->C-R identical values(z=0): 352399
    C-DML<->C-R wrong values(z=1.0E-10): 0
    C-DML<->C-R min error: 0.0
    C-DML<->C-R max error: 1.4210854715202004E-14
    D-DML<->D-R # stored values in D-R: 268293
    D-DML<->D-R # stored values in D-DML: 268293
    D-DML<->D-R identical values(z=0): 268265
    D-DML<->D-R wrong values(z=1.0E-10): 0
    D-DML<->D-R min error: 0.0
    D-DML<->D-R max error: 1.4210854715202004E-14


Tests run: 6871, Failures: 1, Errors: 0, Skipped: 0

[INFO] 
[INFO] --- maven-failsafe-plugin:2.17:verify (default) @ systemml ---
[INFO] Failsafe report directory: <https://sparktc.ibmcloud.com/jenkins/job/SystemML-DailyTest/ws/target/failsafe-reports>
[INFO] ------------------------------------------------------------------------
[INFO] BUILD FAILURE
[INFO] ------------------------------------------------------------------------
[INFO] Total time: 02:33 h
[INFO] Finished at: 2017-04-12T17:11:45-05:00
[INFO] Final Memory: 63M/2464M
[INFO] ------------------------------------------------------------------------
[ERROR] Failed to execute goal org.apache.maven.plugins:maven-failsafe-plugin:2.17:verify
(default) on project systemml: There are test failures.
[ERROR] 
[ERROR] Please refer to <https://sparktc.ibmcloud.com/jenkins/job/SystemML-DailyTest/ws/target/failsafe-reports>
for the individual test results.
[ERROR] -> [Help 1]
[ERROR] 
[ERROR] To see the full stack trace of the errors, re-run Maven with the -e switch.
[ERROR] Re-run Maven using the -X switch to enable full debug logging.
[ERROR] 
[ERROR] For more information about the errors and possible solutions, please read the following
articles:
[ERROR] [Help 1] http://cwiki.apache.org/confluence/display/MAVEN/MojoFailureException
Build step 'Execute shell' marked build as failure
Run condition [Always] enabling perform for step [[]]

Mime
View raw message