systemml-dev mailing list archives

Site index · List index
Message view « Date » · « Thread »
Top « Date » · « Thread »
From jenk...@spark.tc
Subject Build failed in Jenkins: SystemML-DailyTest #951
Date Tue, 25 Apr 2017 22:46:22 GMT
See <https://sparktc.ibmcloud.com/jenkins/job/SystemML-DailyTest/951/changes>

Changes:

[Arvind Surve] [SYSTEMML-1440] Automate Release Artifact verification

------------------------------------------
[...truncated 27687 lines...]
17/04/25 15:54:53 INFO storage.ShuffleBlockFetcherIterator: Started 0 remote fetches in 0
ms
17/04/25 15:54:53 INFO executor.Executor: Finished task 0.0 in stage 261.0 (TID 271). 2024
bytes result sent to driver
17/04/25 15:54:53 INFO scheduler.TaskSetManager: Finished task 0.0 in stage 261.0 (TID 271)
in 7 ms on localhost (executor driver) (1/1)
17/04/25 15:54:53 INFO scheduler.TaskSchedulerImpl: Removed TaskSet 261.0, whose tasks have
all completed, from pool default
17/04/25 15:54:53 INFO scheduler.DAGScheduler: ResultStage 261 (collectAsList at MLContextTest.java:1325)
finished in 0.008 s
17/04/25 15:54:53 INFO server.ServerConnector: Stopped ServerConnector@7b9c2b43{HTTP/1.1}{0.0.0.0:4040}
17/04/25 15:54:53 INFO handler.ContextHandler: Stopped o.s.j.s.ServletContextHandler@66c51362{/stages/stage/kill,null,UNAVAILABLE}
17/04/25 15:54:53 INFO handler.ContextHandler: Stopped o.s.j.s.ServletContextHandler@cd597d8{/jobs/job/kill,null,UNAVAILABLE}
17/04/25 15:54:53 INFO handler.ContextHandler: Stopped o.s.j.s.ServletContextHandler@580de8cf{/api,null,UNAVAILABLE}
17/04/25 15:54:53 INFO handler.ContextHandler: Stopped o.s.j.s.ServletContextHandler@58c3df4a{/,null,UNAVAILABLE}
17/04/25 15:54:53 INFO handler.ContextHandler: Stopped o.s.j.s.ServletContextHandler@4ec497cf{/static,null,UNAVAILABLE}
17/04/25 15:54:53 INFO handler.ContextHandler: Stopped o.s.j.s.ServletContextHandler@c4b18fe{/executors/threadDump/json,null,UNAVAILABLE}
17/04/25 15:54:53 INFO handler.ContextHandler: Stopped o.s.j.s.ServletContextHandler@48190aef{/executors/threadDump,null,UNAVAILABLE}
17/04/25 15:54:53 INFO handler.ContextHandler: Stopped o.s.j.s.ServletContextHandler@1fd1380d{/executors/json,null,UNAVAILABLE}
17/04/25 15:54:53 INFO handler.ContextHandler: Stopped o.s.j.s.ServletContextHandler@56129bfb{/executors,null,UNAVAILABLE}
17/04/25 15:54:53 INFO handler.ContextHandler: Stopped o.s.j.s.ServletContextHandler@33bef51f{/environment/json,null,UNAVAILABLE}
17/04/25 15:54:53 INFO handler.ContextHandler: Stopped o.s.j.s.ServletContextHandler@276e0e26{/environment,null,UNAVAILABLE}
17/04/25 15:54:53 INFO handler.ContextHandler: Stopped o.s.j.s.ServletContextHandler@59d20b07{/storage/rdd/json,null,UNAVAILABLE}
17/04/25 15:54:53 INFO handler.ContextHandler: Stopped o.s.j.s.ServletContextHandler@60c0a122{/storage/rdd,null,UNAVAILABLE}
17/04/25 15:54:53 INFO handler.ContextHandler: Stopped o.s.j.s.ServletContextHandler@4a5bd3ff{/storage/json,null,UNAVAILABLE}
17/04/25 15:54:53 INFO handler.ContextHandler: Stopped o.s.j.s.ServletContextHandler@59e4e4c7{/storage,null,UNAVAILABLE}
17/04/25 15:54:53 INFO handler.ContextHandler: Stopped o.s.j.s.ServletContextHandler@2dc28d30{/stages/pool/json,null,UNAVAILABLE}
17/04/25 15:54:53 INFO handler.ContextHandler: Stopped o.s.j.s.ServletContextHandler@13e73acc{/stages/pool,null,UNAVAILABLE}
17/04/25 15:54:53 INFO handler.ContextHandler: Stopped o.s.j.s.ServletContextHandler@76acb014{/stages/stage/json,null,UNAVAILABLE}
17/04/25 15:54:53 INFO handler.ContextHandler: Stopped o.s.j.s.ServletContextHandler@59e5a6e1{/stages/stage,null,UNAVAILABLE}
17/04/25 15:54:53 INFO handler.ContextHandler: Stopped o.s.j.s.ServletContextHandler@6c6a4e3e{/stages/json,null,UNAVAILABLE}
17/04/25 15:54:53 INFO handler.ContextHandler: Stopped o.s.j.s.ServletContextHandler@3d3b02b7{/stages,null,UNAVAILABLE}
17/04/25 15:54:53 INFO handler.ContextHandler: Stopped o.s.j.s.ServletContextHandler@74bb7ba2{/jobs/job/json,null,UNAVAILABLE}
17/04/25 15:54:53 INFO handler.ContextHandler: Stopped o.s.j.s.ServletContextHandler@86b78d{/jobs/job,null,UNAVAILABLE}
17/04/25 15:54:53 INFO handler.ContextHandler: Stopped o.s.j.s.ServletContextHandler@2a1f73f5{/jobs/json,null,UNAVAILABLE}
17/04/25 15:54:53 INFO handler.ContextHandler: Stopped o.s.j.s.ServletContextHandler@fb8ce2c{/jobs,null,UNAVAILABLE}
17/04/25 15:54:53 INFO ui.SparkUI: Stopped Spark web UI at http://169.54.146.43:4040
17/04/25 15:54:53 INFO spark.MapOutputTrackerMasterEndpoint: MapOutputTrackerMasterEndpoint
stopped!
17/04/25 15:54:53 INFO memory.MemoryStore: MemoryStore cleared
17/04/25 15:54:53 INFO storage.BlockManager: BlockManager stopped
17/04/25 15:54:53 INFO storage.BlockManagerMaster: BlockManagerMaster stopped
17/04/25 15:54:53 INFO scheduler.OutputCommitCoordinator$OutputCommitCoordinatorEndpoint:
OutputCommitCoordinator stopped!
17/04/25 15:54:53 INFO spark.SparkContext: Successfully stopped SparkContext
Running org.apache.sysml.test.integration.mlcontext.MLContextTest
Tests run: 177, Failures: 0, Errors: 0, Skipped: 0, Time elapsed: 11.312 sec - in org.apache.sysml.test.integration.mlcontext.MLContextTest
17/04/25 15:54:53 INFO util.ShutdownHookManager: Shutdown hook called
17/04/25 15:54:53 INFO util.ShutdownHookManager: Deleting directory /tmp/spark-4f4c0ef0-c68d-48fb-bedc-fa497ebc170a
Running org.apache.sysml.test.integration.functions.quaternary.WeightedSigmoidTest
Tests run: 56, Failures: 0, Errors: 0, Skipped: 0, Time elapsed: 985.542 sec - in org.apache.sysml.test.integration.functions.quaternary.WeightedSigmoidTest
17/04/25 15:56:04 INFO util.ShutdownHookManager: Shutdown hook called
17/04/25 15:56:04 INFO util.ShutdownHookManager: Deleting directory /tmp/spark-c1a0022c-ee8f-4581-a018-06a915cab5f6
Running org.apache.sysml.test.integration.functions.append.AppendVectorTest
Tests run: 6, Failures: 0, Errors: 0, Skipped: 0, Time elapsed: 347.435 sec - in org.apache.sysml.test.integration.functions.append.AppendVectorTest
Running org.apache.sysml.test.integration.functions.indexing.LeftIndexingTest
Tests run: 3, Failures: 0, Errors: 0, Skipped: 0, Time elapsed: 635.036 sec - in org.apache.sysml.test.integration.functions.indexing.LeftIndexingTest
Running org.apache.sysml.test.integration.functions.reorg.FullOrderTest
Tests run: 132, Failures: 0, Errors: 0, Skipped: 0, Time elapsed: 1,319.219 sec - in org.apache.sysml.test.integration.functions.reorg.FullOrderTest
Running org.apache.sysml.test.integration.applications.descriptivestats.UnivariateUnweightedScaleDenseTest
Tests run: 24, Failures: 0, Errors: 0, Skipped: 0, Time elapsed: 336.077 sec - in org.apache.sysml.test.integration.applications.descriptivestats.UnivariateUnweightedScaleDenseTest
Running org.apache.sysml.test.integration.applications.parfor.ParForCorrelationTest
Tests run: 12, Failures: 0, Errors: 0, Skipped: 0, Time elapsed: 294.042 sec - in org.apache.sysml.test.integration.applications.parfor.ParForCorrelationTest
Running org.apache.sysml.test.integration.applications.parfor.ParForCorrelationTestLarge
Tests run: 2, Failures: 0, Errors: 0, Skipped: 0, Time elapsed: 42.015 sec - in org.apache.sysml.test.integration.applications.parfor.ParForCorrelationTestLarge
Running org.apache.sysml.test.integration.functions.quaternary.WeightedDivMatrixMultTest
Tests run: 90, Failures: 0, Errors: 0, Skipped: 0, Time elapsed: 1,491.973 sec - in org.apache.sysml.test.integration.functions.quaternary.WeightedDivMatrixMultTest
17/04/25 16:02:37 INFO util.ShutdownHookManager: Shutdown hook called
17/04/25 16:02:37 INFO util.ShutdownHookManager: Deleting directory /tmp/spark-c5ac14e3-f4d2-4fc0-85d5-c54c50b01fd1
Running org.apache.sysml.test.integration.applications.descriptivestats.UnivariateWeightedScaleDenseTest
Tests run: 24, Failures: 0, Errors: 0, Skipped: 0, Time elapsed: 333.826 sec - in org.apache.sysml.test.integration.applications.descriptivestats.UnivariateWeightedScaleDenseTest
Running org.apache.sysml.test.integration.functions.append.AppendChainTest
Tests run: 12, Failures: 0, Errors: 0, Skipped: 0, Time elapsed: 1,015.982 sec - in org.apache.sysml.test.integration.functions.append.AppendChainTest
Running org.apache.sysml.test.integration.applications.parfor.ParForNaiveBayesTest
Tests run: 10, Failures: 0, Errors: 0, Skipped: 0, Time elapsed: 519.725 sec - in org.apache.sysml.test.integration.applications.parfor.ParForNaiveBayesTest
Running org.apache.sysml.test.integration.applications.descriptivestats.UnivariateUnweightedScaleSparseTest
Tests run: 24, Failures: 0, Errors: 0, Skipped: 0, Time elapsed: 272.62 sec - in org.apache.sysml.test.integration.applications.descriptivestats.UnivariateUnweightedScaleSparseTest
Running org.apache.sysml.test.integration.applications.dml.HITSDMLTest
Tests run: 1, Failures: 0, Errors: 0, Skipped: 0, Time elapsed: 89.673 sec - in org.apache.sysml.test.integration.applications.dml.HITSDMLTest
Running org.apache.sysml.test.integration.functions.append.AppendMatrixTest
Tests run: 22, Failures: 0, Errors: 0, Skipped: 0, Time elapsed: 1,400.348 sec - in org.apache.sysml.test.integration.functions.append.AppendMatrixTest
Running org.apache.sysml.test.integration.applications.descriptivestats.UnivariateWeightedScaleSparseTest
Tests run: 24, Failures: 0, Errors: 0, Skipped: 0, Time elapsed: 333.869 sec - in org.apache.sysml.test.integration.applications.descriptivestats.UnivariateWeightedScaleSparseTest
Running org.apache.sysml.test.integration.applications.pydml.ArimaPyDMLTest
Tests run: 1, Failures: 0, Errors: 0, Skipped: 0, Time elapsed: 89.584 sec - in org.apache.sysml.test.integration.applications.pydml.ArimaPyDMLTest
Running org.apache.sysml.test.integration.applications.pydml.HITSPyDMLTest
Tests run: 1, Failures: 0, Errors: 0, Skipped: 0, Time elapsed: 182.349 sec - in org.apache.sysml.test.integration.applications.pydml.HITSPyDMLTest
Running org.apache.sysml.test.integration.applications.dml.LinearRegressionDMLTest
Tests run: 7, Failures: 0, Errors: 0, Skipped: 0, Time elapsed: 65.425 sec - in org.apache.sysml.test.integration.applications.dml.LinearRegressionDMLTest
Running org.apache.sysml.test.integration.applications.pydml.CsplineDSPyDMLTest
Tests run: 3, Failures: 0, Errors: 0, Skipped: 0, Time elapsed: 19.768 sec - in org.apache.sysml.test.integration.applications.pydml.CsplineDSPyDMLTest
Running org.apache.sysml.test.integration.applications.pydml.LinearLogRegPyDMLTest
Tests run: 7, Failures: 0, Errors: 0, Skipped: 0, Time elapsed: 158.196 sec - in org.apache.sysml.test.integration.applications.pydml.LinearLogRegPyDMLTest
Running org.apache.sysml.test.integration.applications.pydml.NaiveBayesPyDMLTest
Tests run: 6, Failures: 0, Errors: 0, Skipped: 0, Time elapsed: 118.221 sec - in org.apache.sysml.test.integration.applications.pydml.NaiveBayesPyDMLTest
Running org.apache.sysml.test.integration.applications.dml.CsplineCGDMLTest
Tests run: 3, Failures: 0, Errors: 0, Skipped: 0, Time elapsed: 13.171 sec - in org.apache.sysml.test.integration.applications.dml.CsplineCGDMLTest
Running org.apache.sysml.test.integration.applications.dml.L2SVMDMLTest
Tests run: 9, Failures: 0, Errors: 0, Skipped: 0, Time elapsed: 65.02 sec - in org.apache.sysml.test.integration.applications.dml.L2SVMDMLTest
Running org.apache.sysml.test.integration.applications.pydml.MDABivariateStatsPyDMLTest
Tests run: 4, Failures: 0, Errors: 0, Skipped: 0, Time elapsed: 481.849 sec - in org.apache.sysml.test.integration.applications.pydml.MDABivariateStatsPyDMLTest
Running org.apache.sysml.test.integration.applications.pydml.PageRankPyDMLTest
Tests run: 3, Failures: 0, Errors: 0, Skipped: 0, Time elapsed: 14.478 sec - in org.apache.sysml.test.integration.applications.pydml.PageRankPyDMLTest
Running org.apache.sysml.test.integration.applications.pydml.NaiveBayesParforPyDMLTest
Tests run: 6, Failures: 0, Errors: 0, Skipped: 0, Time elapsed: 118.837 sec - in org.apache.sysml.test.integration.applications.pydml.NaiveBayesParforPyDMLTest
Running org.apache.sysml.test.integration.applications.dml.NaiveBayesDMLTest
Tests run: 6, Failures: 0, Errors: 0, Skipped: 0, Time elapsed: 184.338 sec - in org.apache.sysml.test.integration.applications.dml.NaiveBayesDMLTest
Running org.apache.sysml.test.integration.applications.dml.MDABivariateStatsDMLTest
Tests run: 4, Failures: 0, Errors: 0, Skipped: 0, Time elapsed: 618.433 sec - in org.apache.sysml.test.integration.applications.dml.MDABivariateStatsDMLTest
Running org.apache.sysml.test.integration.applications.dml.PageRankDMLTest
Tests run: 3, Failures: 0, Errors: 0, Skipped: 0, Time elapsed: 21.027 sec - in org.apache.sysml.test.integration.applications.dml.PageRankDMLTest
Running org.apache.sysml.test.integration.applications.pydml.GLMPyDMLTest
Tests run: 30, Failures: 0, Errors: 0, Skipped: 0, Time elapsed: 1,328.078 sec - in org.apache.sysml.test.integration.applications.pydml.GLMPyDMLTest
Running org.apache.sysml.test.integration.applications.pydml.MultiClassSVMPyDMLTest
Tests run: 9, Failures: 0, Errors: 0, Skipped: 0, Time elapsed: 128.105 sec - in org.apache.sysml.test.integration.applications.pydml.MultiClassSVMPyDMLTest
Running org.apache.sysml.test.integration.applications.dml.ID3DMLTest
Tests run: 2, Failures: 0, Errors: 0, Skipped: 0, Time elapsed: 389.451 sec - in org.apache.sysml.test.integration.applications.dml.ID3DMLTest
Running org.apache.sysml.test.integration.applications.dml.GLMDMLTest
Tests run: 30, Failures: 0, Errors: 0, Skipped: 0, Time elapsed: 862.956 sec - in org.apache.sysml.test.integration.applications.dml.GLMDMLTest
Running org.apache.sysml.test.integration.applications.pydml.CsplineCGPyDMLTest
Tests run: 3, Failures: 0, Errors: 0, Skipped: 0, Time elapsed: 13.382 sec - in org.apache.sysml.test.integration.applications.pydml.CsplineCGPyDMLTest
Running org.apache.sysml.test.integration.applications.pydml.WelchTPyDMLTest
Tests run: 3, Failures: 0, Errors: 0, Skipped: 0, Time elapsed: 10.142 sec - in org.apache.sysml.test.integration.applications.pydml.WelchTPyDMLTest
Running org.apache.sysml.test.integration.applications.dml.MultiClassSVMDMLTest
Tests run: 9, Failures: 0, Errors: 0, Skipped: 0, Time elapsed: 189.696 sec - in org.apache.sysml.test.integration.applications.dml.MultiClassSVMDMLTest
Running org.apache.sysml.test.integration.applications.dml.CsplineDSDMLTest
Tests run: 3, Failures: 0, Errors: 0, Skipped: 0, Time elapsed: 13.691 sec - in org.apache.sysml.test.integration.applications.dml.CsplineDSDMLTest
Running org.apache.sysml.test.integration.applications.pydml.ApplyTransformPyDMLTest
Tests run: 7, Failures: 0, Errors: 0, Skipped: 0, Time elapsed: 2.032 sec - in org.apache.sysml.test.integration.applications.pydml.ApplyTransformPyDMLTest
Running org.apache.sysml.test.integration.applications.dml.NaiveBayesParforDMLTest
Tests run: 6, Failures: 0, Errors: 0, Skipped: 0, Time elapsed: 202.678 sec - in org.apache.sysml.test.integration.applications.dml.NaiveBayesParforDMLTest
Running org.apache.sysml.test.integration.applications.pydml.L2SVMPyDMLTest
Tests run: 9, Failures: 0, Errors: 0, Skipped: 0, Time elapsed: 131.781 sec - in org.apache.sysml.test.integration.applications.pydml.L2SVMPyDMLTest
Running org.apache.sysml.test.integration.applications.pydml.LinearRegressionPyDMLTest
Tests run: 7, Failures: 0, Errors: 0, Skipped: 0, Time elapsed: 92.869 sec - in org.apache.sysml.test.integration.applications.pydml.LinearRegressionPyDMLTest
Running org.apache.sysml.test.integration.applications.dml.LinearLogRegDMLTest
Tests run: 7, Failures: 0, Errors: 0, Skipped: 0, Time elapsed: 63.268 sec - in org.apache.sysml.test.integration.applications.dml.LinearLogRegDMLTest
Running org.apache.sysml.test.integration.applications.dml.GNMFDMLTest
Tests run: 3, Failures: 0, Errors: 0, Skipped: 0, Time elapsed: 55.831 sec - in org.apache.sysml.test.integration.applications.dml.GNMFDMLTest
Running org.apache.sysml.test.integration.applications.dml.WelchTDMLTest
Tests run: 3, Failures: 0, Errors: 0, Skipped: 0, Time elapsed: 15.353 sec - in org.apache.sysml.test.integration.applications.dml.WelchTDMLTest
Running org.apache.sysml.test.integration.applications.dml.ApplyTransformDMLTest
Tests run: 7, Failures: 0, Errors: 0, Skipped: 0, Time elapsed: 15.837 sec - in org.apache.sysml.test.integration.applications.dml.ApplyTransformDMLTest
Running org.apache.sysml.test.integration.applications.pydml.ID3PyDMLTest
Tests run: 2, Failures: 0, Errors: 0, Skipped: 0, Time elapsed: 887.598 sec - in org.apache.sysml.test.integration.applications.pydml.ID3PyDMLTest
Running org.apache.sysml.test.integration.applications.pydml.GNMFPyDMLTest
Tests run: 3, Failures: 0, Errors: 0, Skipped: 0, Time elapsed: 117.603 sec - in org.apache.sysml.test.integration.applications.pydml.GNMFPyDMLTest

Results :

Failed tests: 
  ParForDataPartitionLeftIndexingTest.testParForDataPartitionLeftindexingRowSparseMR:103->runParForDataPartitionLeftindexingTest:157->AutomatedTestBase.runTest:1258
failed to run script ./src/test/scripts/functions/parfor/parfor_rdatapartition_leftindexing.dml
exception: org.apache.sysml.api.DMLException: org.apache.sysml.runtime.DMLRuntimeException:
org.apache.sysml.runtime.DMLRuntimeException: PARFOR: Failed to execute loop in parallel.
message: org.apache.sysml.runtime.DMLRuntimeException: org.apache.sysml.runtime.DMLRuntimeException:
PARFOR: Failed to execute loop in parallel.
stack trace:
>org.apache.sysml.api.DMLScript.executeScript(DMLScript.java:533)
>org.apache.sysml.api.DMLScript.main(DMLScript.java:233)
>org.apache.sysml.test.integration.AutomatedTestBase.runTest(AutomatedTestBase.java:1238)
>org.apache.sysml.test.integration.functions.parfor.ParForDataPartitionLeftIndexingTest.runParForDataPartitionLeftindexingTest(ParForDataPartitionLeftIndexingTest.java:157)
>org.apache.sysml.test.integration.functions.parfor.ParForDataPartitionLeftIndexingTest.testParForDataPartitionLeftindexingRowSparseMR(ParForDataPartitionLeftIndexingTest.java:103)
>sun.reflect.NativeMethodAccessorImpl.invoke0(Native Method)
>sun.reflect.NativeMethodAccessorImpl.invoke(NativeMethodAccessorImpl.java:62)
>sun.reflect.DelegatingMethodAccessorImpl.invoke(DelegatingMethodAccessorImpl.java:43)
>java.lang.reflect.Method.invoke(Method.java:497)
>org.junit.runners.model.FrameworkMethod$1.runReflectiveCall(FrameworkMethod.java:47)
>org.junit.internal.runners.model.ReflectiveCallable.run(ReflectiveCallable.java:12)
>org.junit.runners.model.FrameworkMethod.invokeExplosively(FrameworkMethod.java:44)
>org.junit.internal.runners.statements.InvokeMethod.evaluate(InvokeMethod.java:17)
>org.junit.internal.runners.statements.RunBefores.evaluate(RunBefores.java:26)
>org.junit.internal.runners.statements.RunAfters.evaluate(RunAfters.java:27)
>org.junit.runners.ParentRunner.runLeaf(ParentRunner.java:271)
>org.junit.runners.BlockJUnit4ClassRunner.runChild(BlockJUnit4ClassRunner.java:70)
>org.junit.runners.BlockJUnit4ClassRunner.runChild(BlockJUnit4ClassRunner.java:50)
>org.junit.runners.ParentRunner$3.run(ParentRunner.java:238)
>org.apache.maven.surefire.junitcore.pc.Scheduler$1.run(Scheduler.java:318)
>org.apache.maven.surefire.junitcore.pc.InvokerStrategy.schedule(InvokerStrategy.java:41)
>org.apache.maven.surefire.junitcore.pc.Scheduler.schedule(Scheduler.java:274)
>org.junit.runners.ParentRunner.runChildren(ParentRunner.java:236)
>org.junit.runners.ParentRunner.access$000(ParentRunner.java:53)
>org.junit.runners.ParentRunner$2.evaluate(ParentRunner.java:229)
>org.junit.runners.ParentRunner.run(ParentRunner.java:309)
>org.junit.runners.Suite.runChild(Suite.java:127)
>org.junit.runners.Suite.runChild(Suite.java:26)
>org.junit.runners.ParentRunner$3.run(ParentRunner.java:238)
>org.apache.maven.surefire.junitcore.pc.Scheduler$1.run(Scheduler.java:318)
>org.apache.maven.surefire.junitcore.pc.InvokerStrategy.schedule(InvokerStrategy.java:41)
>org.apache.maven.surefire.junitcore.pc.Scheduler.schedule(Scheduler.java:274)
>org.junit.runners.ParentRunner.runChildren(ParentRunner.java:236)
>org.junit.runners.ParentRunner.access$000(ParentRunner.java:53)
>org.junit.runners.ParentRunner$2.evaluate(ParentRunner.java:229)
>org.junit.runners.ParentRunner.run(ParentRunner.java:309)
>org.junit.runners.Suite.runChild(Suite.java:127)
>org.junit.runners.Suite.runChild(Suite.java:26)
>org.junit.runners.ParentRunner$3.run(ParentRunner.java:238)
>org.apache.maven.surefire.junitcore.pc.Scheduler$1.run(Scheduler.java:318)
>org.apache.maven.surefire.junitcore.pc.InvokerStrategy.schedule(InvokerStrategy.java:41)
>org.apache.maven.surefire.junitcore.pc.Scheduler.schedule(Scheduler.java:274)
>org.junit.runners.ParentRunner.runChildren(ParentRunner.java:236)
>org.junit.runners.ParentRunner.access$000(ParentRunner.java:53)
>org.junit.runners.ParentRunner$2.evaluate(ParentRunner.java:229)
>org.junit.runners.ParentRunner.run(ParentRunner.java:309)
>org.apache.maven.surefire.junitcore.pc.ParallelComputerBuilder$PC$2.run(ParallelComputerBuilder.java:491)
>org.junit.runner.JUnitCore.run(JUnitCore.java:160)
>org.junit.runner.JUnitCore.run(JUnitCore.java:138)
>org.apache.maven.surefire.junitcore.JUnitCoreWrapper.createRequestAndRun(JUnitCoreWrapper.java:113)
>org.apache.maven.surefire.junitcore.JUnitCoreWrapper.executeEager(JUnitCoreWrapper.java:85)
>org.apache.maven.surefire.junitcore.JUnitCoreWrapper.execute(JUnitCoreWrapper.java:54)
>org.apache.maven.surefire.junitcore.JUnitCoreProvider.invoke(JUnitCoreProvider.java:134)
>org.apache.maven.surefire.booter.ForkedBooter.invokeProviderInSameClassLoader(ForkedBooter.java:200)
>org.apache.maven.surefire.booter.ForkedBooter.runSuitesInProcess(ForkedBooter.java:153)
>org.apache.maven.surefire.booter.ForkedBooter.main(ForkedBooter.java:103)
  RightIndexingMatrixTest>AutomatedTestBase.tearDown:1468 Detailed matrices characteristics:
!  B-DML<->B-R # stored values in B-R: 2
!  B-DML<->B-R # stored values in B-DML: 2
!  B-DML<->B-R identical values(z=0): 0
!  B-DML<->B-R wrong values(z=1.0E-10): 2
!  B-DML<->B-R min error: 0.9980144806788327
!  B-DML<->B-R max error: 40.2211169393493
    C-DML<->C-R # stored values in C-R: 9788
    C-DML<->C-R # stored values in C-DML: 9788
    C-DML<->C-R identical values(z=0): 9788
    C-DML<->C-R wrong values(z=1.0E-10): 0
    C-DML<->C-R min error: 0.0
    C-DML<->C-R max error: 0.0
    D-DML<->D-R # stored values in D-R: 5077
    D-DML<->D-R # stored values in D-DML: 5077
    D-DML<->D-R identical values(z=0): 5077
    D-DML<->D-R wrong values(z=1.0E-10): 0
    D-DML<->D-R min error: 0.0
    D-DML<->D-R max error: 0.0


Tests run: 6903, Failures: 2, Errors: 0, Skipped: 0

[INFO] 
[INFO] --- maven-failsafe-plugin:2.17:verify (default) @ systemml ---
[INFO] Failsafe report directory: <https://sparktc.ibmcloud.com/jenkins/job/SystemML-DailyTest/ws/target/failsafe-reports>
[INFO] ------------------------------------------------------------------------
[INFO] BUILD FAILURE
[INFO] ------------------------------------------------------------------------
[INFO] Total time: 03:10 h
[INFO] Finished at: 2017-04-25T17:46:21-05:00
[INFO] Final Memory: 66M/2484M
[INFO] ------------------------------------------------------------------------
[ERROR] Failed to execute goal org.apache.maven.plugins:maven-failsafe-plugin:2.17:verify
(default) on project systemml: There are test failures.
[ERROR] 
[ERROR] Please refer to <https://sparktc.ibmcloud.com/jenkins/job/SystemML-DailyTest/ws/target/failsafe-reports>
for the individual test results.
[ERROR] -> [Help 1]
[ERROR] 
[ERROR] To see the full stack trace of the errors, re-run Maven with the -e switch.
[ERROR] Re-run Maven using the -X switch to enable full debug logging.
[ERROR] 
[ERROR] For more information about the errors and possible solutions, please read the following
articles:
[ERROR] [Help 1] http://cwiki.apache.org/confluence/display/MAVEN/MojoFailureException
Build step 'Execute shell' marked build as failure
Run condition [Always] enabling perform for step [[]]

Mime
View raw message