systemml-dev mailing list archives

Site index · List index
Message view « Date » · « Thread »
Top « Date » · « Thread »
From jenk...@spark.tc
Subject Build failed in Jenkins: SystemML-DailyTest #849
Date Sun, 05 Mar 2017 23:01:16 GMT
See <https://sparktc.ibmcloud.com/jenkins/job/SystemML-DailyTest/849/>

------------------------------------------
[...truncated 13023 lines...]
17/03/05 15:54:38 INFO scheduler.DAGScheduler: failed: Set()
17/03/05 15:54:38 INFO scheduler.DAGScheduler: Submitting ResultStage 259 (MapPartitionsRDD[717]
at mapValues at SparkUtils.java:151), which has no missing parents
17/03/05 15:54:38 INFO memory.MemoryStore: Block broadcast_259 stored as values in memory
(estimated size 3.8 KB, free 1045.3 MB)
17/03/05 15:54:38 INFO memory.MemoryStore: Block broadcast_259_piece0 stored as bytes in memory
(estimated size 2.1 KB, free 1045.3 MB)
17/03/05 15:54:38 INFO storage.BlockManagerInfo: Added broadcast_259_piece0 in memory on 169.54.146.43:56319
(size: 2.1 KB, free: 1045.7 MB)
17/03/05 15:54:38 INFO spark.SparkContext: Created broadcast 259 from broadcast at DAGScheduler.scala:996
17/03/05 15:54:38 INFO scheduler.DAGScheduler: Submitting 1 missing tasks from ResultStage
259 (MapPartitionsRDD[717] at mapValues at SparkUtils.java:151)
17/03/05 15:54:38 INFO scheduler.TaskSchedulerImpl: Adding task set 259.0 with 1 tasks
17/03/05 15:54:38 INFO scheduler.FairSchedulableBuilder: Added task set TaskSet_259.0 tasks
to pool default
17/03/05 15:54:38 INFO scheduler.TaskSetManager: Starting task 0.0 in stage 259.0 (TID 269,
localhost, executor driver, partition 0, ANY, 5753 bytes)
17/03/05 15:54:38 INFO executor.Executor: Running task 0.0 in stage 259.0 (TID 269)
17/03/05 15:54:38 INFO storage.ShuffleBlockFetcherIterator: Getting 1 non-empty blocks out
of 1 blocks
17/03/05 15:54:38 INFO storage.ShuffleBlockFetcherIterator: Started 0 remote fetches in 0
ms
17/03/05 15:54:38 INFO executor.Executor: Finished task 0.0 in stage 259.0 (TID 269). 2108
bytes result sent to driver
17/03/05 15:54:38 INFO scheduler.TaskSetManager: Finished task 0.0 in stage 259.0 (TID 269)
in 19 ms on localhost (executor driver) (1/1)
17/03/05 15:54:38 INFO scheduler.TaskSchedulerImpl: Removed TaskSet 259.0, whose tasks have
all completed, from pool default
17/03/05 15:54:38 INFO scheduler.DAGScheduler: ResultStage 259 (collect at SparkExecutionContext.java:767)
finished in 0.020 s
17/03/05 15:54:38 INFO storage.BlockManagerInfo: Removed broadcast_259_piece0 on 169.54.146.43:56319
in memory (size: 2.1 KB, free: 1045.7 MB)
17/03/05 15:54:38 INFO storage.BlockManagerInfo: Removed broadcast_258_piece0 on 169.54.146.43:56319
in memory (size: 9.6 KB, free: 1045.7 MB)
17/03/05 15:54:38 INFO storage.BlockManagerInfo: Removed broadcast_257_piece0 on 169.54.146.43:56319
in memory (size: 9.0 KB, free: 1045.8 MB)
17/03/05 15:54:38 INFO storage.BlockManagerInfo: Removed broadcast_256_piece0 on 169.54.146.43:56319
in memory (size: 8.9 KB, free: 1045.8 MB)
17/03/05 15:54:38 INFO spark.ContextCleaner: Cleaned accumulator 16831
17/03/05 15:54:38 INFO scheduler.DAGScheduler: Registering RDD 719 (flatMapToPair at RDDConverterUtils.java:275)
17/03/05 15:54:38 INFO scheduler.DAGScheduler: Got job 193 (collectAsList at MLContextTest.java:1343)
with 1 output partitions
17/03/05 15:54:38 INFO scheduler.DAGScheduler: Final stage: ResultStage 261 (collectAsList
at MLContextTest.java:1343)
17/03/05 15:54:38 INFO scheduler.DAGScheduler: Parents of final stage: List(ShuffleMapStage
260)
17/03/05 15:54:38 INFO scheduler.DAGScheduler: Missing parents: List(ShuffleMapStage 260)
17/03/05 15:54:38 INFO scheduler.DAGScheduler: Submitting ShuffleMapStage 260 (MapPartitionsRDD[719]
at flatMapToPair at RDDConverterUtils.java:275), which has no missing parents
17/03/05 15:54:38 INFO memory.MemoryStore: Block broadcast_260 stored as values in memory
(estimated size 3.9 KB, free 1045.3 MB)
17/03/05 15:54:38 INFO memory.MemoryStore: Block broadcast_260_piece0 stored as bytes in memory
(estimated size 2.2 KB, free 1045.3 MB)
17/03/05 15:54:38 INFO storage.BlockManagerInfo: Added broadcast_260_piece0 in memory on 169.54.146.43:56319
(size: 2.2 KB, free: 1045.8 MB)
17/03/05 15:54:38 INFO spark.SparkContext: Created broadcast 260 from broadcast at DAGScheduler.scala:996
17/03/05 15:54:38 INFO scheduler.DAGScheduler: Submitting 1 missing tasks from ShuffleMapStage
260 (MapPartitionsRDD[719] at flatMapToPair at RDDConverterUtils.java:275)
17/03/05 15:54:38 INFO scheduler.TaskSchedulerImpl: Adding task set 260.0 with 1 tasks
17/03/05 15:54:38 INFO scheduler.FairSchedulableBuilder: Added task set TaskSet_260.0 tasks
to pool default
17/03/05 15:54:38 INFO scheduler.TaskSetManager: Starting task 0.0 in stage 260.0 (TID 270,
localhost, executor driver, partition 0, PROCESS_LOCAL, 6218 bytes)
17/03/05 15:54:38 INFO executor.Executor: Running task 0.0 in stage 260.0 (TID 270)
17/03/05 15:54:38 INFO executor.Executor: Finished task 0.0 in stage 260.0 (TID 270). 1253
bytes result sent to driver
17/03/05 15:54:38 INFO scheduler.TaskSetManager: Finished task 0.0 in stage 260.0 (TID 270)
in 7 ms on localhost (executor driver) (1/1)
17/03/05 15:54:38 INFO scheduler.TaskSchedulerImpl: Removed TaskSet 260.0, whose tasks have
all completed, from pool default
17/03/05 15:54:38 INFO scheduler.DAGScheduler: ShuffleMapStage 260 (flatMapToPair at RDDConverterUtils.java:275)
finished in 0.008 s
17/03/05 15:54:38 INFO scheduler.DAGScheduler: looking for newly runnable stages
17/03/05 15:54:38 INFO scheduler.DAGScheduler: running: Set()
17/03/05 15:54:38 INFO scheduler.DAGScheduler: waiting: Set(ResultStage 261)
17/03/05 15:54:38 INFO scheduler.DAGScheduler: failed: Set()
17/03/05 15:54:38 INFO scheduler.DAGScheduler: Submitting ResultStage 261 (MapPartitionsRDD[725]
at collectAsList at MLContextTest.java:1343), which has no missing parents
17/03/05 15:54:38 INFO memory.MemoryStore: Block broadcast_261 stored as values in memory
(estimated size 11.3 KB, free 1045.3 MB)
17/03/05 15:54:38 INFO memory.MemoryStore: Block broadcast_261_piece0 stored as bytes in memory
(estimated size 5.6 KB, free 1045.3 MB)
17/03/05 15:54:38 INFO storage.BlockManagerInfo: Added broadcast_261_piece0 in memory on 169.54.146.43:56319
(size: 5.6 KB, free: 1045.8 MB)
17/03/05 15:54:38 INFO spark.SparkContext: Created broadcast 261 from broadcast at DAGScheduler.scala:996
17/03/05 15:54:38 INFO scheduler.DAGScheduler: Submitting 1 missing tasks from ResultStage
261 (MapPartitionsRDD[725] at collectAsList at MLContextTest.java:1343)
17/03/05 15:54:38 INFO scheduler.TaskSchedulerImpl: Adding task set 261.0 with 1 tasks
17/03/05 15:54:38 INFO scheduler.FairSchedulableBuilder: Added task set TaskSet_261.0 tasks
to pool default
17/03/05 15:54:38 INFO scheduler.TaskSetManager: Starting task 0.0 in stage 261.0 (TID 271,
localhost, executor driver, partition 0, ANY, 5783 bytes)
17/03/05 15:54:38 INFO executor.Executor: Running task 0.0 in stage 261.0 (TID 271)
17/03/05 15:54:38 INFO storage.ShuffleBlockFetcherIterator: Getting 1 non-empty blocks out
of 1 blocks
17/03/05 15:54:38 INFO storage.ShuffleBlockFetcherIterator: Started 0 remote fetches in 1
ms
17/03/05 15:54:38 INFO executor.Executor: Finished task 0.0 in stage 261.0 (TID 271). 2024
bytes result sent to driver
17/03/05 15:54:38 INFO scheduler.TaskSetManager: Finished task 0.0 in stage 261.0 (TID 271)
in 9 ms on localhost (executor driver) (1/1)
17/03/05 15:54:38 INFO scheduler.TaskSchedulerImpl: Removed TaskSet 261.0, whose tasks have
all completed, from pool default
17/03/05 15:54:38 INFO scheduler.DAGScheduler: ResultStage 261 (collectAsList at MLContextTest.java:1343)
finished in 0.010 s
17/03/05 15:54:39 INFO storage.BlockManagerInfo: Removed broadcast_260_piece0 on 169.54.146.43:56319
in memory (size: 2.2 KB, free: 1045.8 MB)
17/03/05 15:54:39 INFO storage.BlockManagerInfo: Removed broadcast_261_piece0 on 169.54.146.43:56319
in memory (size: 5.6 KB, free: 1045.8 MB)
17/03/05 15:54:39 INFO spark.ContextCleaner: Cleaned accumulator 17026
17/03/05 15:54:39 INFO spark.ContextCleaner: Cleaned shuffle 67
17/03/05 15:54:40 INFO server.ServerConnector: Stopped ServerConnector@5ca79409{HTTP/1.1}{0.0.0.0:4040}
17/03/05 15:54:40 INFO handler.ContextHandler: Stopped o.s.j.s.ServletContextHandler@5c1c43ed{/stages/stage/kill,null,UNAVAILABLE}
17/03/05 15:54:40 INFO handler.ContextHandler: Stopped o.s.j.s.ServletContextHandler@418a1077{/jobs/job/kill,null,UNAVAILABLE}
17/03/05 15:54:40 INFO handler.ContextHandler: Stopped o.s.j.s.ServletContextHandler@e85a746{/api,null,UNAVAILABLE}
17/03/05 15:54:40 INFO handler.ContextHandler: Stopped o.s.j.s.ServletContextHandler@37622003{/,null,UNAVAILABLE}
17/03/05 15:54:40 INFO handler.ContextHandler: Stopped o.s.j.s.ServletContextHandler@5948986b{/static,null,UNAVAILABLE}
17/03/05 15:54:40 INFO handler.ContextHandler: Stopped o.s.j.s.ServletContextHandler@49b0de07{/executors/threadDump/json,null,UNAVAILABLE}
17/03/05 15:54:40 INFO handler.ContextHandler: Stopped o.s.j.s.ServletContextHandler@12256f76{/executors/threadDump,null,UNAVAILABLE}
17/03/05 15:54:40 INFO handler.ContextHandler: Stopped o.s.j.s.ServletContextHandler@247947b6{/executors/json,null,UNAVAILABLE}
17/03/05 15:54:40 INFO handler.ContextHandler: Stopped o.s.j.s.ServletContextHandler@a935f6d{/executors,null,UNAVAILABLE}
17/03/05 15:54:40 INFO handler.ContextHandler: Stopped o.s.j.s.ServletContextHandler@7ea4ad58{/environment/json,null,UNAVAILABLE}
17/03/05 15:54:40 INFO handler.ContextHandler: Stopped o.s.j.s.ServletContextHandler@629a9e19{/environment,null,UNAVAILABLE}
17/03/05 15:54:40 INFO handler.ContextHandler: Stopped o.s.j.s.ServletContextHandler@79aafdd4{/storage/rdd/json,null,UNAVAILABLE}
17/03/05 15:54:40 INFO handler.ContextHandler: Stopped o.s.j.s.ServletContextHandler@7e71465f{/storage/rdd,null,UNAVAILABLE}
17/03/05 15:54:40 INFO handler.ContextHandler: Stopped o.s.j.s.ServletContextHandler@6f0e759f{/storage/json,null,UNAVAILABLE}
17/03/05 15:54:40 INFO handler.ContextHandler: Stopped o.s.j.s.ServletContextHandler@2a562faf{/storage,null,UNAVAILABLE}
17/03/05 15:54:40 INFO handler.ContextHandler: Stopped o.s.j.s.ServletContextHandler@6b5d903d{/stages/pool/json,null,UNAVAILABLE}
17/03/05 15:54:40 INFO handler.ContextHandler: Stopped o.s.j.s.ServletContextHandler@7b2d4861{/stages/pool,null,UNAVAILABLE}
17/03/05 15:54:40 INFO handler.ContextHandler: Stopped o.s.j.s.ServletContextHandler@258c1228{/stages/stage/json,null,UNAVAILABLE}
17/03/05 15:54:40 INFO handler.ContextHandler: Stopped o.s.j.s.ServletContextHandler@124a6011{/stages/stage,null,UNAVAILABLE}
17/03/05 15:54:40 INFO handler.ContextHandler: Stopped o.s.j.s.ServletContextHandler@52d8470e{/stages/json,null,UNAVAILABLE}
17/03/05 15:54:40 INFO handler.ContextHandler: Stopped o.s.j.s.ServletContextHandler@75b56959{/stages,null,UNAVAILABLE}
17/03/05 15:54:40 INFO handler.ContextHandler: Stopped o.s.j.s.ServletContextHandler@47be09f1{/jobs/job/json,null,UNAVAILABLE}
17/03/05 15:54:40 INFO handler.ContextHandler: Stopped o.s.j.s.ServletContextHandler@39ef27bb{/jobs/job,null,UNAVAILABLE}
17/03/05 15:54:40 INFO handler.ContextHandler: Stopped o.s.j.s.ServletContextHandler@76da221b{/jobs/json,null,UNAVAILABLE}
17/03/05 15:54:40 INFO handler.ContextHandler: Stopped o.s.j.s.ServletContextHandler@3fb1b11e{/jobs,null,UNAVAILABLE}
17/03/05 15:54:40 INFO ui.SparkUI: Stopped Spark web UI at http://169.54.146.43:4040
17/03/05 15:54:40 INFO spark.MapOutputTrackerMasterEndpoint: MapOutputTrackerMasterEndpoint
stopped!
17/03/05 15:54:40 INFO memory.MemoryStore: MemoryStore cleared
17/03/05 15:54:40 INFO storage.BlockManager: BlockManager stopped
17/03/05 15:54:40 INFO storage.BlockManagerMaster: BlockManagerMaster stopped
17/03/05 15:54:40 INFO scheduler.OutputCommitCoordinator$OutputCommitCoordinatorEndpoint:
OutputCommitCoordinator stopped!
17/03/05 15:54:40 INFO spark.SparkContext: Successfully stopped SparkContext
Running org.apache.sysml.test.integration.mlcontext.MLContextTest
Tests run: 169, Failures: 0, Errors: 0, Skipped: 0, Time elapsed: 64.654 sec - in org.apache.sysml.test.integration.mlcontext.MLContextTest
17/03/05 15:54:40 INFO util.ShutdownHookManager: Shutdown hook called
17/03/05 15:54:40 INFO util.ShutdownHookManager: Deleting directory /tmp/spark-1612e9be-aaf3-472d-b1bf-df1a008e4ab2
Running org.apache.sysml.test.integration.functions.append.AppendVectorTest
Tests run: 6, Failures: 0, Errors: 0, Skipped: 0, Time elapsed: 328.969 sec - in org.apache.sysml.test.integration.functions.append.AppendVectorTest
Running org.apache.sysml.test.integration.functions.quaternary.WeightedSigmoidTest
Tests run: 56, Failures: 0, Errors: 0, Skipped: 0, Time elapsed: 1,001.779 sec - in org.apache.sysml.test.integration.functions.quaternary.WeightedSigmoidTest
17/03/05 15:56:38 INFO util.ShutdownHookManager: Shutdown hook called
17/03/05 15:56:38 INFO util.ShutdownHookManager: Deleting directory /tmp/spark-de449334-6019-424f-8754-10bb4ce84475
Running org.apache.sysml.test.integration.functions.indexing.LeftIndexingTest
Tests run: 3, Failures: 0, Errors: 0, Skipped: 0, Time elapsed: 665.052 sec - in org.apache.sysml.test.integration.functions.indexing.LeftIndexingTest
Running org.apache.sysml.test.integration.applications.parfor.ParForCorrelationTest
Tests run: 12, Failures: 0, Errors: 0, Skipped: 0, Time elapsed: 276.775 sec - in org.apache.sysml.test.integration.applications.parfor.ParForCorrelationTest
Running org.apache.sysml.test.integration.applications.descriptivestats.UnivariateUnweightedScaleDenseTest
Tests run: 24, Failures: 0, Errors: 0, Skipped: 0, Time elapsed: 337.675 sec - in org.apache.sysml.test.integration.applications.descriptivestats.UnivariateUnweightedScaleDenseTest
Running org.apache.sysml.test.integration.applications.parfor.ParForCorrelationTestLarge
Tests run: 2, Failures: 0, Errors: 0, Skipped: 0, Time elapsed: 45.281 sec - in org.apache.sysml.test.integration.applications.parfor.ParForCorrelationTestLarge
Running org.apache.sysml.test.integration.functions.reorg.FullOrderTest
Tests run: 132, Failures: 0, Errors: 0, Skipped: 0, Time elapsed: 1,365.797 sec - in org.apache.sysml.test.integration.functions.reorg.FullOrderTest
Running org.apache.sysml.test.integration.functions.quaternary.WeightedDivMatrixMultTest
Tests run: 90, Failures: 0, Errors: 0, Skipped: 0, Time elapsed: 1,481.282 sec - in org.apache.sysml.test.integration.functions.quaternary.WeightedDivMatrixMultTest
17/03/05 16:02:43 INFO util.ShutdownHookManager: Shutdown hook called
17/03/05 16:02:43 INFO util.ShutdownHookManager: Deleting directory /tmp/spark-b4ce3156-ddc7-4b0f-80b5-fe99a425080b
Running org.apache.sysml.test.integration.applications.descriptivestats.UnivariateWeightedScaleDenseTest
Tests run: 24, Failures: 0, Errors: 0, Skipped: 0, Time elapsed: 345.567 sec - in org.apache.sysml.test.integration.applications.descriptivestats.UnivariateWeightedScaleDenseTest
Running org.apache.sysml.test.integration.functions.append.AppendChainTest
Tests run: 12, Failures: 0, Errors: 0, Skipped: 0, Time elapsed: 1,060.284 sec - in org.apache.sysml.test.integration.functions.append.AppendChainTest
Running org.apache.sysml.test.integration.applications.parfor.ParForNaiveBayesTest
Tests run: 10, Failures: 0, Errors: 0, Skipped: 0, Time elapsed: 523.68 sec - in org.apache.sysml.test.integration.applications.parfor.ParForNaiveBayesTest
Running org.apache.sysml.test.integration.applications.descriptivestats.UnivariateUnweightedScaleSparseTest
Tests run: 24, Failures: 0, Errors: 0, Skipped: 0, Time elapsed: 280.896 sec - in org.apache.sysml.test.integration.applications.descriptivestats.UnivariateUnweightedScaleSparseTest
Running org.apache.sysml.test.integration.applications.dml.HITSDMLTest
Tests run: 1, Failures: 0, Errors: 0, Skipped: 0, Time elapsed: 91.473 sec - in org.apache.sysml.test.integration.applications.dml.HITSDMLTest
Running org.apache.sysml.test.integration.functions.append.AppendMatrixTest
Tests run: 22, Failures: 0, Errors: 0, Skipped: 0, Time elapsed: 1,390.143 sec - in org.apache.sysml.test.integration.functions.append.AppendMatrixTest
Running org.apache.sysml.test.integration.applications.descriptivestats.UnivariateWeightedScaleSparseTest
Tests run: 24, Failures: 0, Errors: 0, Skipped: 0, Time elapsed: 320.277 sec - in org.apache.sysml.test.integration.applications.descriptivestats.UnivariateWeightedScaleSparseTest
Running org.apache.sysml.test.integration.applications.pydml.ArimaPyDMLTest
Tests run: 1, Failures: 0, Errors: 0, Skipped: 0, Time elapsed: 49.794 sec - in org.apache.sysml.test.integration.applications.pydml.ArimaPyDMLTest
Running org.apache.sysml.test.integration.applications.pydml.HITSPyDMLTest
Tests run: 1, Failures: 0, Errors: 0, Skipped: 0, Time elapsed: 77.002 sec - in org.apache.sysml.test.integration.applications.pydml.HITSPyDMLTest
Running org.apache.sysml.test.integration.applications.dml.LinearRegressionDMLTest
Tests run: 7, Failures: 0, Errors: 0, Skipped: 0, Time elapsed: 51.024 sec - in org.apache.sysml.test.integration.applications.dml.LinearRegressionDMLTest
Running org.apache.sysml.test.integration.applications.pydml.CsplineDSPyDMLTest
Tests run: 3, Failures: 0, Errors: 0, Skipped: 0, Time elapsed: 6.906 sec - in org.apache.sysml.test.integration.applications.pydml.CsplineDSPyDMLTest
Running org.apache.sysml.test.integration.applications.pydml.LinearLogRegPyDMLTest
Tests run: 7, Failures: 0, Errors: 0, Skipped: 0, Time elapsed: 80.2 sec - in org.apache.sysml.test.integration.applications.pydml.LinearLogRegPyDMLTest
Running org.apache.sysml.test.integration.applications.pydml.NaiveBayesPyDMLTest
Tests run: 6, Failures: 0, Errors: 0, Skipped: 0, Time elapsed: 81.04 sec - in org.apache.sysml.test.integration.applications.pydml.NaiveBayesPyDMLTest
Running org.apache.sysml.test.integration.applications.dml.CsplineCGDMLTest
Tests run: 3, Failures: 0, Errors: 0, Skipped: 0, Time elapsed: 11.191 sec - in org.apache.sysml.test.integration.applications.dml.CsplineCGDMLTest
Running org.apache.sysml.test.integration.applications.dml.L2SVMDMLTest
Tests run: 9, Failures: 0, Errors: 0, Skipped: 0, Time elapsed: 64.4 sec - in org.apache.sysml.test.integration.applications.dml.L2SVMDMLTest
Running org.apache.sysml.test.integration.applications.pydml.MDABivariateStatsPyDMLTest
Tests run: 4, Failures: 0, Errors: 0, Skipped: 0, Time elapsed: 294.104 sec - in org.apache.sysml.test.integration.applications.pydml.MDABivariateStatsPyDMLTest
Running org.apache.sysml.test.integration.applications.pydml.PageRankPyDMLTest
Tests run: 3, Failures: 0, Errors: 0, Skipped: 0, Time elapsed: 6.205 sec - in org.apache.sysml.test.integration.applications.pydml.PageRankPyDMLTest
Running org.apache.sysml.test.integration.applications.pydml.NaiveBayesParforPyDMLTest
Tests run: 6, Failures: 0, Errors: 0, Skipped: 0, Time elapsed: 81.334 sec - in org.apache.sysml.test.integration.applications.pydml.NaiveBayesParforPyDMLTest
Running org.apache.sysml.test.integration.applications.dml.NaiveBayesDMLTest
Tests run: 6, Failures: 0, Errors: 0, Skipped: 0, Time elapsed: 81.304 sec - in org.apache.sysml.test.integration.applications.dml.NaiveBayesDMLTest
Running org.apache.sysml.test.integration.applications.dml.MDABivariateStatsDMLTest
Tests run: 4, Failures: 0, Errors: 0, Skipped: 0, Time elapsed: 295.001 sec - in org.apache.sysml.test.integration.applications.dml.MDABivariateStatsDMLTest
Running org.apache.sysml.test.integration.applications.dml.PageRankDMLTest
Tests run: 3, Failures: 0, Errors: 0, Skipped: 0, Time elapsed: 6.351 sec - in org.apache.sysml.test.integration.applications.dml.PageRankDMLTest
Running org.apache.sysml.test.integration.applications.pydml.GLMPyDMLTest
Tests run: 30, Failures: 0, Errors: 0, Skipped: 0, Time elapsed: 587.54 sec - in org.apache.sysml.test.integration.applications.pydml.GLMPyDMLTest
Running org.apache.sysml.test.integration.applications.pydml.MultiClassSVMPyDMLTest
Tests run: 9, Failures: 0, Errors: 0, Skipped: 0, Time elapsed: 87.656 sec - in org.apache.sysml.test.integration.applications.pydml.MultiClassSVMPyDMLTest
Running org.apache.sysml.test.integration.applications.dml.ID3DMLTest
Tests run: 2, Failures: 0, Errors: 0, Skipped: 0, Time elapsed: 377.237 sec - in org.apache.sysml.test.integration.applications.dml.ID3DMLTest
Running org.apache.sysml.test.integration.applications.dml.GLMDMLTest
Tests run: 30, Failures: 0, Errors: 0, Skipped: 0, Time elapsed: 872.088 sec - in org.apache.sysml.test.integration.applications.dml.GLMDMLTest
Running org.apache.sysml.test.integration.applications.pydml.CsplineCGPyDMLTest
Tests run: 3, Failures: 0, Errors: 0, Skipped: 0, Time elapsed: 6.211 sec - in org.apache.sysml.test.integration.applications.pydml.CsplineCGPyDMLTest
Running org.apache.sysml.test.integration.applications.pydml.WelchTPyDMLTest
Tests run: 3, Failures: 0, Errors: 0, Skipped: 0, Time elapsed: 6.686 sec - in org.apache.sysml.test.integration.applications.pydml.WelchTPyDMLTest
Running org.apache.sysml.test.integration.applications.dml.MultiClassSVMDMLTest
Tests run: 9, Failures: 0, Errors: 0, Skipped: 0, Time elapsed: 90.083 sec - in org.apache.sysml.test.integration.applications.dml.MultiClassSVMDMLTest
Running org.apache.sysml.test.integration.applications.dml.CsplineDSDMLTest
Tests run: 3, Failures: 0, Errors: 0, Skipped: 0, Time elapsed: 12.227 sec - in org.apache.sysml.test.integration.applications.dml.CsplineDSDMLTest
Running org.apache.sysml.test.integration.applications.pydml.ApplyTransformPyDMLTest
Tests run: 7, Failures: 0, Errors: 0, Skipped: 0, Time elapsed: 1.213 sec - in org.apache.sysml.test.integration.applications.pydml.ApplyTransformPyDMLTest
Running org.apache.sysml.test.integration.applications.dml.NaiveBayesParforDMLTest
Tests run: 6, Failures: 0, Errors: 0, Skipped: 0, Time elapsed: 81.388 sec - in org.apache.sysml.test.integration.applications.dml.NaiveBayesParforDMLTest
Running org.apache.sysml.test.integration.applications.pydml.L2SVMPyDMLTest
Tests run: 9, Failures: 0, Errors: 0, Skipped: 0, Time elapsed: 64.256 sec - in org.apache.sysml.test.integration.applications.pydml.L2SVMPyDMLTest
Running org.apache.sysml.test.integration.applications.pydml.LinearRegressionPyDMLTest
Tests run: 7, Failures: 0, Errors: 0, Skipped: 0, Time elapsed: 51.169 sec - in org.apache.sysml.test.integration.applications.pydml.LinearRegressionPyDMLTest
Running org.apache.sysml.test.integration.applications.dml.LinearLogRegDMLTest
Tests run: 7, Failures: 0, Errors: 0, Skipped: 0, Time elapsed: 61.095 sec - in org.apache.sysml.test.integration.applications.dml.LinearLogRegDMLTest
Running org.apache.sysml.test.integration.applications.dml.GNMFDMLTest
Tests run: 3, Failures: 0, Errors: 0, Skipped: 0, Time elapsed: 57.216 sec - in org.apache.sysml.test.integration.applications.dml.GNMFDMLTest
Running org.apache.sysml.test.integration.applications.dml.WelchTDMLTest
Tests run: 3, Failures: 0, Errors: 0, Skipped: 0, Time elapsed: 6.623 sec - in org.apache.sysml.test.integration.applications.dml.WelchTDMLTest
Running org.apache.sysml.test.integration.applications.dml.ApplyTransformDMLTest
Tests run: 7, Failures: 0, Errors: 0, Skipped: 0, Time elapsed: 16.403 sec - in org.apache.sysml.test.integration.applications.dml.ApplyTransformDMLTest
Running org.apache.sysml.test.integration.applications.pydml.ID3PyDMLTest
Tests run: 2, Failures: 0, Errors: 0, Skipped: 0, Time elapsed: 377.981 sec - in org.apache.sysml.test.integration.applications.pydml.ID3PyDMLTest
Running org.apache.sysml.test.integration.applications.pydml.GNMFPyDMLTest
Tests run: 3, Failures: 0, Errors: 0, Skipped: 0, Time elapsed: 57.844 sec - in org.apache.sysml.test.integration.applications.pydml.GNMFPyDMLTest

Results :

Failed tests: 
  RightIndexingMatrixTest>AutomatedTestBase.tearDown:1471 Detailed matrices characteristics:
!  B-DML<->B-R # stored values in B-R: 5
!  B-DML<->B-R # stored values in B-DML: 5
!  B-DML<->B-R identical values(z=0): 0
!  B-DML<->B-R wrong values(z=1.0E-10): 5
!  B-DML<->B-R min error: 3.67602028643087
!  B-DML<->B-R max error: 77.20942307616596
    C-DML<->C-R # stored values in C-R: 3085
    C-DML<->C-R # stored values in C-DML: 3085
    C-DML<->C-R identical values(z=0): 3085
    C-DML<->C-R wrong values(z=1.0E-10): 0
    C-DML<->C-R min error: 0.0
    C-DML<->C-R max error: 0.0
    D-DML<->D-R # stored values in D-R: 10483
    D-DML<->D-R # stored values in D-DML: 10483
    D-DML<->D-R identical values(z=0): 10483
    D-DML<->D-R wrong values(z=1.0E-10): 0
    D-DML<->D-R min error: 0.0
    D-DML<->D-R max error: 0.0


Tests run: 6729, Failures: 1, Errors: 0, Skipped: 0

[INFO] 
[INFO] --- maven-failsafe-plugin:2.17:verify (default) @ systemml ---
[INFO] Failsafe report directory: <https://sparktc.ibmcloud.com/jenkins/job/SystemML-DailyTest/ws/target/failsafe-reports>
[INFO] ------------------------------------------------------------------------
[INFO] BUILD FAILURE
[INFO] ------------------------------------------------------------------------
[INFO] Total time: 02:25 h
[INFO] Finished at: 2017-03-05T17:01:16-06:00
[INFO] Final Memory: 61M/2233M
[INFO] ------------------------------------------------------------------------
[ERROR] Failed to execute goal org.apache.maven.plugins:maven-failsafe-plugin:2.17:verify
(default) on project systemml: There are test failures.
[ERROR] 
[ERROR] Please refer to <https://sparktc.ibmcloud.com/jenkins/job/SystemML-DailyTest/ws/target/failsafe-reports>
for the individual test results.
[ERROR] -> [Help 1]
[ERROR] 
[ERROR] To see the full stack trace of the errors, re-run Maven with the -e switch.
[ERROR] Re-run Maven using the -X switch to enable full debug logging.
[ERROR] 
[ERROR] For more information about the errors and possible solutions, please read the following
articles:
[ERROR] [Help 1] http://cwiki.apache.org/confluence/display/MAVEN/MojoFailureException
Build step 'Execute shell' marked build as failure
Run condition [Always] enabling perform for step [[]]

Mime
View raw message