systemml-dev mailing list archives

Site index · List index
Message view « Date » · « Thread »
Top « Date » · « Thread »
From jenk...@spark.tc
Subject Build failed in Jenkins: SystemML-DailyTest #898
Date Thu, 30 Mar 2017 09:57:25 GMT
See <https://sparktc.ibmcloud.com/jenkins/job/SystemML-DailyTest/898/changes>

Changes:

[npansar] [MINOR] Disable Spark Convolution operation until rectangular blocks are

[Matthias Boehm] [SYSTEMML-1439] Improved codegen candidate exploration algorithm

------------------------------------------
[...truncated 13112 lines...]
Running org.apache.sysml.test.integration.functions.quaternary.WeightedSigmoidTest
Tests run: 56, Failures: 0, Errors: 0, Skipped: 0, Time elapsed: 987.243 sec - in org.apache.sysml.test.integration.functions.quaternary.WeightedSigmoidTest
17/03/30 03:51:45 INFO util.ShutdownHookManager: Shutdown hook called
17/03/30 03:51:45 INFO util.ShutdownHookManager: Deleting directory /tmp/spark-76795e5b-df2d-4863-96a0-bfa45b4b2b9e
Running org.apache.sysml.test.integration.functions.indexing.LeftIndexingTest
Tests run: 3, Failures: 0, Errors: 0, Skipped: 0, Time elapsed: 641.256 sec - in org.apache.sysml.test.integration.functions.indexing.LeftIndexingTest
Running org.apache.sysml.test.integration.applications.parfor.ParForCorrelationTest
Tests run: 12, Failures: 0, Errors: 0, Skipped: 0, Time elapsed: 288.433 sec - in org.apache.sysml.test.integration.applications.parfor.ParForCorrelationTest
Running org.apache.sysml.test.integration.applications.descriptivestats.UnivariateUnweightedScaleDenseTest
Tests run: 24, Failures: 0, Errors: 0, Skipped: 0, Time elapsed: 332.09 sec - in org.apache.sysml.test.integration.applications.descriptivestats.UnivariateUnweightedScaleDenseTest
Running org.apache.sysml.test.integration.applications.parfor.ParForCorrelationTestLarge
Tests run: 2, Failures: 0, Errors: 0, Skipped: 0, Time elapsed: 44.139 sec - in org.apache.sysml.test.integration.applications.parfor.ParForCorrelationTestLarge
Running org.apache.sysml.test.integration.functions.reorg.FullOrderTest
Tests run: 132, Failures: 0, Errors: 0, Skipped: 0, Time elapsed: 1,328.337 sec - in org.apache.sysml.test.integration.functions.reorg.FullOrderTest
Running org.apache.sysml.test.integration.functions.quaternary.WeightedDivMatrixMultTest
Tests run: 90, Failures: 0, Errors: 0, Skipped: 0, Time elapsed: 1,467.046 sec - in org.apache.sysml.test.integration.functions.quaternary.WeightedDivMatrixMultTest
17/03/30 03:57:58 INFO util.ShutdownHookManager: Shutdown hook called
17/03/30 03:57:58 INFO util.ShutdownHookManager: Deleting directory /tmp/spark-1a3b6026-c151-4a85-b4bf-80c21fda0a4c
Running org.apache.sysml.test.integration.applications.descriptivestats.UnivariateWeightedScaleDenseTest
Tests run: 24, Failures: 0, Errors: 0, Skipped: 0, Time elapsed: 348.854 sec - in org.apache.sysml.test.integration.applications.descriptivestats.UnivariateWeightedScaleDenseTest
Running org.apache.sysml.test.integration.functions.append.AppendChainTest
Tests run: 12, Failures: 0, Errors: 0, Skipped: 0, Time elapsed: 1,038.269 sec - in org.apache.sysml.test.integration.functions.append.AppendChainTest
Running org.apache.sysml.test.integration.applications.parfor.ParForNaiveBayesTest
Tests run: 10, Failures: 0, Errors: 0, Skipped: 0, Time elapsed: 532.241 sec - in org.apache.sysml.test.integration.applications.parfor.ParForNaiveBayesTest
Running org.apache.sysml.test.integration.applications.descriptivestats.UnivariateUnweightedScaleSparseTest
Tests run: 24, Failures: 0, Errors: 0, Skipped: 0, Time elapsed: 280.15 sec - in org.apache.sysml.test.integration.applications.descriptivestats.UnivariateUnweightedScaleSparseTest
Running org.apache.sysml.test.integration.applications.dml.HITSDMLTest
Tests run: 1, Failures: 0, Errors: 0, Skipped: 0, Time elapsed: 88.128 sec - in org.apache.sysml.test.integration.applications.dml.HITSDMLTest
Running org.apache.sysml.test.integration.applications.descriptivestats.UnivariateWeightedScaleSparseTest
Tests run: 24, Failures: 0, Errors: 0, Skipped: 0, Time elapsed: 343.378 sec - in org.apache.sysml.test.integration.applications.descriptivestats.UnivariateWeightedScaleSparseTest
Running org.apache.sysml.test.integration.functions.append.AppendMatrixTest
Tests run: 22, Failures: 0, Errors: 0, Skipped: 0, Time elapsed: 1,466.498 sec - in org.apache.sysml.test.integration.functions.append.AppendMatrixTest
Running org.apache.sysml.test.integration.applications.pydml.ArimaPyDMLTest
Tests run: 1, Failures: 0, Errors: 0, Skipped: 0, Time elapsed: 49.396 sec - in org.apache.sysml.test.integration.applications.pydml.ArimaPyDMLTest
Running org.apache.sysml.test.integration.applications.pydml.HITSPyDMLTest
Tests run: 1, Failures: 0, Errors: 0, Skipped: 0, Time elapsed: 77.149 sec - in org.apache.sysml.test.integration.applications.pydml.HITSPyDMLTest
Running org.apache.sysml.test.integration.applications.dml.LinearRegressionDMLTest
Tests run: 7, Failures: 0, Errors: 0, Skipped: 0, Time elapsed: 50.496 sec - in org.apache.sysml.test.integration.applications.dml.LinearRegressionDMLTest
Running org.apache.sysml.test.integration.applications.pydml.CsplineDSPyDMLTest
Tests run: 3, Failures: 0, Errors: 0, Skipped: 0, Time elapsed: 6.591 sec - in org.apache.sysml.test.integration.applications.pydml.CsplineDSPyDMLTest
Running org.apache.sysml.test.integration.applications.pydml.LinearLogRegPyDMLTest
Tests run: 7, Failures: 1, Errors: 0, Skipped: 0, Time elapsed: 87.249 sec <<< FAILURE!
- in org.apache.sysml.test.integration.applications.pydml.LinearLogRegPyDMLTest
testLinearLogRegPyDml[3](org.apache.sysml.test.integration.applications.pydml.LinearLogRegPyDMLTest)
 Time elapsed: 39.381 sec  <<< FAILURE!
java.lang.AssertionError: failed to run script ./src/test/scripts/applications/linearLogReg/LinearLogReg.dml
exception: org.apache.sysml.api.DMLException: org.apache.sysml.runtime.DMLRuntimeException:
org.apache.sysml.runtime.DMLRuntimeException: ERROR: Runtime error in program block generated
from statement block between lines 33 and 0 -- Error evaluating instruction: CP°ba+*°_mVar4160261·MATRIX·DOUBLE°_mVar4160262·MATRIX·DOUBLE°_mVar4160263·MATRIX·DOUBLE°24
message: org.apache.sysml.runtime.DMLRuntimeException: org.apache.sysml.runtime.DMLRuntimeException:
ERROR: Runtime error in program block generated from statement block between lines 33 and
0 -- Error evaluating instruction: CP°ba+*°_mVar4160261·MATRIX·DOUBLE°_mVar4160262·MATRIX·DOUBLE°_mVar4160263·MATRIX·DOUBLE°24
stack trace:
>org.apache.sysml.api.DMLScript.executeScript(DMLScript.java:365)
>org.apache.sysml.api.DMLScript.main(DMLScript.java:212)
>org.apache.sysml.test.integration.AutomatedTestBase.runTest(AutomatedTestBase.java:1249)
>org.apache.sysml.test.integration.applications.LinearLogRegTest.testLinearLogReg(LinearLogRegTest.java:109)
>org.apache.sysml.test.integration.applications.pydml.LinearLogRegPyDMLTest.testLinearLogRegPyDml(LinearLogRegPyDMLTest.java:38)
>sun.reflect.NativeMethodAccessorImpl.invoke0(Native Method)
>sun.reflect.NativeMethodAccessorImpl.invoke(NativeMethodAccessorImpl.java:62)
>sun.reflect.DelegatingMethodAccessorImpl.invoke(DelegatingMethodAccessorImpl.java:43)
>java.lang.reflect.Method.invoke(Method.java:497)
>org.junit.runners.model.FrameworkMethod$1.runReflectiveCall(FrameworkMethod.java:47)
>org.junit.internal.runners.model.ReflectiveCallable.run(ReflectiveCallable.java:12)
>org.junit.runners.model.FrameworkMethod.invokeExplosively(FrameworkMethod.java:44)
>org.junit.internal.runners.statements.InvokeMethod.evaluate(InvokeMethod.java:17)
>org.junit.internal.runners.statements.RunBefores.evaluate(RunBefores.java:26)
>org.junit.internal.runners.statements.RunAfters.evaluate(RunAfters.java:27)
>org.junit.runners.ParentRunner.runLeaf(ParentRunner.java:271)
>org.junit.runners.BlockJUnit4ClassRunner.runChild(BlockJUnit4ClassRunner.java:70)
>org.junit.runners.BlockJUnit4ClassRunner.runChild(BlockJUnit4ClassRunner.java:50)
>org.junit.runners.ParentRunner$3.run(ParentRunner.java:238)
>org.apache.maven.surefire.junitcore.pc.Scheduler$1.run(Scheduler.java:318)
>org.apache.maven.surefire.junitcore.pc.InvokerStrategy.schedule(InvokerStrategy.java:41)
>org.apache.maven.surefire.junitcore.pc.Scheduler.schedule(Scheduler.java:274)
>org.junit.runners.ParentRunner.runChildren(ParentRunner.java:236)
>org.junit.runners.ParentRunner.access$000(ParentRunner.java:53)
>org.junit.runners.ParentRunner$2.evaluate(ParentRunner.java:229)
>org.junit.runners.ParentRunner.run(ParentRunner.java:309)
>org.junit.runners.Suite.runChild(Suite.java:127)
>org.junit.runners.Suite.runChild(Suite.java:26)
>org.junit.runners.ParentRunner$3.run(ParentRunner.java:238)
>org.apache.maven.surefire.junitcore.pc.Scheduler$1.run(Scheduler.java:318)
>org.apache.maven.surefire.junitcore.pc.InvokerStrategy.schedule(InvokerStrategy.java:41)
>org.apache.maven.surefire.junitcore.pc.Scheduler.schedule(Scheduler.java:274)
>org.junit.runners.ParentRunner.runChildren(ParentRunner.java:236)
>org.junit.runners.ParentRunner.access$000(ParentRunner.java:53)
>org.junit.runners.ParentRunner$2.evaluate(ParentRunner.java:229)
>org.junit.runners.ParentRunner.run(ParentRunner.java:309)
>org.junit.runners.Suite.runChild(Suite.java:127)
>org.junit.runners.Suite.runChild(Suite.java:26)
>org.junit.runners.ParentRunner$3.run(ParentRunner.java:238)
>org.apache.maven.surefire.junitcore.pc.Scheduler$1.run(Scheduler.java:318)
>org.apache.maven.surefire.junitcore.pc.InvokerStrategy.schedule(InvokerStrategy.java:41)
>org.apache.maven.surefire.junitcore.pc.Scheduler.schedule(Scheduler.java:274)
>org.junit.runners.ParentRunner.runChildren(ParentRunner.java:236)
>org.junit.runners.ParentRunner.access$000(ParentRunner.java:53)
>org.junit.runners.ParentRunner$2.evaluate(ParentRunner.java:229)
>org.junit.runners.ParentRunner.run(ParentRunner.java:309)
>org.junit.runners.Suite.runChild(Suite.java:127)
>org.junit.runners.Suite.runChild(Suite.java:26)
>org.junit.runners.ParentRunner$3.run(ParentRunner.java:238)
>org.apache.maven.surefire.junitcore.pc.Scheduler$1.run(Scheduler.java:318)
>java.util.concurrent.Executors$RunnableAdapter.call(Executors.java:511)
>java.util.concurrent.FutureTask.run(FutureTask.java:266)
>java.util.concurrent.ThreadPoolExecutor.runWorker(ThreadPoolExecutor.java:1142)
>java.util.concurrent.ThreadPoolExecutor$Worker.run(ThreadPoolExecutor.java:617)
>java.lang.Thread.run(Thread.java:745)
	at org.junit.Assert.fail(Assert.java:88)
	at org.apache.sysml.test.integration.AutomatedTestBase.runTest(AutomatedTestBase.java:1269)
	at org.apache.sysml.test.integration.applications.LinearLogRegTest.testLinearLogReg(LinearLogRegTest.java:109)
	at org.apache.sysml.test.integration.applications.pydml.LinearLogRegPyDMLTest.testLinearLogRegPyDml(LinearLogRegPyDMLTest.java:38)

Running org.apache.sysml.test.integration.applications.pydml.NaiveBayesPyDMLTest
Tests run: 6, Failures: 0, Errors: 0, Skipped: 0, Time elapsed: 80.975 sec - in org.apache.sysml.test.integration.applications.pydml.NaiveBayesPyDMLTest
Running org.apache.sysml.test.integration.applications.dml.CsplineCGDMLTest
Tests run: 3, Failures: 0, Errors: 0, Skipped: 0, Time elapsed: 16.517 sec - in org.apache.sysml.test.integration.applications.dml.CsplineCGDMLTest
Running org.apache.sysml.test.integration.applications.dml.L2SVMDMLTest
Tests run: 9, Failures: 0, Errors: 0, Skipped: 0, Time elapsed: 64.1 sec - in org.apache.sysml.test.integration.applications.dml.L2SVMDMLTest
Running org.apache.sysml.test.integration.applications.pydml.MDABivariateStatsPyDMLTest
Tests run: 4, Failures: 0, Errors: 0, Skipped: 0, Time elapsed: 295.394 sec - in org.apache.sysml.test.integration.applications.pydml.MDABivariateStatsPyDMLTest
Running org.apache.sysml.test.integration.applications.pydml.PageRankPyDMLTest
Tests run: 3, Failures: 0, Errors: 0, Skipped: 0, Time elapsed: 8.263 sec - in org.apache.sysml.test.integration.applications.pydml.PageRankPyDMLTest
Running org.apache.sysml.test.integration.applications.pydml.NaiveBayesParforPyDMLTest
Tests run: 6, Failures: 0, Errors: 0, Skipped: 0, Time elapsed: 81.337 sec - in org.apache.sysml.test.integration.applications.pydml.NaiveBayesParforPyDMLTest
Running org.apache.sysml.test.integration.applications.dml.NaiveBayesDMLTest
Tests run: 6, Failures: 0, Errors: 0, Skipped: 0, Time elapsed: 81.23 sec - in org.apache.sysml.test.integration.applications.dml.NaiveBayesDMLTest
Running org.apache.sysml.test.integration.applications.dml.MDABivariateStatsDMLTest
Tests run: 4, Failures: 0, Errors: 0, Skipped: 0, Time elapsed: 296.185 sec - in org.apache.sysml.test.integration.applications.dml.MDABivariateStatsDMLTest
Running org.apache.sysml.test.integration.applications.dml.PageRankDMLTest
Tests run: 3, Failures: 0, Errors: 0, Skipped: 0, Time elapsed: 8.259 sec - in org.apache.sysml.test.integration.applications.dml.PageRankDMLTest
Running org.apache.sysml.test.integration.applications.pydml.GLMPyDMLTest
Tests run: 30, Failures: 0, Errors: 0, Skipped: 0, Time elapsed: 589.14 sec - in org.apache.sysml.test.integration.applications.pydml.GLMPyDMLTest
Running org.apache.sysml.test.integration.applications.pydml.MultiClassSVMPyDMLTest
Tests run: 9, Failures: 0, Errors: 0, Skipped: 0, Time elapsed: 88.516 sec - in org.apache.sysml.test.integration.applications.pydml.MultiClassSVMPyDMLTest
Running org.apache.sysml.test.integration.applications.dml.ID3DMLTest
Tests run: 2, Failures: 0, Errors: 0, Skipped: 0, Time elapsed: 401.588 sec - in org.apache.sysml.test.integration.applications.dml.ID3DMLTest
Running org.apache.sysml.test.integration.applications.dml.GLMDMLTest
Tests run: 30, Failures: 0, Errors: 0, Skipped: 0, Time elapsed: 872.796 sec - in org.apache.sysml.test.integration.applications.dml.GLMDMLTest
Running org.apache.sysml.test.integration.applications.pydml.CsplineCGPyDMLTest
Tests run: 3, Failures: 0, Errors: 0, Skipped: 0, Time elapsed: 6.078 sec - in org.apache.sysml.test.integration.applications.pydml.CsplineCGPyDMLTest
Running org.apache.sysml.test.integration.applications.pydml.WelchTPyDMLTest
Tests run: 3, Failures: 0, Errors: 0, Skipped: 0, Time elapsed: 6.371 sec - in org.apache.sysml.test.integration.applications.pydml.WelchTPyDMLTest
Running org.apache.sysml.test.integration.applications.dml.MultiClassSVMDMLTest
Tests run: 9, Failures: 0, Errors: 0, Skipped: 0, Time elapsed: 89.136 sec - in org.apache.sysml.test.integration.applications.dml.MultiClassSVMDMLTest
Running org.apache.sysml.test.integration.applications.dml.CsplineDSDMLTest
Tests run: 3, Failures: 0, Errors: 0, Skipped: 0, Time elapsed: 14.139 sec - in org.apache.sysml.test.integration.applications.dml.CsplineDSDMLTest
Running org.apache.sysml.test.integration.applications.pydml.ApplyTransformPyDMLTest
Tests run: 7, Failures: 0, Errors: 0, Skipped: 0, Time elapsed: 0.843 sec - in org.apache.sysml.test.integration.applications.pydml.ApplyTransformPyDMLTest
Running org.apache.sysml.test.integration.applications.dml.NaiveBayesParforDMLTest
Tests run: 6, Failures: 0, Errors: 0, Skipped: 0, Time elapsed: 81.347 sec - in org.apache.sysml.test.integration.applications.dml.NaiveBayesParforDMLTest
Running org.apache.sysml.test.integration.applications.pydml.L2SVMPyDMLTest
Tests run: 9, Failures: 0, Errors: 0, Skipped: 0, Time elapsed: 63.588 sec - in org.apache.sysml.test.integration.applications.pydml.L2SVMPyDMLTest
Running org.apache.sysml.test.integration.applications.pydml.LinearRegressionPyDMLTest
Tests run: 7, Failures: 0, Errors: 0, Skipped: 0, Time elapsed: 50.883 sec - in org.apache.sysml.test.integration.applications.pydml.LinearRegressionPyDMLTest
Running org.apache.sysml.test.integration.applications.dml.LinearLogRegDMLTest
Tests run: 7, Failures: 0, Errors: 0, Skipped: 0, Time elapsed: 60.684 sec - in org.apache.sysml.test.integration.applications.dml.LinearLogRegDMLTest
Running org.apache.sysml.test.integration.applications.dml.GNMFDMLTest
Tests run: 3, Failures: 0, Errors: 0, Skipped: 0, Time elapsed: 62.383 sec - in org.apache.sysml.test.integration.applications.dml.GNMFDMLTest
Running org.apache.sysml.test.integration.applications.dml.WelchTDMLTest
Tests run: 3, Failures: 0, Errors: 0, Skipped: 0, Time elapsed: 6.338 sec - in org.apache.sysml.test.integration.applications.dml.WelchTDMLTest
Running org.apache.sysml.test.integration.applications.dml.ApplyTransformDMLTest
Tests run: 7, Failures: 0, Errors: 0, Skipped: 0, Time elapsed: 11.047 sec - in org.apache.sysml.test.integration.applications.dml.ApplyTransformDMLTest
Running org.apache.sysml.test.integration.applications.pydml.ID3PyDMLTest
Tests run: 2, Failures: 0, Errors: 0, Skipped: 0, Time elapsed: 375.651 sec - in org.apache.sysml.test.integration.applications.pydml.ID3PyDMLTest
Running org.apache.sysml.test.integration.applications.pydml.GNMFPyDMLTest
Tests run: 3, Failures: 0, Errors: 0, Skipped: 0, Time elapsed: 56.407 sec - in org.apache.sysml.test.integration.applications.pydml.GNMFPyDMLTest

Results :

Failed tests: 
  LinearLogRegPyDMLTest.testLinearLogRegPyDml:38->LinearLogRegTest.testLinearLogReg:109->AutomatedTestBase.runTest:1269
failed to run script ./src/test/scripts/applications/linearLogReg/LinearLogReg.dml
exception: org.apache.sysml.api.DMLException: org.apache.sysml.runtime.DMLRuntimeException:
org.apache.sysml.runtime.DMLRuntimeException: ERROR: Runtime error in program block generated
from statement block between lines 33 and 0 -- Error evaluating instruction: CP°ba+*°_mVar4160261·MATRIX·DOUBLE°_mVar4160262·MATRIX·DOUBLE°_mVar4160263·MATRIX·DOUBLE°24
message: org.apache.sysml.runtime.DMLRuntimeException: org.apache.sysml.runtime.DMLRuntimeException:
ERROR: Runtime error in program block generated from statement block between lines 33 and
0 -- Error evaluating instruction: CP°ba+*°_mVar4160261·MATRIX·DOUBLE°_mVar4160262·MATRIX·DOUBLE°_mVar4160263·MATRIX·DOUBLE°24
stack trace:
>org.apache.sysml.api.DMLScript.executeScript(DMLScript.java:365)
>org.apache.sysml.api.DMLScript.main(DMLScript.java:212)
>org.apache.sysml.test.integration.AutomatedTestBase.runTest(AutomatedTestBase.java:1249)
>org.apache.sysml.test.integration.applications.LinearLogRegTest.testLinearLogReg(LinearLogRegTest.java:109)
>org.apache.sysml.test.integration.applications.pydml.LinearLogRegPyDMLTest.testLinearLogRegPyDml(LinearLogRegPyDMLTest.java:38)
>sun.reflect.NativeMethodAccessorImpl.invoke0(Native Method)
>sun.reflect.NativeMethodAccessorImpl.invoke(NativeMethodAccessorImpl.java:62)
>sun.reflect.DelegatingMethodAccessorImpl.invoke(DelegatingMethodAccessorImpl.java:43)
>java.lang.reflect.Method.invoke(Method.java:497)
>org.junit.runners.model.FrameworkMethod$1.runReflectiveCall(FrameworkMethod.java:47)
>org.junit.internal.runners.model.ReflectiveCallable.run(ReflectiveCallable.java:12)
>org.junit.runners.model.FrameworkMethod.invokeExplosively(FrameworkMethod.java:44)
>org.junit.internal.runners.statements.InvokeMethod.evaluate(InvokeMethod.java:17)
>org.junit.internal.runners.statements.RunBefores.evaluate(RunBefores.java:26)
>org.junit.internal.runners.statements.RunAfters.evaluate(RunAfters.java:27)
>org.junit.runners.ParentRunner.runLeaf(ParentRunner.java:271)
>org.junit.runners.BlockJUnit4ClassRunner.runChild(BlockJUnit4ClassRunner.java:70)
>org.junit.runners.BlockJUnit4ClassRunner.runChild(BlockJUnit4ClassRunner.java:50)
>org.junit.runners.ParentRunner$3.run(ParentRunner.java:238)
>org.apache.maven.surefire.junitcore.pc.Scheduler$1.run(Scheduler.java:318)
>org.apache.maven.surefire.junitcore.pc.InvokerStrategy.schedule(InvokerStrategy.java:41)
>org.apache.maven.surefire.junitcore.pc.Scheduler.schedule(Scheduler.java:274)
>org.junit.runners.ParentRunner.runChildren(ParentRunner.java:236)
>org.junit.runners.ParentRunner.access$000(ParentRunner.java:53)
>org.junit.runners.ParentRunner$2.evaluate(ParentRunner.java:229)
>org.junit.runners.ParentRunner.run(ParentRunner.java:309)
>org.junit.runners.Suite.runChild(Suite.java:127)
>org.junit.runners.Suite.runChild(Suite.java:26)
>org.junit.runners.ParentRunner$3.run(ParentRunner.java:238)
>org.apache.maven.surefire.junitcore.pc.Scheduler$1.run(Scheduler.java:318)
>org.apache.maven.surefire.junitcore.pc.InvokerStrategy.schedule(InvokerStrategy.java:41)
>org.apache.maven.surefire.junitcore.pc.Scheduler.schedule(Scheduler.java:274)
>org.junit.runners.ParentRunner.runChildren(ParentRunner.java:236)
>org.junit.runners.ParentRunner.access$000(ParentRunner.java:53)
>org.junit.runners.ParentRunner$2.evaluate(ParentRunner.java:229)
>org.junit.runners.ParentRunner.run(ParentRunner.java:309)
>org.junit.runners.Suite.runChild(Suite.java:127)
>org.junit.runners.Suite.runChild(Suite.java:26)
>org.junit.runners.ParentRunner$3.run(ParentRunner.java:238)
>org.apache.maven.surefire.junitcore.pc.Scheduler$1.run(Scheduler.java:318)
>org.apache.maven.surefire.junitcore.pc.InvokerStrategy.schedule(InvokerStrategy.java:41)
>org.apache.maven.surefire.junitcore.pc.Scheduler.schedule(Scheduler.java:274)
>org.junit.runners.ParentRunner.runChildren(ParentRunner.java:236)
>org.junit.runners.ParentRunner.access$000(ParentRunner.java:53)
>org.junit.runners.ParentRunner$2.evaluate(ParentRunner.java:229)
>org.junit.runners.ParentRunner.run(ParentRunner.java:309)
>org.junit.runners.Suite.runChild(Suite.java:127)
>org.junit.runners.Suite.runChild(Suite.java:26)
>org.junit.runners.ParentRunner$3.run(ParentRunner.java:238)
>org.apache.maven.surefire.junitcore.pc.Scheduler$1.run(Scheduler.java:318)
>java.util.concurrent.Executors$RunnableAdapter.call(Executors.java:511)
>java.util.concurrent.FutureTask.run(FutureTask.java:266)
>java.util.concurrent.ThreadPoolExecutor.runWorker(ThreadPoolExecutor.java:1142)
>java.util.concurrent.ThreadPoolExecutor$Worker.run(ThreadPoolExecutor.java:617)
>java.lang.Thread.run(Thread.java:745)

Tests run: 6798, Failures: 1, Errors: 0, Skipped: 0

[INFO] 
[INFO] --- maven-failsafe-plugin:2.17:verify (default) @ systemml ---
[INFO] Failsafe report directory: <https://sparktc.ibmcloud.com/jenkins/job/SystemML-DailyTest/ws/target/failsafe-reports>
[INFO] ------------------------------------------------------------------------
[INFO] BUILD FAILURE
[INFO] ------------------------------------------------------------------------
[INFO] Total time: 02:25 h
[INFO] Finished at: 2017-03-30T04:57:25-05:00
[INFO] Final Memory: 63M/2292M
[INFO] ------------------------------------------------------------------------
[ERROR] Failed to execute goal org.apache.maven.plugins:maven-failsafe-plugin:2.17:verify
(default) on project systemml: There are test failures.
[ERROR] 
[ERROR] Please refer to <https://sparktc.ibmcloud.com/jenkins/job/SystemML-DailyTest/ws/target/failsafe-reports>
for the individual test results.
[ERROR] -> [Help 1]
[ERROR] 
[ERROR] To see the full stack trace of the errors, re-run Maven with the -e switch.
[ERROR] Re-run Maven using the -X switch to enable full debug logging.
[ERROR] 
[ERROR] For more information about the errors and possible solutions, please read the following
articles:
[ERROR] [Help 1] http://cwiki.apache.org/confluence/display/MAVEN/MojoFailureException
Build step 'Execute shell' marked build as failure
Run condition [Always] enabling perform for step [[]]

Mime
View raw message