systemml-dev mailing list archives

Site index · List index
Message view « Date » · « Thread »
Top « Date » · « Thread »
From jenk...@spark.tc
Subject Build failed in Jenkins: SystemML-DailyTest #870
Date Thu, 16 Mar 2017 09:56:53 GMT
See <https://sparktc.ibmcloud.com/jenkins/job/SystemML-DailyTest/870/changes>

Changes:

[Matthias Boehm] [SYSTEMML-1402] Fix reset number of compiled mr/spark inst (w/ offset)

[Nakul Jindal] [HOTFIX] Disabling GPU fused relu & maxpooling operator because of bug

------------------------------------------
[...truncated 13458 lines...]

testAppendChainMatrixDenseSP(org.apache.sysml.test.integration.functions.append.AppendChainTest)
 Time elapsed: 17.555 sec  <<< FAILURE!
java.lang.AssertionError: Limit of MR jobs is exceeded: expected: 1, occurred: 9
	at org.junit.Assert.fail(Assert.java:88)
	at org.apache.sysml.test.integration.AutomatedTestBase.runTest(AutomatedTestBase.java:1253)
	at org.apache.sysml.test.integration.functions.append.AppendChainTest.commonAppendTest(AppendChainTest.java:178)
	at org.apache.sysml.test.integration.functions.append.AppendChainTest.testAppendChainMatrixDenseSP(AppendChainTest.java:81)

Running org.apache.sysml.test.integration.functions.append.AppendMatrixTest
Tests run: 22, Failures: 12, Errors: 0, Skipped: 0, Time elapsed: 867.22 sec <<<
FAILURE! - in org.apache.sysml.test.integration.functions.append.AppendMatrixTest
testMapAppendInBlock2DenseSP(org.apache.sysml.test.integration.functions.append.AppendMatrixTest)
 Time elapsed: 23.116 sec  <<< FAILURE!
java.lang.AssertionError: Limit of MR jobs is exceeded: expected: 1, occurred: 6
	at org.junit.Assert.fail(Assert.java:88)
	at org.apache.sysml.test.integration.AutomatedTestBase.runTest(AutomatedTestBase.java:1253)
	at org.apache.sysml.test.integration.functions.append.AppendMatrixTest.commonAppendTest(AppendMatrixTest.java:259)
	at org.apache.sysml.test.integration.functions.append.AppendMatrixTest.testMapAppendInBlock2DenseSP(AppendMatrixTest.java:100)

testAppendInBlock1SparseSP(org.apache.sysml.test.integration.functions.append.AppendMatrixTest)
 Time elapsed: 3.17 sec  <<< FAILURE!
java.lang.AssertionError: Limit of MR jobs is exceeded: expected: 1, occurred: 6
	at org.junit.Assert.fail(Assert.java:88)
	at org.apache.sysml.test.integration.AutomatedTestBase.runTest(AutomatedTestBase.java:1253)
	at org.apache.sysml.test.integration.functions.append.AppendMatrixTest.commonAppendTest(AppendMatrixTest.java:259)
	at org.apache.sysml.test.integration.functions.append.AppendMatrixTest.testAppendInBlock1SparseSP(AppendMatrixTest.java:94)

testAppendOutBlock2DenseSP(org.apache.sysml.test.integration.functions.append.AppendMatrixTest)
 Time elapsed: 22.146 sec  <<< FAILURE!
java.lang.AssertionError: Limit of MR jobs is exceeded: expected: 1, occurred: 6
	at org.junit.Assert.fail(Assert.java:88)
	at org.apache.sysml.test.integration.AutomatedTestBase.runTest(AutomatedTestBase.java:1253)
	at org.apache.sysml.test.integration.functions.append.AppendMatrixTest.commonAppendTest(AppendMatrixTest.java:259)
	at org.apache.sysml.test.integration.functions.append.AppendMatrixTest.testAppendOutBlock2DenseSP(AppendMatrixTest.java:140)

testAppendInBlock2DenseSP(org.apache.sysml.test.integration.functions.append.AppendMatrixTest)
 Time elapsed: 8.799 sec  <<< FAILURE!
java.lang.AssertionError: Limit of MR jobs is exceeded: expected: 1, occurred: 6
	at org.junit.Assert.fail(Assert.java:88)
	at org.apache.sysml.test.integration.AutomatedTestBase.runTest(AutomatedTestBase.java:1253)
	at org.apache.sysml.test.integration.functions.append.AppendMatrixTest.commonAppendTest(AppendMatrixTest.java:259)
	at org.apache.sysml.test.integration.functions.append.AppendMatrixTest.testAppendInBlock2DenseSP(AppendMatrixTest.java:130)

testMapAppendOutBlock2DenseSP(org.apache.sysml.test.integration.functions.append.AppendMatrixTest)
 Time elapsed: 14.96 sec  <<< FAILURE!
java.lang.AssertionError: Limit of MR jobs is exceeded: expected: 1, occurred: 6
	at org.junit.Assert.fail(Assert.java:88)
	at org.apache.sysml.test.integration.AutomatedTestBase.runTest(AutomatedTestBase.java:1253)
	at org.apache.sysml.test.integration.functions.append.AppendMatrixTest.commonAppendTest(AppendMatrixTest.java:259)
	at org.apache.sysml.test.integration.functions.append.AppendMatrixTest.testMapAppendOutBlock2DenseSP(AppendMatrixTest.java:110)

testAppendOutBlock2SparseSP(org.apache.sysml.test.integration.functions.append.AppendMatrixTest)
 Time elapsed: 16.851 sec  <<< FAILURE!
java.lang.AssertionError: Limit of MR jobs is exceeded: expected: 1, occurred: 6
	at org.junit.Assert.fail(Assert.java:88)
	at org.apache.sysml.test.integration.AutomatedTestBase.runTest(AutomatedTestBase.java:1253)
	at org.apache.sysml.test.integration.functions.append.AppendMatrixTest.commonAppendTest(AppendMatrixTest.java:259)
	at org.apache.sysml.test.integration.functions.append.AppendMatrixTest.testAppendOutBlock2SparseSP(AppendMatrixTest.java:145)

testAppendInBlock2SparseSP(org.apache.sysml.test.integration.functions.append.AppendMatrixTest)
 Time elapsed: 9.097 sec  <<< FAILURE!
java.lang.AssertionError: Limit of MR jobs is exceeded: expected: 1, occurred: 6
	at org.junit.Assert.fail(Assert.java:88)
	at org.apache.sysml.test.integration.AutomatedTestBase.runTest(AutomatedTestBase.java:1253)
	at org.apache.sysml.test.integration.functions.append.AppendMatrixTest.commonAppendTest(AppendMatrixTest.java:259)
	at org.apache.sysml.test.integration.functions.append.AppendMatrixTest.testAppendInBlock2SparseSP(AppendMatrixTest.java:135)

testAppendOutBlock1DenseSP(org.apache.sysml.test.integration.functions.append.AppendMatrixTest)
 Time elapsed: 17.901 sec  <<< FAILURE!
java.lang.AssertionError: Limit of MR jobs is exceeded: expected: 1, occurred: 6
	at org.junit.Assert.fail(Assert.java:88)
	at org.apache.sysml.test.integration.AutomatedTestBase.runTest(AutomatedTestBase.java:1253)
	at org.apache.sysml.test.integration.functions.append.AppendMatrixTest.commonAppendTest(AppendMatrixTest.java:259)
	at org.apache.sysml.test.integration.functions.append.AppendMatrixTest.testAppendOutBlock1DenseSP(AppendMatrixTest.java:120)

testMapAppendInBlock2SparseSP(org.apache.sysml.test.integration.functions.append.AppendMatrixTest)
 Time elapsed: 1 sec  <<< FAILURE!
java.lang.AssertionError: Limit of MR jobs is exceeded: expected: 1, occurred: 6
	at org.junit.Assert.fail(Assert.java:88)
	at org.apache.sysml.test.integration.AutomatedTestBase.runTest(AutomatedTestBase.java:1253)
	at org.apache.sysml.test.integration.functions.append.AppendMatrixTest.commonAppendTest(AppendMatrixTest.java:259)
	at org.apache.sysml.test.integration.functions.append.AppendMatrixTest.testMapAppendInBlock2SparseSP(AppendMatrixTest.java:105)

testMapAppendOutBlock2SparseSP(org.apache.sysml.test.integration.functions.append.AppendMatrixTest)
 Time elapsed: 6.739 sec  <<< FAILURE!
java.lang.AssertionError: Limit of MR jobs is exceeded: expected: 1, occurred: 6
	at org.junit.Assert.fail(Assert.java:88)
	at org.apache.sysml.test.integration.AutomatedTestBase.runTest(AutomatedTestBase.java:1253)
	at org.apache.sysml.test.integration.functions.append.AppendMatrixTest.commonAppendTest(AppendMatrixTest.java:259)
	at org.apache.sysml.test.integration.functions.append.AppendMatrixTest.testMapAppendOutBlock2SparseSP(AppendMatrixTest.java:115)

testAppendOutBlock1SparseSP(org.apache.sysml.test.integration.functions.append.AppendMatrixTest)
 Time elapsed: 12.216 sec  <<< FAILURE!
java.lang.AssertionError: Limit of MR jobs is exceeded: expected: 1, occurred: 6
	at org.junit.Assert.fail(Assert.java:88)
	at org.apache.sysml.test.integration.AutomatedTestBase.runTest(AutomatedTestBase.java:1253)
	at org.apache.sysml.test.integration.functions.append.AppendMatrixTest.commonAppendTest(AppendMatrixTest.java:259)
	at org.apache.sysml.test.integration.functions.append.AppendMatrixTest.testAppendOutBlock1SparseSP(AppendMatrixTest.java:125)

testAppendInBlock1DenseSP(org.apache.sysml.test.integration.functions.append.AppendMatrixTest)
 Time elapsed: 2.877 sec  <<< FAILURE!
java.lang.AssertionError: Limit of MR jobs is exceeded: expected: 1, occurred: 6
	at org.junit.Assert.fail(Assert.java:88)
	at org.apache.sysml.test.integration.AutomatedTestBase.runTest(AutomatedTestBase.java:1253)
	at org.apache.sysml.test.integration.functions.append.AppendMatrixTest.commonAppendTest(AppendMatrixTest.java:259)
	at org.apache.sysml.test.integration.functions.append.AppendMatrixTest.testAppendInBlock1DenseSP(AppendMatrixTest.java:89)

Running org.apache.sysml.test.integration.applications.descriptivestats.UnivariateWeightedScaleDenseTest
Tests run: 24, Failures: 0, Errors: 0, Skipped: 0, Time elapsed: 359.575 sec - in org.apache.sysml.test.integration.applications.descriptivestats.UnivariateWeightedScaleDenseTest
Running org.apache.sysml.test.integration.applications.parfor.ParForNaiveBayesTest
Tests run: 10, Failures: 0, Errors: 0, Skipped: 0, Time elapsed: 514.845 sec - in org.apache.sysml.test.integration.applications.parfor.ParForNaiveBayesTest
Running org.apache.sysml.test.integration.applications.descriptivestats.UnivariateUnweightedScaleSparseTest
Tests run: 24, Failures: 0, Errors: 0, Skipped: 0, Time elapsed: 282 sec - in org.apache.sysml.test.integration.applications.descriptivestats.UnivariateUnweightedScaleSparseTest
Running org.apache.sysml.test.integration.applications.dml.HITSDMLTest
Tests run: 1, Failures: 0, Errors: 0, Skipped: 0, Time elapsed: 85.961 sec - in org.apache.sysml.test.integration.applications.dml.HITSDMLTest
Running org.apache.sysml.test.integration.applications.descriptivestats.UnivariateWeightedScaleSparseTest
Tests run: 24, Failures: 0, Errors: 0, Skipped: 0, Time elapsed: 350.029 sec - in org.apache.sysml.test.integration.applications.descriptivestats.UnivariateWeightedScaleSparseTest
Running org.apache.sysml.test.integration.applications.pydml.ArimaPyDMLTest
Tests run: 1, Failures: 0, Errors: 0, Skipped: 0, Time elapsed: 50.15 sec - in org.apache.sysml.test.integration.applications.pydml.ArimaPyDMLTest
Running org.apache.sysml.test.integration.applications.pydml.HITSPyDMLTest
Tests run: 1, Failures: 0, Errors: 0, Skipped: 0, Time elapsed: 78.953 sec - in org.apache.sysml.test.integration.applications.pydml.HITSPyDMLTest
Running org.apache.sysml.test.integration.applications.dml.LinearRegressionDMLTest
Tests run: 7, Failures: 0, Errors: 0, Skipped: 0, Time elapsed: 51.474 sec - in org.apache.sysml.test.integration.applications.dml.LinearRegressionDMLTest
Running org.apache.sysml.test.integration.applications.pydml.CsplineDSPyDMLTest
Tests run: 3, Failures: 0, Errors: 0, Skipped: 0, Time elapsed: 6.65 sec - in org.apache.sysml.test.integration.applications.pydml.CsplineDSPyDMLTest
Running org.apache.sysml.test.integration.applications.pydml.LinearLogRegPyDMLTest
Tests run: 7, Failures: 0, Errors: 0, Skipped: 0, Time elapsed: 84.605 sec - in org.apache.sysml.test.integration.applications.pydml.LinearLogRegPyDMLTest
Running org.apache.sysml.test.integration.applications.pydml.NaiveBayesPyDMLTest
Tests run: 6, Failures: 0, Errors: 0, Skipped: 0, Time elapsed: 80.537 sec - in org.apache.sysml.test.integration.applications.pydml.NaiveBayesPyDMLTest
Running org.apache.sysml.test.integration.applications.dml.CsplineCGDMLTest
Tests run: 3, Failures: 0, Errors: 0, Skipped: 0, Time elapsed: 11.476 sec - in org.apache.sysml.test.integration.applications.dml.CsplineCGDMLTest
Running org.apache.sysml.test.integration.applications.dml.L2SVMDMLTest
Tests run: 9, Failures: 0, Errors: 0, Skipped: 0, Time elapsed: 64.517 sec - in org.apache.sysml.test.integration.applications.dml.L2SVMDMLTest
Running org.apache.sysml.test.integration.applications.pydml.MDABivariateStatsPyDMLTest
Tests run: 4, Failures: 0, Errors: 0, Skipped: 0, Time elapsed: 292.461 sec - in org.apache.sysml.test.integration.applications.pydml.MDABivariateStatsPyDMLTest
Running org.apache.sysml.test.integration.applications.pydml.PageRankPyDMLTest
Tests run: 3, Failures: 0, Errors: 0, Skipped: 0, Time elapsed: 8.875 sec - in org.apache.sysml.test.integration.applications.pydml.PageRankPyDMLTest
Running org.apache.sysml.test.integration.applications.pydml.NaiveBayesParforPyDMLTest
Tests run: 6, Failures: 0, Errors: 0, Skipped: 0, Time elapsed: 80.978 sec - in org.apache.sysml.test.integration.applications.pydml.NaiveBayesParforPyDMLTest
Running org.apache.sysml.test.integration.applications.dml.NaiveBayesDMLTest
Tests run: 6, Failures: 0, Errors: 0, Skipped: 0, Time elapsed: 81.232 sec - in org.apache.sysml.test.integration.applications.dml.NaiveBayesDMLTest
Running org.apache.sysml.test.integration.applications.dml.MDABivariateStatsDMLTest
Tests run: 4, Failures: 0, Errors: 0, Skipped: 0, Time elapsed: 294.146 sec - in org.apache.sysml.test.integration.applications.dml.MDABivariateStatsDMLTest
Running org.apache.sysml.test.integration.applications.dml.PageRankDMLTest
Tests run: 3, Failures: 0, Errors: 0, Skipped: 0, Time elapsed: 8.882 sec - in org.apache.sysml.test.integration.applications.dml.PageRankDMLTest
Running org.apache.sysml.test.integration.applications.pydml.GLMPyDMLTest
Tests run: 30, Failures: 0, Errors: 0, Skipped: 0, Time elapsed: 583.507 sec - in org.apache.sysml.test.integration.applications.pydml.GLMPyDMLTest
Running org.apache.sysml.test.integration.applications.pydml.MultiClassSVMPyDMLTest
Tests run: 9, Failures: 0, Errors: 0, Skipped: 0, Time elapsed: 88.317 sec - in org.apache.sysml.test.integration.applications.pydml.MultiClassSVMPyDMLTest
Running org.apache.sysml.test.integration.applications.dml.ID3DMLTest
Tests run: 2, Failures: 0, Errors: 0, Skipped: 0, Time elapsed: 386.741 sec - in org.apache.sysml.test.integration.applications.dml.ID3DMLTest
Running org.apache.sysml.test.integration.applications.dml.GLMDMLTest
Tests run: 30, Failures: 0, Errors: 0, Skipped: 0, Time elapsed: 865.987 sec - in org.apache.sysml.test.integration.applications.dml.GLMDMLTest
Running org.apache.sysml.test.integration.applications.pydml.CsplineCGPyDMLTest
Tests run: 3, Failures: 0, Errors: 0, Skipped: 0, Time elapsed: 6.03 sec - in org.apache.sysml.test.integration.applications.pydml.CsplineCGPyDMLTest
Running org.apache.sysml.test.integration.applications.pydml.WelchTPyDMLTest
Tests run: 3, Failures: 0, Errors: 0, Skipped: 0, Time elapsed: 6.383 sec - in org.apache.sysml.test.integration.applications.pydml.WelchTPyDMLTest
Running org.apache.sysml.test.integration.applications.dml.MultiClassSVMDMLTest
Tests run: 9, Failures: 0, Errors: 0, Skipped: 0, Time elapsed: 86.855 sec - in org.apache.sysml.test.integration.applications.dml.MultiClassSVMDMLTest
Running org.apache.sysml.test.integration.applications.dml.CsplineDSDMLTest
Tests run: 3, Failures: 0, Errors: 0, Skipped: 0, Time elapsed: 11.282 sec - in org.apache.sysml.test.integration.applications.dml.CsplineDSDMLTest
Running org.apache.sysml.test.integration.applications.pydml.ApplyTransformPyDMLTest
Tests run: 7, Failures: 0, Errors: 0, Skipped: 0, Time elapsed: 0.763 sec - in org.apache.sysml.test.integration.applications.pydml.ApplyTransformPyDMLTest
Running org.apache.sysml.test.integration.applications.dml.NaiveBayesParforDMLTest
Tests run: 6, Failures: 0, Errors: 0, Skipped: 0, Time elapsed: 80.828 sec - in org.apache.sysml.test.integration.applications.dml.NaiveBayesParforDMLTest
Running org.apache.sysml.test.integration.applications.pydml.L2SVMPyDMLTest
Tests run: 9, Failures: 0, Errors: 0, Skipped: 0, Time elapsed: 63.759 sec - in org.apache.sysml.test.integration.applications.pydml.L2SVMPyDMLTest
Running org.apache.sysml.test.integration.applications.pydml.LinearRegressionPyDMLTest
Tests run: 7, Failures: 0, Errors: 0, Skipped: 0, Time elapsed: 51.13 sec - in org.apache.sysml.test.integration.applications.pydml.LinearRegressionPyDMLTest
Running org.apache.sysml.test.integration.applications.dml.LinearLogRegDMLTest
Tests run: 7, Failures: 0, Errors: 0, Skipped: 0, Time elapsed: 61.114 sec - in org.apache.sysml.test.integration.applications.dml.LinearLogRegDMLTest
Running org.apache.sysml.test.integration.applications.dml.GNMFDMLTest
Tests run: 3, Failures: 0, Errors: 0, Skipped: 0, Time elapsed: 61.842 sec - in org.apache.sysml.test.integration.applications.dml.GNMFDMLTest
Running org.apache.sysml.test.integration.applications.dml.WelchTDMLTest
Tests run: 3, Failures: 0, Errors: 0, Skipped: 0, Time elapsed: 6.497 sec - in org.apache.sysml.test.integration.applications.dml.WelchTDMLTest
Running org.apache.sysml.test.integration.applications.dml.ApplyTransformDMLTest
Tests run: 7, Failures: 0, Errors: 0, Skipped: 0, Time elapsed: 10.929 sec - in org.apache.sysml.test.integration.applications.dml.ApplyTransformDMLTest
Running org.apache.sysml.test.integration.applications.pydml.ID3PyDMLTest
Tests run: 2, Failures: 0, Errors: 0, Skipped: 0, Time elapsed: 386.065 sec - in org.apache.sysml.test.integration.applications.pydml.ID3PyDMLTest
Running org.apache.sysml.test.integration.applications.pydml.GNMFPyDMLTest
Tests run: 3, Failures: 0, Errors: 0, Skipped: 0, Time elapsed: 58.269 sec - in org.apache.sysml.test.integration.applications.pydml.GNMFPyDMLTest

Results :

Failed tests: 
  MapMultChainTest.testMapMultChainWeights2NoRewriteSparseSpark:264->runMapMultChainTest:369->AutomatedTestBase.checkNumCompiledMRJobs:1414
Unexpected number of compiled MR jobs. expected:<0> but was:<11>
  MapMultChainTest.testMapMultChainWeightsRewriteSparseSpark:294->runMapMultChainTest:369->AutomatedTestBase.checkNumCompiledMRJobs:1414
Unexpected number of compiled MR jobs. expected:<0> but was:<8>
  MapMultChainTest.testMapMultChainWeightsRewriteDenseSpark:276->runMapMultChainTest:369->AutomatedTestBase.checkNumCompiledMRJobs:1414
Unexpected number of compiled MR jobs. expected:<0> but was:<8>
  MapMultChainTest.testMapMultChainRewriteDenseSpark:270->runMapMultChainTest:369->AutomatedTestBase.checkNumCompiledMRJobs:1414
Unexpected number of compiled MR jobs. expected:<0> but was:<6>
  MapMultChainTest.testMapMultChainWeightsNoRewriteSparseSpark:258->runMapMultChainTest:369->AutomatedTestBase.checkNumCompiledMRJobs:1414
Unexpected number of compiled MR jobs. expected:<0> but was:<11>
  MapMultChainTest.testMapMultChainRewriteSparseSpark:288->runMapMultChainTest:369->AutomatedTestBase.checkNumCompiledMRJobs:1414
Unexpected number of compiled MR jobs. expected:<0> but was:<6>
  MapMultChainTest.testMapMultChainWeightsNoRewriteDenseSpark:240->runMapMultChainTest:369->AutomatedTestBase.checkNumCompiledMRJobs:1414
Unexpected number of compiled MR jobs. expected:<0> but was:<11>
  MapMultChainTest.testMapMultChainWeights2RewriteSparseSpark:300->runMapMultChainTest:369->AutomatedTestBase.checkNumCompiledMRJobs:1414
Unexpected number of compiled MR jobs. expected:<0> but was:<8>
  MapMultChainTest.testMapMultChainWeights2RewriteDenseSpark:282->runMapMultChainTest:369->AutomatedTestBase.checkNumCompiledMRJobs:1414
Unexpected number of compiled MR jobs. expected:<0> but was:<8>
  MapMultChainTest.testMapMultChainNoRewriteDenseSpark:234->runMapMultChainTest:369->AutomatedTestBase.checkNumCompiledMRJobs:1414
Unexpected number of compiled MR jobs. expected:<0> but was:<8>
  MapMultChainTest.testMapMultChainNoRewriteSparseSpark:252->runMapMultChainTest:369->AutomatedTestBase.checkNumCompiledMRJobs:1414
Unexpected number of compiled MR jobs. expected:<0> but was:<8>
  MapMultChainTest.testMapMultChainWeights2NoRewriteDenseSpark:246->runMapMultChainTest:369->AutomatedTestBase.checkNumCompiledMRJobs:1414
Unexpected number of compiled MR jobs. expected:<0> but was:<11>
  LeftIndexingSparseSparseTest.testSparseMapLeftIndexingLeft2AlignedSP:119->runLeftIndexingSparseSparseTest:222->AutomatedTestBase.runTest:1253
Limit of MR jobs is exceeded: expected: 1, occurred: 6
  LeftIndexingSparseSparseTest.testSparseMapLeftIndexingRightAlignedSP:124->runLeftIndexingSparseSparseTest:222->AutomatedTestBase.runTest:1253
Limit of MR jobs is exceeded: expected: 1, occurred: 6
  LeftIndexingSparseSparseTest.testSparseLeftIndexingRight2AlignedSP:102->runLeftIndexingSparseSparseTest:222->AutomatedTestBase.runTest:1253
Limit of MR jobs is exceeded: expected: 1, occurred: 6
  LeftIndexingSparseSparseTest.testSparseMapLeftIndexingLeftAlignedSP:114->runLeftIndexingSparseSparseTest:222->AutomatedTestBase.runTest:1253
Limit of MR jobs is exceeded: expected: 1, occurred: 6
  LeftIndexingSparseSparseTest.testSparseMapLeftIndexingRight2AlignedSP:129->runLeftIndexingSparseSparseTest:222->AutomatedTestBase.runTest:1253
Limit of MR jobs is exceeded: expected: 1, occurred: 6
  LeftIndexingSparseSparseTest.testSparseLeftIndexingLeftAlignedSP:87->runLeftIndexingSparseSparseTest:222->AutomatedTestBase.runTest:1253
Limit of MR jobs is exceeded: expected: 1, occurred: 6
  LeftIndexingSparseSparseTest.testSparseLeftIndexingLeft2AlignedSP:92->runLeftIndexingSparseSparseTest:222->AutomatedTestBase.runTest:1253
Limit of MR jobs is exceeded: expected: 1, occurred: 6
  LeftIndexingSparseSparseTest.testSparseLeftIndexingRightAlignedSP:97->runLeftIndexingSparseSparseTest:222->AutomatedTestBase.runTest:1253
Limit of MR jobs is exceeded: expected: 1, occurred: 6
  LeftIndexingSparseSparseTest.testSparseMapLeftIndexingCenteredSP:134->runLeftIndexingSparseSparseTest:222->AutomatedTestBase.runTest:1253
Limit of MR jobs is exceeded: expected: 1, occurred: 6
  LeftIndexingSparseSparseTest.testSparseLeftIndexingCenteredSP:107->runLeftIndexingSparseSparseTest:222->AutomatedTestBase.runTest:1253
Limit of MR jobs is exceeded: expected: 1, occurred: 6
  LeftIndexingSparseDenseTest.testSparseMapLeftIndexingLeft2AlignedSP:93->runLeftIndexingSparseSparseTest:237->AutomatedTestBase.runTest:1253
Limit of MR jobs is exceeded: expected: 1, occurred: 6
  LeftIndexingSparseDenseTest.testSparseMapLeftIndexingRightAlignedSP:98->runLeftIndexingSparseSparseTest:237->AutomatedTestBase.runTest:1253
Limit of MR jobs is exceeded: expected: 1, occurred: 6
  LeftIndexingSparseDenseTest.testSparseMapLeftIndexingSingleBlockSP:113->runLeftIndexingSparseSparseTest:237->AutomatedTestBase.runTest:1253
Limit of MR jobs is exceeded: expected: 1, occurred: 6
  LeftIndexingSparseDenseTest.testSparseLeftIndexingRight2AlignedSP:134->runLeftIndexingSparseSparseTest:237->AutomatedTestBase.runTest:1253
Limit of MR jobs is exceeded: expected: 1, occurred: 6
  LeftIndexingSparseDenseTest.testSparseMapLeftIndexingLeftAlignedSP:88->runLeftIndexingSparseSparseTest:237->AutomatedTestBase.runTest:1253
Limit of MR jobs is exceeded: expected: 1, occurred: 6
  LeftIndexingSparseDenseTest.testSparseMapLeftIndexingRight2AlignedSP:103->runLeftIndexingSparseSparseTest:237->AutomatedTestBase.runTest:1253
Limit of MR jobs is exceeded: expected: 1, occurred: 6
  LeftIndexingSparseDenseTest.testSparseLeftIndexingSingleBlockSP:144->runLeftIndexingSparseSparseTest:237->AutomatedTestBase.runTest:1253
Limit of MR jobs is exceeded: expected: 1, occurred: 6
  LeftIndexingSparseDenseTest.testSparseLeftIndexingLeftAlignedSP:119->runLeftIndexingSparseSparseTest:237->AutomatedTestBase.runTest:1253
Limit of MR jobs is exceeded: expected: 1, occurred: 6
  LeftIndexingSparseDenseTest.testSparseLeftIndexingLeft2AlignedSP:124->runLeftIndexingSparseSparseTest:237->AutomatedTestBase.runTest:1253
Limit of MR jobs is exceeded: expected: 1, occurred: 6
  LeftIndexingSparseDenseTest.testSparseLeftIndexingRightAlignedSP:129->runLeftIndexingSparseSparseTest:237->AutomatedTestBase.runTest:1253
Limit of MR jobs is exceeded: expected: 1, occurred: 6
  LeftIndexingSparseDenseTest.testSparseMapLeftIndexingCenteredSP:108->runLeftIndexingSparseSparseTest:237->AutomatedTestBase.runTest:1253
Limit of MR jobs is exceeded: expected: 1, occurred: 6
  LeftIndexingSparseDenseTest.testSparseLeftIndexingCenteredSP:139->runLeftIndexingSparseSparseTest:237->AutomatedTestBase.runTest:1253
Limit of MR jobs is exceeded: expected: 1, occurred: 6
  AppendVectorTest.testAppendOutBlockSP:62->commonAppendTest:124->AutomatedTestBase.runTest:1253
Limit of MR jobs is exceeded: expected: 1, occurred: 6
  AppendVectorTest.testAppendInBlockSP:58->commonAppendTest:124->AutomatedTestBase.runTest:1253
Limit of MR jobs is exceeded: expected: 1, occurred: 6
  AppendChainTest.testAppendChainVectorSparseSP:86->commonAppendTest:178->AutomatedTestBase.runTest:1253
Limit of MR jobs is exceeded: expected: 1, occurred: 9
  AppendChainTest.testAppendChainVectorDenseSP:76->commonAppendTest:178->AutomatedTestBase.runTest:1253
Limit of MR jobs is exceeded: expected: 1, occurred: 9
  AppendChainTest.testAppendChainMatrixSparseSP:91->commonAppendTest:178->AutomatedTestBase.runTest:1253
Limit of MR jobs is exceeded: expected: 1, occurred: 9
  AppendChainTest.testAppendChainMatrixDenseSP:81->commonAppendTest:178->AutomatedTestBase.runTest:1253
Limit of MR jobs is exceeded: expected: 1, occurred: 9
  AppendMatrixTest.testMapAppendInBlock2DenseSP:100->commonAppendTest:259->AutomatedTestBase.runTest:1253
Limit of MR jobs is exceeded: expected: 1, occurred: 6
  AppendMatrixTest.testAppendInBlock1SparseSP:94->commonAppendTest:259->AutomatedTestBase.runTest:1253
Limit of MR jobs is exceeded: expected: 1, occurred: 6
  AppendMatrixTest.testAppendOutBlock2DenseSP:140->commonAppendTest:259->AutomatedTestBase.runTest:1253
Limit of MR jobs is exceeded: expected: 1, occurred: 6
  AppendMatrixTest.testAppendInBlock2DenseSP:130->commonAppendTest:259->AutomatedTestBase.runTest:1253
Limit of MR jobs is exceeded: expected: 1, occurred: 6
  AppendMatrixTest.testMapAppendOutBlock2DenseSP:110->commonAppendTest:259->AutomatedTestBase.runTest:1253
Limit of MR jobs is exceeded: expected: 1, occurred: 6
  AppendMatrixTest.testAppendOutBlock2SparseSP:145->commonAppendTest:259->AutomatedTestBase.runTest:1253
Limit of MR jobs is exceeded: expected: 1, occurred: 6
  AppendMatrixTest.testAppendInBlock2SparseSP:135->commonAppendTest:259->AutomatedTestBase.runTest:1253
Limit of MR jobs is exceeded: expected: 1, occurred: 6
  AppendMatrixTest.testAppendOutBlock1DenseSP:120->commonAppendTest:259->AutomatedTestBase.runTest:1253
Limit of MR jobs is exceeded: expected: 1, occurred: 6
  AppendMatrixTest.testMapAppendInBlock2SparseSP:105->commonAppendTest:259->AutomatedTestBase.runTest:1253
Limit of MR jobs is exceeded: expected: 1, occurred: 6
  AppendMatrixTest.testMapAppendOutBlock2SparseSP:115->commonAppendTest:259->AutomatedTestBase.runTest:1253
Limit of MR jobs is exceeded: expected: 1, occurred: 6
  AppendMatrixTest.testAppendOutBlock1SparseSP:125->commonAppendTest:259->AutomatedTestBase.runTest:1253
Limit of MR jobs is exceeded: expected: 1, occurred: 6
  AppendMatrixTest.testAppendInBlock1DenseSP:89->commonAppendTest:259->AutomatedTestBase.runTest:1253
Limit of MR jobs is exceeded: expected: 1, occurred: 6

Tests run: 6741, Failures: 52, Errors: 0, Skipped: 0

[INFO] 
[INFO] --- maven-failsafe-plugin:2.17:verify (default) @ systemml ---
[INFO] Failsafe report directory: <https://sparktc.ibmcloud.com/jenkins/job/SystemML-DailyTest/ws/target/failsafe-reports>
[INFO] ------------------------------------------------------------------------
[INFO] BUILD FAILURE
[INFO] ------------------------------------------------------------------------
[INFO] Total time: 02:24 h
[INFO] Finished at: 2017-03-16T04:56:52-05:00
[INFO] Final Memory: 68M/2350M
[INFO] ------------------------------------------------------------------------
[ERROR] Failed to execute goal org.apache.maven.plugins:maven-failsafe-plugin:2.17:verify
(default) on project systemml: There are test failures.
[ERROR] 
[ERROR] Please refer to <https://sparktc.ibmcloud.com/jenkins/job/SystemML-DailyTest/ws/target/failsafe-reports>
for the individual test results.
[ERROR] -> [Help 1]
[ERROR] 
[ERROR] To see the full stack trace of the errors, re-run Maven with the -e switch.
[ERROR] Re-run Maven using the -X switch to enable full debug logging.
[ERROR] 
[ERROR] For more information about the errors and possible solutions, please read the following
articles:
[ERROR] [Help 1] http://cwiki.apache.org/confluence/display/MAVEN/MojoFailureException
Build step 'Execute shell' marked build as failure
Run condition [Always] enabling perform for step [[]]

Mime
View raw message